{"text_format":"1","workbook":"xlsx","n_sheets":13,"sheets":["Contents","Summary Sheet","Mongolia Mining Scenario","Mongolia Mining Corporate Model","Valuation Sheet","Tornado Diagram","Stock Prices","Cash Waterfall Chart","PF Modelling","Scenario PF Model","Cash Flow Analysis Corp Model","Cap Exp","Fixed and Variable Admin Cost"],"not_rendered":{"charts":9,"images":3,"macros":1,"external_links":0,"defined_names":2,"comments":1,"pivot_tables":0},"unopened":[{"sheet":"Tornado Diagram","index":5,"reason":"not_a_worksheet"},{"sheet":"Cash Waterfall Chart","index":7,"reason":"not_a_worksheet"}],"bounds":{"document_bytes":16777216,"sheet_cells":100000,"rows_first":2000,"rows_last":500,"rows_between":2000,"halvings":0,"cell_chars":16384,"cell_head_chars":4096},"cells_cut":0,"cells_raw":0,"read":"whole","date_system":"1900"}

{"sheet":"Contents","index":0,"n_rows":16,"n_cols":5,"rows_kept":16,"cut":false,"hidden":false,"merged":[]}
[]
[]
[null,null,"Sheet Tab","Description","Author"]
[null,1,"Contents"]
[null,2,"Summary Sheet"]
[null,3,"Mongolia Mining Corporate Model"]
[null,4,"Valuation Sheet"]
[null,5,"Mongolia Mining Scenario"]
[null,6,"Tornado Diagram"]
[null,7,"Stock Prices"]
[null,8,"Cash Waterfall Chart"]
[null,9,"PF Modelling"]
[null,10,"Scenario PF Model"]
[null,11,"Cash Flow Analysis Corp Model"]
[null,12,"Cap Exp"]
[null,13,"Fixed and Variable Admin Cost"]

{"sheet":"Summary Sheet","index":1,"n_rows":31,"n_cols":6,"rows_kept":31,"cut":false,"hidden":false,"merged":[]}
[]
[]
[]
[null,null,null,null,null,"Graph Code"]
[null,"Downside case Coal Price",null,{"$f":"'Mongolia Mining Scenario'!F3","v":74},null,1]
[null,"Discretionalry Cap Exp",null,{"$f":"'Mongolia Mining Scenario'!F4","v":0},null,13]
[null,"Cost of Production",null,{"$f":"'Mongolia Mining Corporate Model'!H149","v":30},null,5]
[null,"Admin Cost to Sales",null,{"$f":"'Mongolia Mining Scenario'!H28","v":0.16},null,7]
[null,"Sales Volume",null,{"$f":"'Mongolia Mining Corporate Model'!H123/10","v":4.2},null,2]
[]
[]
[null,"Valuation using Terminal Growth"]
[]
[null,"PV of Explicit CF",null,{"$f":"'Valuation Sheet'!E30","v":251379.16660117163}]
[null,"Terminal Value Growth",null,{"$f":"'Valuation Sheet'!$E$38","v":866613.85421577387}]
[null,"Enterprise Value",null,{"$f":"SUM(D14:D15)","v":1117993.0208169455}]
[null,"Net Debt",null,{"$f":"'Valuation Sheet'!$E$44","v":619854}]
[null,"Equity Value",null,{"$f":"D16-D17","v":498139.02081694547}]
[]
[]
{"$rows_left_out":12}
{"sheet":"Mongolia Mining Scenario","index":2,"n_rows":48,"n_cols":16,"rows_kept":48,"cut":false,"hidden":false,"merged":[]}
[null,null,null,"Scenario #",null,2]
[]
[null,null,null,"Downside Case Price",null,{"$f":"'Mongolia Mining Corporate Model'!N130","v":74}]
[null,null,null,"Discretionalry Cap Exp",null,{"$f":"K8","v":0}]
[]
[null,null,null,"Sales Volume Code","Price Code","Production to sales ratio","Cost of production ","Admin to Sales","Other Inccome","Maint Cap Exp","Project Cap Exp",null,"Average operating cash flow","Cash flow in 2016","Valuation Growth","Valuation EV/EBITDA"]
[null,null,null,null,null,null,null,16,null,null,null,null,{"$f":"SUMIF('Mongolia Mining Corporate Model'!2:2,FALSE,'Mongolia Mining Corporate Model'!347:347)","v":413516.53068825422},{"$f":"'Mongolia Mining Corporate Model'!P347","v":59845.373003593035},{"$f":"'Valuation Sheet'!E45","v":498139.02081694547},{"$f":"'Valuation Sheet'!E53","v":111700.48943129915}]
[null,null," Base",1,1,1.2,28,0.1,-20,2000,0,1,449453.1424006935,-4120.3318126896629,734098.54406007961,290869.97735478077]
[null,null," Downside Case",2,2,1.4,30,{"$f":"H7/100","v":0.16},-100,500,{"$f":"K8","v":0},2,413516.53068825422,59845.373003593035,498139.02081694547,111700.48943129915]
[null,null," Upside Case",3,3,1.1000000000000001,22,0.08,0,1000,{"$f":"K8","v":0},3,943324.35796274734,28442.843541350332,2818866.5914016296,1732867.0690500159]
[1,null,{"$f":"TRANSPOSE(D6:K6)&C9","v":"Sales Volume Code Downside Case"},{"$f":"IF(D$30=$A11,D$9,D$8)","v":2},{"$f":"IF(E$30=$A11,E$9,E$8)","v":1},1.2,28,0.1,-20,2000,0,4,370163.59588553384,19730.601824772428,441599.99523941102,77057.941786650335]
[2,null,"Price Code Downside Case",{"$f":"IF(D$30=$A12,D$9,D$8)","v":1},2,1.2,28,0.1,-20,2000,0,5,668894.14428492961,19282.441286049361,1529701.9268943258,851301.8273190232]
[3,null,"Production to sales ratio Downside Case",1,1,1.4,28,0.1,-20,2000,0,6,362400.2020367239,-5554.3300610966689,397691.79666838865,58983.911238647415]
[4,null,"Cost of production  Downside Case",1,1,1.2,30,0.1,-20,2000,0,7,412167.30459788634,-4734.9024905783881,589924.22374935495,191490.23473358096]
[5,null,"Admin to Sales Downside Case",1,1,1.2,28,0.16,-20,2000,0,8,400941.60681724991,-474.69405851225019,524478.43057565624,148441.73040464416]
[6,null,"Other Inccome Downside Case",1,1,1.2,28,0.1,-100,2000,0,9,449525.505948306,-4120.3318126896629,734098.54406007961,290869.97735478077]
[7,null,"Maint Cap Exp Downside Case",1,1,1.2,28,0.1,-20,500,0,10,456561.24073701299,-2620.3318126896629,755691.51869361941,296534.91630173137]
[8,null,"Project Cap Exp Downside Case",1,1,1.2,28,0.1,-20,2000,0,11,449453.1424006935,-4120.3318126896629,734098.54406007961,290869.97735478077]
[1,null,{"$f":"TRANSPOSE(D6:K6)&C10","v":"Sales Volume Code Upside Case"},{"$f":"IF(D$30=$A19,D$10,D$8)","v":3},{"$f":"IF(E$30=$A19,E$10,E$8)","v":1},1.2,28,0.1,-20,2000,{"$f":"$K$8","v":0},12,535304.75163587404,29446.51683380529,1050569.1929134033,481386.17336031538]
[2,null,"Price Code Upside Case",{"$f":"IF(D$30=$A20,D$10,D$8)","v":1},3,1.2,28,0.1,-20,2000,{"$f":"$K$8","v":0},13,657366.74769817293,6534.5563271230785,1606390.4073637323,894394.37452128623]
{"$rows_left_out":29}
{"sheet":"Mongolia Mining Corporate Model","index":3,"n_rows":457,"n_cols":20,"rows_kept":457,"cut":false,"hidden":false,"merged":[]}
[null,null,null,null,null,null,null,null,2009,2010,2011,2012,2013,2014,2015,2016,2017,2018,2019,2020]
[null,null,null,"Last historic year",null,null,null,2015,{"$f":"I1<=$H$2","v":true},true,true,true,true,true,true,false,false,false,false,false]
[null,null,null,"Forecast period",null,null,null,2018,{"$f":"AND(I1>$H$3,I1<=$H$3)","v":false},false,false,false,false,false,false,false,false,false,false,false]
[]
["Actual Financial Data"]
[null,null,"Production and Sales"]
[null,null,null,null," Production volume (million tonnes (“Mt”))                        ",null,null,null,1.84,3.93,7.1,9.4,9.6999999999999993,3.387,2.7370000000000001]
[null,null,null,null," Sales volume                           ",null,null,null,1.39,3.92,4.8,5.6,5.7,5.4,1.5]
[null,null,null,null,"                             "]
[null,null,"Profit and Loss"]
[null,null,null,null,"Revenue",null,null,null,66982.703125,277501.59375,542568,474480,437339,328307,99485]
[null,null,null,null,"Cost of revenue",null,null,null,-38682.328125,-164368.046875,-336368,-420400,-361485,-335510,-165604]
[null,null,null,null," Gross profit                           ",null,null,null,28300.37890625,113133.5546875,206200,54080,75854,-7203,-66119]
[null,null,null,null,"Other revenue",null,null,null,70.001998901367188,511.51300048828125,435,1121,592,3319,848]
[null,null,null,null," Other net income                          ",null,null,null,-34.812999725341797,-187.02299499511719,76,5418,7073,34171,-1082]
[null,null,null,null," Administrative expenses                           ",null,null,null,-10427.0927734375,-38685.20703125,-60303,-48183,-52410,-30916,-30520]
[null,null,null,null," General and administrative expenses                         ",null,null,null,0,0,0,0,0,-56445,-8589]
[null,null,null,null,"Impairment loss",null,null,null,0,0,0,0,0,-190000,0]
[null,null,null,null," Profit from operations                          ",null,null,null,17908.474609375,74772.8359375,146408,12436,31109,-247074,-105462]
[null,null,null,null,"Finance income",null,null,null,342.3179931640625,12335.08984375,22236,39561,9551,3911,5084]
{"$rows_left_out":438}
{"sheet":"Valuation Sheet","index":4,"n_rows":71,"n_cols":16,"rows_kept":71,"cut":false,"hidden":false,"merged":[]}
[]
[null,null,"Valuation Dates"]
[]
[null,null,null,"Valuation Year",2015]
[null,null,null,"Terminal Year",2020]
[]
[]
[null,null,"Economic Assumptions"]
[null,null,null,"WACC",0.08]
[null,null,null,"Terminal Growth Rate",0.02]
[null,null,null,"Terminal EV/EBITDA",8]
[]
[null,null,null,"Date","Start","End",null,{"$f":"E4","v":2015},{"$f":"H13+1","v":2016},{"$f":"I13+1","v":2017},2018,2019,2020,2021,2022]
[null,null,null,"Explicit period",{"$f":"E4","v":2015},{"$f":"E5","v":2020},null,{"$f":"AND(H13>=$E$14,H13<=$F$14)","v":true},{"$f":"AND(I13>=$E$14,I13<=$F$14)","v":true},true,true,true,true,false,false]
[null,null,null,"Terminal Value",null,null,null,{"$f":"H13=$F$14","v":false},{"$f":"I13=$F$14","v":false},false,false,false,true,false,false]
[null,null,null,"Column in Model",null,null,null,{"$f":"MATCH(H13,'Mongolia Mining Corporate Model'!$1:$1)","v":15},{"$f":"MATCH(I13,'Mongolia Mining Corporate Model'!$1:$1)","v":16},{"$f":"MATCH(J13,'Mongolia Mining Corporate Model'!$1:$1)","v":17},{"$f":"MATCH(K13,'Mongolia Mining Corporate Model'!$1:$1)","v":18},{"$f":"MATCH(L13,'Mongolia Mining Corporate Model'!$1:$1)","v":19},{"$f":"MATCH(M13,'Mongolia Mining Corporate Model'!$1:$1)","v":20},{"$f":"MATCH(N13,'Mongolia Mining Corporate Model'!$1:$1)","v":20},{"$f":"MATCH(O13,'Mongolia Mining Corporate Model'!$1:$1)","v":20}]
[null,null,null,"Period",null,null,null,1,2,3,4,5,6,7,8]
[null,null,null,"EBIT",null,null,null,{"$f":"INDEX('Mongolia Mining Corporate Model'!$329:$329,'Valuation Sheet'!H16)","v":-105228.00000000001},{"$f":"INDEX('Mongolia Mining Corporate Model'!$329:$329,'Valuation Sheet'!I16)","v":49063.144770946303},{"$f":"INDEX('Mongolia Mining Corporate Model'!$329:$329,'Valuation Sheet'!J16)","v":49468.775838438945},{"$f":"INDEX('Mongolia Mining Corporate Model'!$329:$329,'Valuation Sheet'!K16)","v":53592.996027730696},{"$f":"INDEX('Mongolia Mining Corporate Model'!$329:$329,'Valuation Sheet'!L16)","v":57593.913196112138},{"$f":"INDEX('Mongolia Mining Corporate Model'!$329:$329,'Valuation Sheet'!M16)","v":61482.613465305709},{"$f":"INDEX('Mongolia Mining Corporate Model'!$329:$329,'Valuation Sheet'!N16)","v":61482.613465305709},{"$f":"INDEX('Mongolia Mining Corporate Model'!$329:$329,'Valuation Sheet'!O16)","v":61482.613465305709}]
[]
[null,null,null,"EBITDA",null,null,null,{"$f":"INDEX('Mongolia Mining Corporate Model'!326:326,'Valuation Sheet'!H16)","v":-66049.000000000015},{"$f":"INDEX('Mongolia Mining Corporate Model'!326:326,'Valuation Sheet'!I16)","v":84672},{"$f":"INDEX('Mongolia Mining Corporate Model'!326:326,'Valuation Sheet'!J16)","v":86365.440000000061},{"$f":"INDEX('Mongolia Mining Corporate Model'!326:326,'Valuation Sheet'!K16)","v":88092.74880000003},{"$f":"INDEX('Mongolia Mining Corporate Model'!326:326,'Valuation Sheet'!L16)","v":89854.603776000004},{"$f":"INDEX('Mongolia Mining Corporate Model'!326:326,'Valuation Sheet'!M16)","v":91651.695851520024},{"$f":"INDEX('Mongolia Mining Corporate Model'!326:326,'Valuation Sheet'!N16)","v":91651.695851520024},{"$f":"INDEX('Mongolia Mining Corporate Model'!326:326,'Valuation Sheet'!O16)","v":91651.695851520024}]
{"$rows_left_out":52}
{"sheet":"Stock Prices","index":6,"n_rows":967,"n_cols":15,"rows_kept":967,"cut":false,"hidden":false,"merged":[]}
["Date",null,"Open","High","Low","Close","Volume","Adj Close",null,null,"close","adj close"]
["2011-04-06",{"$f":"YEAR(A2)","v":"1905-07-03"},1.27,1.27,1.27,1.27,100,8.64,null,2011,{"$f":"AVERAGEIF(B:B,J2,F:F)","v":1.051229946524064},{"$f":"AVERAGEIF(B:B,J2,H:H)","v":7.1508021390374283}]
["2011-04-07",{"$f":"YEAR(A3)","v":"1905-07-03"},1.28,1.28,1.28,1.28,1400,8.7100000000000009,null,2012,{"$f":"AVERAGEIF(B:B,J3,F:F)","v":0.66740000000000055},{"$f":"AVERAGEIF(B:B,J3,H:H)","v":4.5401199999999964}]
["2011-04-08","1905-07-03",1.29,1.29,1.29,1.29,100,8.7799999999999994,null,2013,{"$f":"AVERAGEIF(B:B,J4,F:F)","v":0.27456349206349218},{"$f":"AVERAGEIF(B:B,J4,H:H)","v":1.8675396825396819}]
["2011-04-11","1905-07-03",1.31,1.31,1.31,1.31,10600,8.91,null,2014,{"$f":"AVERAGEIF(B:B,J5,F:F)","v":8.6904761904761985E-2},{"$f":"AVERAGEIF(B:B,J5,H:H)","v":0.56607142857142756}]
["2011-04-12","1905-07-03",1.3,1.3,1.3,1.3,200,8.84,null,2015,{"$f":"AVERAGEIF(B:B,J6,F:F)","v":6.3200000000000006E-2},{"$f":"AVERAGEIF(B:B,J6,H:H)","v":6.3200000000000006E-2}]
["2011-04-13","1905-07-03",1.3,1.3,1.3,1.3,100,8.84]
["2011-04-14","1905-07-03",1.3,1.3,1.3,1.3,0,8.84]
["2011-04-15","1905-07-03",1.29,1.29,1.29,1.29,700,8.7799999999999994]
["2011-04-18","1905-07-03",1.27,1.28,1.26,1.28,10300,8.7100000000000009]
["2011-04-19","1905-07-03",1.29,1.29,1.29,1.29,1300,8.7799999999999994]
["2011-04-20","1905-07-03",1.29,1.29,1.29,1.29,0,8.7799999999999994,null,null,null,2011,2012,2013,2014]
["2011-04-21","1905-07-03",1.26,1.26,1.26,1.26,400,8.57,null,"Price per share"]
["2011-04-25","1905-07-03",1.24,1.24,1.24,1.24,1500,8.44,null,"Vlookup",null,{"$f":"VLOOKUP(L12,$J$2:$L$6,2)","v":1.051229946524064},{"$f":"VLOOKUP(M12,$J$2:$L$6,2)","v":0.66740000000000055},{"$f":"VLOOKUP(N12,$J$2:$L$6,2)","v":0.27456349206349218},{"$f":"VLOOKUP(O12,$J$2:$L$6,2)","v":8.6904761904761985E-2}]
["2011-04-26","1905-07-03",1.22,1.22,1.22,1.22,400,8.3000000000000007,null,"Lookup",null,{"$f":"LOOKUP(L12,$J:$J,$K:$K)","v":1.051229946524064},{"$f":"LOOKUP(M12,$J:$J,$K:$K)","v":0.66740000000000055},{"$f":"LOOKUP(N12,$J:$J,$K:$K)","v":0.27456349206349218},{"$f":"LOOKUP(O12,$J:$J,$K:$K)","v":8.6904761904761985E-2}]
["2011-04-27","1905-07-03",1.22,1.22,1.22,1.22,0,8.3000000000000007,null,"Match & Index",null,{"$f":"INDEX($K$2:$K$6,MATCH(L12,$J$2:$J$6))","v":1.051229946524064},{"$f":"INDEX($K$2:$K$6,MATCH(M12,$J$2:$J$6))","v":0.66740000000000055},{"$f":"INDEX($K$2:$K$6,MATCH(N12,$J$2:$J$6))","v":0.27456349206349218},{"$f":"INDEX($K$2:$K$6,MATCH(O12,$J$2:$J$6))","v":8.6904761904761985E-2}]
["2011-04-28","1905-07-03",1.22,1.22,1.22,1.22,2300,8.3000000000000007]
["2011-04-29","1905-07-03",1.21,1.21,1.21,1.21,1500,8.23,null,"Number of shares"]
["2011-05-02","1905-07-03",1.2,1.21,1.2,1.21,1400,8.23,null,"Market Cap"]
["2011-05-03","1905-07-03",1.21,1.21,1.21,1.21,0,8.23]
{"$rows_left_out":948}
{"sheet":"PF Modelling","index":8,"n_rows":160,"n_cols":33,"rows_kept":160,"cut":false,"hidden":false,"merged":[]}
[null,"Time period",null,null,null,null,null,0,{"$f":"H1+1","v":1},{"$f":"I1+1","v":2},3,4,5,6,7,8,9,10,11,12,13,14,15,16,{"$f":"X1+1","v":17},18,19,20,21,22,23,24,25]
[null,null,"Operating period",null,null,"NoYears",{"$f":"F6","v":18},null,{"$f":"I1<=$G$2","v":true},true,true,true,true,true,true,true,true,true,true,true,true,true,true,true,{"$f":"Y1<=$G$2","v":true},true,false,false,false,false,false,false,false]
[]
["Assumptions"]
[null,"Timing assumptions"]
[null,null,"Project life",null,"years",{"$f":"'Scenario PF Model'!D9","v":18}]
[]
[null,"Operating assumptions"]
[null,null,"Capital expenditure",null,"USD",1000]
[]
[null,null,"Revenues"]
[null,null,null,"Price","USD/unit",11,null,"LLCR",{"$f":"G134","v":1.2130543305850054}]
[null,null,null,"Inflation rate","%",{"$f":"'Scenario PF Model'!H9","v":0.04}]
[null,null,null,"Volume","units",{"$f":"'Scenario PF Model'!E9","v":16}]
[]
[null,null,"Operating costs"]
[null,null,null,"Fixed costs","USD",{"$f":"'Scenario PF Model'!G9","v":28}]
[null,null,null,"Variable costs","USD/unit",{"$f":"'Scenario PF Model'!F9","v":4}]
[]
[null,"Taxes and depreciation"]
{"$rows_left_out":141}
{"sheet":"Scenario PF Model","index":9,"n_rows":9,"n_cols":11,"rows_kept":9,"cut":false,"hidden":false,"merged":[]}
[null,null,null,"Loan size",{"$f":"'PF Modelling'!F26","v":700}]
[null,null,null,"Scenario #",3]
[null,null,null,"Price","Qua","Variables","Fixe","Growth",null,"LLCR","PLCR"]
[null,null,null,null,null,null,null,null,null,{"$f":"'PF Modelling'!G134","v":1.2130543305850054},{"$f":"'PF Modelling'!G129","v":2.226023977412281}]
[null,null,"Base",15,15,5,30,0.02,1,0.7776933944210761,1.1266864875916449]
[null,null,"Lo",12,11,6,32,0,2,0.24183143168933996,0.27546915804116612]
[null,null,"High",18,16,4,28,0.04,3,1.2130543305850054,2.226023977412281]
[]
[null,null,{"$f":"INDEX(C5:C7,$E$2)","v":"High"},18,16,4,28,0.04]

{"sheet":"Cash Flow Analysis Corp Model","index":10,"n_rows":43,"n_cols":9,"rows_kept":43,"cut":false,"hidden":false,"merged":[]}
[]
[null,null,"assets",700]
[null,null,"cash",100]
[]
[null,null,"Debt",500]
[null,null,"Equity",300]
[]
[null,null,"EBIT",null,-10,20,100,300,300]
[]
[null,null,"Interest rate assumption",null,0.05,0.05,0.05,0.05,0.05]
[null,null,"Interest income assumptions",null,0.02,0.02,0.02,0.02,0.02]
[null,null,"Minimum cash balance",null,80,80,80,80,80]
[]
[]
[null,null,"Net cash account"]
[null,null,"Opening balance",null,{"$f":"D18","v":-400},{"$f":"E18","v":-433},{"$f":"F18","v":-437.05},{"$f":"G18","v":-361.30250000000001},{"$f":"H18","v":-81.76762500000001}]
[null,null,"Add surplus cash",null,{"$f":"E30","v":-33},{"$f":"F30","v":-4.0500000000000025},{"$f":"G30","v":75.747500000000002},{"$f":"H30","v":279.534875},{"$f":"I30","v":293.51161875000003}]
[null,null,"Closing balance",{"$f":"D3-D5","v":-400},{"$f":"E16+E17","v":-433},{"$f":"F16+F17","v":-437.05},{"$f":"G16+G17","v":-361.30250000000001},{"$f":"H16+H17","v":-81.76762500000001},{"$f":"I16+I17","v":211.74399375000002}]
[]
[null,null,"Cash Balance",{"$f":"D3","v":100},{"$f":"MAX(E18,E12)","v":80},{"$f":"MAX(F18,F12)","v":80},{"$f":"MAX(G18,G12)","v":80},{"$f":"MAX(H18,H12)","v":80},{"$f":"MAX(I18,I12)","v":211.74399375000002}]
{"$rows_left_out":24}
{"sheet":"Cap Exp","index":11,"n_rows":10,"n_cols":23,"rows_kept":10,"cut":false,"hidden":false,"merged":[]}
[]
[]
[]
[]
[]
[]
[]
[]
[null,null,null,null,null,null,null,null,null,null,null,null,null,null,null,null,null,null,null,null,null,null,5.329214035087718]
[null,null,null,null,null,null,null,null,null,null,null,null,null,null,null,null,null,null,null,null,null,null,3.1315999999999997]

{"sheet":"Fixed and Variable Admin Cost","index":12,"n_rows":9,"n_cols":7,"rows_kept":9,"cut":false,"hidden":false,"merged":[]}
[]
[]
[null,null,null,null,null,"Sales","Admin"]
[null,null,null,null,null,{"$f":"TRANSPOSE('Mongolia Mining Corporate Model'!I11:M11)","v":66982.703125},{"$f":"TRANSPOSE('Mongolia Mining Corporate Model'!I153:M153)","v":10427.0927734375}]
[null,null,null,null,null,277501.59375,38685.20703125]
[null,null,null,null,null,542568,60303]
[null,null,null,null,null,474480,48183]
[null,null,null,null,null,437339,52410]
[null,null,null,null,null,{"$error":"#N/A"}]