{"text_format":"1","workbook":"xlsx","n_sheets":14,"sheets":["ROE Analysis","ROIC Analysis","Historic Data","Financial Model","DCF","Transaction Assumptions","LBO Model","Graph Data","Two Items Chart","History an Forecast","Scatter Chart","Tornado Chart","Scenario","Sheet1"],"not_rendered":{"charts":8,"images":0,"macros":1,"external_links":0,"defined_names":1,"comments":1,"pivot_tables":0},"unopened":[{"sheet":"Two Items Chart","index":8,"reason":"not_a_worksheet"},{"sheet":"History an Forecast","index":9,"reason":"not_a_worksheet"},{"sheet":"Scatter Chart","index":10,"reason":"not_a_worksheet"},{"sheet":"Tornado Chart","index":11,"reason":"not_a_worksheet"}],"bounds":{"document_bytes":16777216,"sheet_cells":100000,"rows_first":2000,"rows_last":500,"rows_between":2000,"halvings":0,"cell_chars":16384,"cell_head_chars":4096},"cells_cut":0,"cells_raw":0,"read":"whole","date_system":"1900"}

{"sheet":"ROE Analysis","index":0,"n_rows":25,"n_cols":404,"rows_kept":25,"cut":false,"hidden":false,"merged":[]}
[null,null,null,null,null,null,"For Interpolate"]
["Value Drivers",null,null,"Terminal",null,"ROE Move",1,5,10]
[null,"ROE",null,0.08,null,"Declining",0.32,0.15,0.1]
[null,"GROW RATE",null,0.03,null,"Increaing",0.15,0.2,0.3,null,"Computed P/E",null,{"$f":"D23","v":5.381934484228764}]
[null,"COST OF CAP",null,0.08,null,"Flat",0.08,0.08,0.08,null,"Observed P/E"]
[null,"DPO",null,{"$f":"1-D4/D3","v":0.625},null,1,{"$f":"INDEX(G3:G5,$F$6)","v":0.32},{"$f":"INDEX(H3:H5,$F$6)","v":0.15},{"$f":"INDEX(I3:I5,$F$6)","v":0.1},null,"Difference"]
[null,"BV",null,14.4,null,null,null,null,null,null,"Implied k"]
[]
["Interpolate"]
[null,null,null,null,1,2,3,4,5,6,7,8,9,10,11,12,13,14,15,16,17,18,19,20,21,22,23,24,25,26,27,28,29,30,31,32,33,34,35,36,37,38,39,40,41,42,43,44,45,46,47,48,49,50,51,52,53,54,55,56,57,58,59,60,61,62,63,64,65,66,67,68,69,70,71,72,73,74,75,76,77,78,79,80,81,82,83,84,85,86,87,88,89,90,91,92,93,94,95,96,97,98,99,100,101,102,103,104,105,106,107,108,109,110,111,112,113,114,115,116,117,118,119,120,121,122,123,124,125,126,127,128,129,130,131,132,133,134,135,136,137,138,139,140,141,142,143,144,145,146,147,148,149,150,151,152,153,154,155,156,157,158,159,160,161,162,163,164,165,166,167,168,169,170,171,172,173,174,175,176,177,178,179,180,181,182,183,184,185,186,187,188,189,190,191,192,193,194,195,196,197,198,199,200,201,202,203,204,205,206,207,208,209,210,211,212,213,214,215,216,217,218,219,220,221,222,223,224,225,226,227,228,229,230,231,232,233,234,235,236,237,238,239,240,241,242,243,244,245,246,247,248,249,250,251,252,253,254,255,256,257,258,259,260,261,262,263,264,265,266,267,268,269,270,271,272,273,274,275,276,277,278,279,280,281,282,283,284,285,286,287,288,289,290,291,292,293,294,295,296,297,298,299,300,301,302,303,304,305,306,307,308,309,310,311,312,313,314,315,316,317,318,319,320,321,322,323,324,325,326,327,328,329,330,331,332,333,334,335,336,337,338,339,340,341,342,343,344,345,346,347,348,349,350,351,352,353,354,355,356,357,358,359,360,361,362,363,364,365,366,367,368,369,370,371,372,373,374,375,376,377,378,379,380,381,382,383,384,385,386,387,388,389,390,391,392,393,394,395,396,397,398,399,400]
{"$rows_left_out":16}
{"sheet":"ROIC Analysis","index":1,"n_rows":55,"n_cols":224,"rows_kept":55,"cut":false,"hidden":false,"merged":[]}
[]
["Key Drivers"]
[null,"ROIC",null,null,0.11,null,null,"EV/EBITDA",null,{"$f":"G53","v":10.438421480008584}]
[null,"Growth rate in CAPEX",null,null,{"$f":"DCF!E14","v":0.02},null,null,"EV/NOPAT",null,{"$f":"G54","v":27.19461399650482}]
[null,"WACC",null,null,0.05,null,null,"EV/Invested Capital",null,2.9914075396155302]
[]
[null,"Asset life",null,null,{"$f":"DCF!E21","v":10},"years",null,"Observed EV/EBITDA "]
[null,"Tax rate ",null,null,0]
[null,"Invested Capital",null,null,1000]
[]
{"$rows_left_out":46}
{"sheet":"Historic Data","index":2,"n_rows":173,"n_cols":17,"rows_kept":173,"cut":false,"hidden":false,"merged":[]}
[null,null,2002,2003,2004,2005,2006,2007,2008,2009,2010,2011,2012,2013,2014,2015,2016]
[null,"HIGHLIGHTS"]
[null,"INCOME STATEMENT"]
[null,"Revenue",1395,1653,2363,3583,3854,4861,5904,5079,6920,5836,7216,6084,6910,8423,10237]
[null,"Gross profit",142,150,120,84,461,825,1125,836,1175,725,796,896,1178,1505,2126]
[null,"EBITDA Before Special Items",124,142,64,9,328,579,749,469,747,305,473,610,929,1212,1826]
[null,"EBIT Before Special Items",74,74,-49,-116,201,443,614,251,468,-38,4,211,559,860,1421]
[null,"Implied Depreciation",{"$f":"C6-C7","v":50},{"$f":"D6-D7","v":68},113,125,127,136,135,218,279,343,469,399,370,352,405]
[null,"EBITDA After Special Items",null,null,null,null,null,null,749,469,684,305,299,530,977,1258,1826]
[null,"EBIT After Special Items",null,null,null,null,null,null,614,251,310,-60,-697,102,607,906,1421]
{"$rows_left_out":164}
{"sheet":"Financial Model","index":3,"n_rows":213,"n_cols":29,"rows_kept":213,"cut":false,"hidden":false,"merged":[]}
["Timeline"]
[null,"Year",null,null,null,null,null,null,2005,2006,2007,2008,2009,2010,2011,2012,2013,2014,2015,2016,2017,2018,2019,2020,2021,2022,2023,2024,2025]
[null,"Historic Switch",null,null,null,2016,null,null,{"$f":"I2<=$F$3","v":true},true,true,true,true,true,true,true,true,true,true,true,false,false,false,false,false,false,false,false,false]
[null,"Last Historic Year",null,null,null,{"$f":"'Financial Model'!F3","v":2016},null,null,{"$f":"I2=$F$4","v":false},false,false,false,false,false,false,false,false,false,false,true,false,false,false,false,false,false,false,false,false]
[]
[]
["Historic Profit and Loss"]
[null,"MW Delivered",null,null,null,null,null,null,{"$f":"'Historic Data'!F51","v":3185},{"$f":"'Historic Data'!G51","v":4239},{"$f":"'Historic Data'!H51","v":4502},{"$f":"'Historic Data'!I51","v":6160},{"$f":"'Historic Data'!J51","v":6131},{"$f":"'Historic Data'!K51","v":4057},{"$f":"'Historic Data'!L51","v":5054},{"$f":"'Historic Data'!M51","v":6171},{"$f":"'Historic Data'!N51","v":4513},{"$f":"'Historic Data'!O51","v":6125},{"$f":"'Historic Data'!P51","v":7948},{"$f":"'Historic Data'!Q51","v":9957},{"$f":"'Historic Data'!R51","v":0},{"$f":"'Historic Data'!S51","v":0},{"$f":"'Historic Data'!T51","v":0},{"$f":"'Historic Data'!U51","v":0},{"$f":"'Historic Data'!V51","v":0},{"$f":"'Historic Data'!W51","v":0},{"$f":"'Historic Data'!X51","v":0},{"$f":"'Historic Data'!Y51","v":0},{"$f":"'Historic Data'!Z51","v":0}]
[null,"Revenues",null,null,null,null,null,null,{"$f":"'Historic Data'!F55","v":3582.6},{"$f":"'Historic Data'!G55","v":3854.3},{"$f":"'Historic Data'!H55","v":4861},{"$f":"'Historic Data'!I55","v":6035},{"$f":"'Historic Data'!J55","v":5079},{"$f":"'Historic Data'!K55","v":6920},{"$f":"'Historic Data'!L55","v":5836},{"$f":"'Historic Data'!M55","v":7216},{"$f":"'Historic Data'!N55","v":6084},{"$f":"'Historic Data'!O55","v":6910},{"$f":"'Historic Data'!P55","v":8423},{"$f":"'Historic Data'!Q55","v":10237},{"$f":"'Historic Data'!R55","v":0},{"$f":"'Historic Data'!S55","v":0},{"$f":"'Historic Data'!T55","v":0},{"$f":"'Historic Data'!U55","v":0},{"$f":"'Historic Data'!V55","v":0},{"$f":"'Historic Data'!W55","v":0},{"$f":"'Historic Data'!X55","v":0},{"$f":"'Historic Data'!Y55","v":0},{"$f":"'Historic Data'!Z55","v":0}]
[null,"Average Price per MW",null,null,null,null,null,null,{"$f":"IF(I8,I9/I8)","v":1.1248351648351649},0.90924746402453416,1.0797423367392269,0.97970779220779225,0.82841298320013046,1.7056938624599458,1.1547289275821131,1.1693404634581106,1.3481054730777753,1.1281632653061224,1.0597634625062908,1.0281209199558099,false,false,false,false,false,false,false,false,false]
{"$rows_left_out":204}
{"sheet":"DCF","index":4,"n_rows":81,"n_cols":19,"rows_kept":81,"cut":false,"hidden":false,"merged":[]}
[]
[null,null,null,null,null,null,null,{"$f":"E9","v":2017},{"$f":"H2+1","v":2018},{"$f":"I2+1","v":2019},2020,2021,2022,2023,2024,2025,2026,2027,2028]
[null,"Explicit period",null,null,{"$f":"E10","v":2025},null,null,{"$f":"H2<=$E$3","v":true},{"$f":"I2<=$E$3","v":true},true,true,true,true,true,true,true,false,false,false]
[null,"Terminal period",null,null,{"$f":"E10","v":2025},null,null,{"$f":"H2=$E$4","v":false},{"$f":"I2=$E$4","v":false},false,false,false,false,false,false,true,false,false,false]
[]
[]
["VALUATION ASSUMPTIONS"]
[null,"Timing assumptions"]
[null,null,"Valuation date",null,2017]
[null,null,"Terminal year",null,2025]
{"$rows_left_out":72}
{"sheet":"Transaction Assumptions","index":5,"n_rows":12,"n_cols":3,"rows_kept":12,"cut":false,"hidden":false,"merged":[]}
[]
[]
["Transaction Date"]
[null,"Consideration for Equity"]
[null,null,"Current Share Price"]
[null,null,"Premium"]
[]
[null,null,"Current Earnings"]
[null,null,"Implied P/E Ratio"]
[]
{"$rows_left_out":3}
{"sheet":"LBO Model","index":6,"n_rows":0,"n_cols":0,"rows_kept":0,"cut":false,"hidden":false,"merged":[]}

{"sheet":"Graph Data","index":7,"n_rows":21,"n_cols":23,"rows_kept":21,"cut":false,"hidden":false,"merged":[]}
[]
[]
[null,"Row",210]
[null,"Row 2",209]
[]
[null,null,{"$f":"'Financial Model'!I2","v":2005},{"$f":"'Financial Model'!J2","v":2006},{"$f":"'Financial Model'!K2","v":2007},{"$f":"'Financial Model'!L2","v":2008},{"$f":"'Financial Model'!M2","v":2009},{"$f":"'Financial Model'!N2","v":2010},{"$f":"'Financial Model'!O2","v":2011},{"$f":"'Financial Model'!P2","v":2012},{"$f":"'Financial Model'!Q2","v":2013},{"$f":"'Financial Model'!R2","v":2014},{"$f":"'Financial Model'!S2","v":2015},{"$f":"'Financial Model'!T2","v":2016},{"$f":"'Financial Model'!U2","v":2017},{"$f":"'Financial Model'!V2","v":2018},{"$f":"'Financial Model'!W2","v":2019},{"$f":"'Financial Model'!X2","v":2020},{"$f":"'Financial Model'!Y2","v":2021},{"$f":"'Financial Model'!Z2","v":2022},{"$f":"'Financial Model'!AA2","v":2023},{"$f":"'Financial Model'!AB2","v":2024},{"$f":"'Financial Model'!AC2","v":2025}]
[null,null,{"$f":"'Financial Model'!I3","v":true},{"$f":"'Financial Model'!J3","v":true},{"$f":"'Financial Model'!K3","v":true},{"$f":"'Financial Model'!L3","v":true},{"$f":"'Financial Model'!M3","v":true},{"$f":"'Financial Model'!N3","v":true},{"$f":"'Financial Model'!O3","v":true},{"$f":"'Financial Model'!P3","v":true},{"$f":"'Financial Model'!Q3","v":true},{"$f":"'Financial Model'!R3","v":true},{"$f":"'Financial Model'!S3","v":true},{"$f":"'Financial Model'!T3","v":true},{"$f":"'Financial Model'!U3","v":false},{"$f":"'Financial Model'!V3","v":false},{"$f":"'Financial Model'!W3","v":false},{"$f":"'Financial Model'!X3","v":false},{"$f":"'Financial Model'!Y3","v":false},{"$f":"'Financial Model'!Z3","v":false},{"$f":"'Financial Model'!AA3","v":false},{"$f":"'Financial Model'!AB3","v":false},{"$f":"'Financial Model'!AC3","v":false}]
[null,{"$f":"INDEX('Financial Model'!B:B,'Graph Data'!$C$3)","v":"ROIC"},{"$f":"INDEX('Financial Model'!I:I,'Graph Data'!$C$3)","v":-6.2137486191671712E-2},{"$f":"INDEX('Financial Model'!J:J,'Graph Data'!$C$3)","v":0.10727962029870478},{"$f":"INDEX('Financial Model'!K:K,'Graph Data'!$C$3)","v":0.18261514938487408},{"$f":"INDEX('Financial Model'!L:L,'Graph Data'!$C$3)","v":0.21525241675617615},{"$f":"INDEX('Financial Model'!M:M,'Graph Data'!$C$3)","v":6.8880351262349065E-2},{"$f":"INDEX('Financial Model'!N:N,'Graph Data'!$C$3)","v":9.7812456458130137E-2},{"$f":"INDEX('Financial Model'!O:O,'Graph Data'!$C$3)","v":-7.45975657636435E-3},{"$f":"INDEX('Financial Model'!P:P,'Graph Data'!$C$3)","v":8.8261253309817071E-4},{"$f":"INDEX('Financial Model'!Q:Q,'Graph Data'!$C$3)","v":6.251234445980644E-2},{"$f":"INDEX('Financial Model'!R:R,'Graph Data'!$C$3)","v":0.25370650529500754},{"$f":"INDEX('Financial Model'!S:S,'Graph Data'!$C$3)","v":0.56728232189973615},{"$f":"INDEX('Financial Model'!T:T,'Graph Data'!$C$3)","v":1.4276624246483589},{"$f":"INDEX('Financial Model'!U:U,'Graph Data'!$C$3)","v":0.74177706296969337},{"$f":"INDEX('Financial Model'!V:V,'Graph Data'!$C$3)","v":0.40186848418141519},{"$f":"INDEX('Financial Model'!W:W,'Graph Data'!$C$3)","v":0.35680619263249658},{"$f":"INDEX('Financial Model'!X:X,'Graph Data'!$C$3)","v":0.34393303269690012},{"$f":"INDEX('Financial Model'!Y:Y,'Graph Data'!$C$3)","v":0.34836488919701042},{"$f":"INDEX('Financial Model'!Z:Z,'Graph Data'!$C$3)","v":0.36361965999780677},{"$f":"INDEX('Financial Model'!AA:AA,'Graph Data'!$C$3)","v":0.38648773862780594},{"$f":"INDEX('Financial Model'!AB:AB,'Graph Data'!$C$3)","v":0.41527309641857635},{"$f":"INDEX('Financial Model'!AC:AC,'Graph Data'!$C$3)","v":0.44907573734925255}]
[null,{"$f":"INDEX('Financial Model'!B:B,$C$4)","v":"Average Invested Capital"},{"$f":"INDEX('Financial Model'!I:I,'Graph Data'!$C$4)","v":1396.5000085830688},{"$f":"INDEX('Financial Model'!J:J,'Graph Data'!$C$4)","v":1292.6499890089035},{"$f":"INDEX('Financial Model'!K:K,'Graph Data'!$C$4)","v":1819.3999847173691},{"$f":"INDEX('Financial Model'!L:L,'Graph Data'!$C$4)","v":2327.5},{"$f":"INDEX('Financial Model'!M:M,'Graph Data'!$C$4)","v":2733},{"$f":"INDEX('Financial Model'!N:N,'Graph Data'!$C$4)","v":3588.5},{"$f":"INDEX('Financial Model'!O:O,'Graph Data'!$C$4)","v":3820.5},{"$f":"INDEX('Financial Model'!P:P,'Graph Data'!$C$4)","v":3399},{"$f":"INDEX('Financial Model'!Q:Q,'Graph Data'!$C$4)","v":2531.5},{"$f":"INDEX('Financial Model'!R:R,'Graph Data'!$C$4)","v":1652.5},{"$f":"INDEX('Financial Model'!S:S,'Graph Data'!$C$4)","v":1137},{"$f":"INDEX('Financial Model'!T:T,'Graph Data'!$C$4)","v":746.5},{"$f":"INDEX('Financial Model'!U:U,'Graph Data'!$C$4)","v":1519.0846672500002},{"$f":"INDEX('Financial Model'!V:V,'Graph Data'!$C$4)","v":2756.9449136470762},{"$f":"INDEX('Financial Model'!W:W,'Graph Data'!$C$4)","v":3197.9873112633954},{"$f":"INDEX('Financial Model'!X:X,'Graph Data'!$C$4)","v":3529.3765430109997},{"$f":"INDEX('Financial Model'!Y:Y,'Graph Data'!$C$4)","v":3783.7872574847552},{"$f":"INDEX('Financial Model'!Z:Z,'Graph Data'!$C$4)","v":3983.6586131061863},{"$f":"INDEX('Financial Model'!AA:AA,'Graph Data'!$C$4)","v":4144.3586977041186},{"$f":"INDEX('Financial Model'!AB:AB,'Graph Data'!$C$4)","v":4276.3672854278229},{"$f":"INDEX('Financial Model'!AC:AC,'Graph Data'!$C$4)","v":4386.7811905269446}]
[]
{"$rows_left_out":12}
{"sheet":"Scenario","index":12,"n_rows":37,"n_cols":23,"rows_kept":37,"cut":false,"hidden":false,"merged":[]}
[]
[null,null,null,"Code nr",1,null,"WACC",{"$f":"DCF!$E$13","v":7.3999999999999996E-2}]
[]
[null,null,null,null,1,2,3,4,5,null,null,null,null,{"$f":"TRANSPOSE(DCF!B61:B63)","v":"EV - growth rate method"},"EV - value driver method","Terminal EV / EBITDA method"]
[null,null,null,null,"Volume growth","Price","COGS","CAPEX","R&D cost","AR / Sales","Inventory / COGS",null,null,{"$f":"DCF!E57","v":26632.281595843266},{"$f":"DCF!E58","v":13.911413299601739}]
[null,null,null,"Base Case",7.0000000000000007E-2,0.01,0.75,1000,7.0000000000000007E-2,null,null,null,1,26632.281595843266,13.911413299601739]
[null,null,null,"Low Case ",0.04,-0.02,0.78,1200,0.09,null,null,null,2,2334.6725558503449,1.5837889861838426]
[null,null,null,"High Case ",0.1,0.03,0.72,800,0.06,null,null,null,3,60351.396863826332,25.474965727551641]
[null,null,1,{"$f":"TRANSPOSE(E5:K5)&\" Low Case\"","v":"Volume growth Low Case"},{"$f":"IF(E$4=$C9,E$7,E$6)","v":0.04},{"$f":"IF(F$4=$C9,F$7,F$6)","v":0.01},0.75,1000,7.0000000000000007E-2,null,null,null,4,17742.736146846215,9.5703158193612552]
[null,null,2,"Price Low Case",{"$f":"IF(E$4=$C10,E$7,E$6)","v":7.0000000000000007E-2},-0.02,0.75,1000,7.0000000000000007E-2,null,null,null,5,17271.583034189163,9.3342700490395689]
{"$rows_left_out":28}
{"sheet":"Sheet1","index":13,"n_rows":30,"n_cols":10,"rows_kept":30,"cut":false,"hidden":false,"merged":[]}
[]
[]
[]
[]
[null,null,null,null,null,null,"Direct","Financing"]
[null,null,null,null,null,"Plant assets",1,null,null,1000]
[null,null,null,null,null,"Cash",null,-1,-1,100]
[null,null,null,null,null,"Derivatives",null,-1,-1,200]
[null,null,null,null,null,"Investments in Associates",null,-1,-1,200]
[null,null,null,null,null,null,null,null,null,{"$f":"SUM(J6:J9)","v":1500}]
{"$rows_left_out":20}