{"text_format":"1","workbook":"xlsx","n_sheets":12,"sheets":["Contents","Master scenario","Downside Chart","Corp Module","Working Capital Loan","Valuation","Debt Service Chart","PF Module","Annual Model with Sumif","Chart7","Chart8","Chart3"],"not_rendered":{"charts":11,"images":0,"macros":1,"external_links":0,"defined_names":0,"comments":3,"pivot_tables":0},"unopened":[{"sheet":"Downside Chart","index":2,"reason":"not_a_worksheet"},{"sheet":"Debt Service Chart","index":6,"reason":"not_a_worksheet"},{"sheet":"Chart7","index":9,"reason":"not_a_worksheet"},{"sheet":"Chart8","index":10,"reason":"not_a_worksheet"},{"sheet":"Chart3","index":11,"reason":"not_a_worksheet"}],"bounds":{"document_bytes":16777216,"sheet_cells":100000,"rows_first":2000,"rows_last":500,"rows_between":2000,"halvings":0,"cell_chars":16384,"cell_head_chars":4096},"cells_cut":0,"cells_raw":0,"read":"whole","date_system":"1900"}

{"sheet":"Contents","index":0,"n_rows":23,"n_cols":5,"rows_kept":23,"cut":false,"hidden":false,"merged":[]}
[]
[]
[null,null,"Sheet Tab","Description","Author"]
[null,1,"contents"]
[null,2,"annual pf model"]
[null,3,"exel"]
[null,4,"Debt Ser chart"]
[null,5,"PF Module"]
[null,6,"PF Risk"]
[null,7,"CORP Module"]
[null,8,"Chart2"]
[null,9,"Chart3"]
[null,10,"Valuation"]
[null,11,"Sheet5"]
[null,12,"Sheet6"]
[null,13,"Sheet7"]
[]
[null," File Name: ",null,{"$f":"File_name()","v":"C:\\Users\\Monika Lewenski\\Courses\\Chapter 1. Models and Analysis\\A. Corporate Models Templates and Exercises\\A. Featured Corporate Finance Models\\Construction Company Corporate Model.xlsm"}]
[]
[null," Last Save Date ",null,{"$f":"lastsaved1()","v":"21/04/2015 10:30:23"}]
[null," Last Save By",null,{"$f":"lastsaveby1()","v":"Elvis Presley"}]
[]
[null," Colour Codes "]

{"sheet":"Master scenario","index":1,"n_rows":33,"n_cols":14,"rows_kept":33,"cut":false,"hidden":false,"merged":[]}
[null,null,"Code number",1]
[null,null,"P/E ratio",10]
[null,null,"Valuation year",2018]
[null,null,"Column",{"$f":"MATCH(D3,'Corp Module'!6:6)","v":13}]
[null,null,"Sells growth","COGS margin","Other expense growth","CAPEX","AR/ Revenue","Inventory/ COGS","AP/ COGS",null,"Value of the company","ROE","Debt/Equity","Debt/EBITDA"]
[null,null,1,2,3,4,5,6,7,null,{"$f":"INDEX('Corp Module'!295:295,'Master scenario'!D4)","v":34.13340467436597},{"$f":"INDEX('Corp Module'!300:300,'Master scenario'!D4)","v":0.18914280740259939},{"$f":"INDEX('Corp Module'!308:308,'Master scenario'!D4)","v":1.0648390367508898},{"$f":"INDEX('Corp Module'!309:309,'Master scenario'!D4)","v":0.28278356547666095}]
[null,"Base case",1,1,0.1,1,0.3,0.14000000000000001,0.14000000000000001,1,34.13340467436597,0.18914280740259939,1.0648390367508898,0.28278356547666095]
[null,"Low case",2,1.05,0.15,1.2,0.45,0.16,7.0000000000000007E-2,2,-0.48408975482120647,-2.964429410187213E-3,4.5284693207867823,0.61953595892364877]
[null,"High case",3,0.97,7.0000000000000007E-2,0.9,0.2,0.1,0.2,3,66.342485088938645,0.34208409157337982,0,0]
[1,{"$f":"\"base case except\"&TRANSPOSE(C5:I5)","v":"base case exceptSells growth"},{"$f":"IF(C$6=$A10,C$8,C$7)","v":2},{"$f":"IF(D$6=$A10,D$8,D$7)","v":1},0.1,1,0.3,0.14000000000000001,0.14000000000000001,4,22.518756721567694,0.12829631264693739,0.90107382821124671,0.16137434284154409]
[2,"base case exceptCOGS margin",{"$f":"IF(C$6=$A11,C$8,C$7)","v":1},1.05,0.1,1,0.3,0.14000000000000001,0.14000000000000001,5,21.202797531321202,0.12248306973910988,1.6535041130472405,0.33548925561454129]
[3,"base case exceptOther expense growth",1,1,0.15,1,0.3,0.14000000000000001,0.14000000000000001,6,34.13340467436597,0.18914280740259939,1.0648390367508898,0.28278356547666095]
[4,"base case exceptCAPEX",1,1,0.1,1.2,0.3,0.14000000000000001,0.14000000000000001,7,31.944478481068998,0.17762482185652201,1.3346435741811964,0.35606094938866745]
[5,"base case exceptAR/ Revenue",1,1,0.1,1,0.45,0.14000000000000001,0.14000000000000001,8,23.383050774663385,0.13296549366345195,2.1818497476659457,0.59789329577147843]
[6,"base case exceptInventory/ COGS",1,1,0.1,1,0.3,0.16,0.14000000000000001,9,34.13340467436597,0.18914280740259939,1.0648390367508898,0.28278356547666095]
[7,"base case exceptAP/ COGS",1,1,0.1,1,0.3,0.14000000000000001,7.0000000000000007E-2,10,30.043666481174025,0.16811261232021685,1.4897814534614851,0.40033836446175586]
[]
[]
[null,{"$f":"INDEX(B7:B17,$D$1)","v":"Base case"},{"$f":"INDEX(C7:C17,$D$1)","v":1},{"$f":"INDEX(D7:D17,$D$1)","v":1},{"$f":"INDEX(E7:E17,$D$1)","v":0.1},{"$f":"INDEX(F7:F17,$D$1)","v":1},{"$f":"INDEX(G7:G17,$D$1)","v":0.3},{"$f":"INDEX(H7:H17,$D$1)","v":0.14000000000000001},{"$f":"INDEX(I7:I17,$D$1)","v":0.14000000000000001},{"$f":"INDEX(J7:J17,$D$1)","v":1}]
[]
[]
[]
[]
[]
[]
[]
[]
[null,{"$f":"TRANSPOSE(C5:I5)&\" low case \"","v":"Sells growth low case "},{"$f":"K10-$K$7","v":-11.614647952798276}]
[null,"COGS margin low case ",{"$f":"K11-$K$7","v":-12.930607143044767}]
[null,"Other expense growth low case ",0]
{"$rows_left_out":4}
{"sheet":"Corp Module","index":3,"n_rows":313,"n_cols":16,"rows_kept":313,"cut":false,"hidden":false,"merged":[]}
["  "]
[null,null,null,"APPENDIX 1: FINANCIAL STATEMENT, RATIO ANALYSIS "]
[null,null,null,"Company name: ABC company","/MNT million/ "]
[]
["INCOME STATEMENT"]
[null,null,null,null,"Last history year",2011,{"$f":"F6+1","v":2012},{"$f":"G6+1","v":2013},2014,{"$f":"I6+1","v":2015},{"$f":"J6+1","v":2016},2017,2018,2019,2020,2021]
[null,null,null,"Historic  switch",2014,{"$f":"F6<=$E$7","v":true},{"$f":"G6<=$E$7","v":true},true,true,false,false,false,false,false,false,false]
[null,null,"Income Statement"]
[null,null,null,"Sales ",null,{"$f":"+SUM(F10:F17)","v":24308.302974089998},{"$f":"+SUM(G10:G17)","v":44489.32238102},{"$f":"+SUM(H10:H17)","v":51419.895912189997},{"$f":"+SUM(I10:I17)","v":44500}]
[null,null,null,"Sugar sales",null,8516.9205564999993,7429.7231999999985,6200.3131819999999,5000]
[null,null,null,"Rent income",null,1805.2268365000002,396.48485875999995,{"$f":"292.991852+144.301908+27.749302","v":465.04306200000002},500]
[null,null,null,"Freight forwarding",null,7738.3534810899991,9318.284335260003,{"$f":"4024.32542483+3029.10706118+542.19357755","v":7595.6260635600001},7000]
[null,null,null,"Rebar sales",null,3879.6738000000005,23445.877486999994,32809.364808899998,25000]
[null,null,null,"Rice sales",null,2368.1282999999999,3898.9524999999999,0,0]
[null,null,null,"Liquid concrete and cement sales",null,0,0,3227.74593177,4000]
[null,null,null,"Sales of apartment",null,0,0,0,2500]
[null,null,null,"Other businesses",null,0,0,{"$f":"1.14076221+61.3429834+131.873636+732.52895983+1.525261+82.768173+108.77636352+0.828544+1.018181","v":1121.80286396},500]
[null,null,null,"COGS",null,{"$f":"+SUM(F19:F24)","v":19081},{"$f":"+SUM(G19:G24)","v":38260},41547.715148790005,35950]
[null,null,null,"COGS (Sugar)",null,7944,8112,6189.4556014999998,{"$f":"+I10*0.99","v":4950}]
[null,null,null,"COGS (Rebar)",null,3339,21341,30127.169537530001,{"$f":"+I13*0.9","v":22500}]
[null,null,null,"COGS (Freight forwarding)",null,5694,5113,3209.1993659599998,5000]
[null,null,null,"COGS (Rice)",null,2104,3694,0,0]
[null,null,null,"COGS (Liquid concrete and cement)",null,0,0,2019.4055518,3500]
[null,null,null,"COGS (Other businesses)",null,0,0,2.4850919999999999,0]
[null,null,null,"Gross profit",null,{"$f":"+F9-F18","v":5227.3029740899983},{"$f":"+G9-G18","v":6229.3223810199997},{"$f":"+H9-H18","v":9872.1807633999924},{"$f":"+I9-I18","v":8550}]
[null,null,null,"Sugar sales",null,{"$f":"+F10-F19","v":572.92055649999929},{"$f":"+G10-G19","v":-682.27680000000146},10.85758050000004,50]
[null,null,null,"Rent income",null,{"$f":"+F11","v":1805.2268365000002},{"$f":"+G11","v":396.48485875999995},465.04306200000002,500]
[null,null,null,"Freight forwarding",null,{"$f":"+F12-F21","v":2044.3534810899991},{"$f":"+G12-G21","v":4205.284335260003},{"$f":"+H12-H21","v":4386.4266975999999},{"$f":"+I12-I21","v":2000}]
[null,null,null,"Rebar sales",null,{"$f":"+F13-F20","v":540.67380000000048},{"$f":"+G13-G20","v":2104.8774869999943},2682.1952713699975,2500]
[null,null,null,"Rice sales",null,{"$f":"+F14-F22","v":264.12829999999985},{"$f":"+G14-G22","v":204.95249999999987},0,0]
{"$rows_left_out":284}
{"sheet":"Working Capital Loan","index":4,"n_rows":101,"n_cols":40,"rows_kept":101,"cut":false,"hidden":false,"merged":[]}
[]
[null,"code number",2]
[null,null,2016,2017,2018]
[null,"Revenue"]
[null,"base case",100,150,160]
[null,"low case",100,70,50]
["Operating assumption"]
[null,{"$f":"INDEX(B5:B6,$C$2)","v":"low case"},{"$f":"INDEX(C5:C6,$C$2)","v":100},70,50]
[]
[null,"month AR account reciable"]
[null,"base case ",2]
[null,"low case",4]
[]
[null,{"$f":"INDEX(B11:B12,$C$2)","v":"low case"},{"$f":"INDEX(C11:C12,$C$2)","v":4}]
[]
[null,"operating cost",65]
[]
[null,"monthly revenues",1,2,3,4,5,6,7,8,9,10,11,12]
[null,"revenue percentage",0.02,0.02,0.02,0.02,0.1,0.1,0.1,0.1,0.1,0.12,0.15,0.2]
[]
["Financing Assumption"]
[null,"Interest income rate",{"$f":"3.6%/12","v":3.0000000000000005E-3}]
[null,"Interest expense rate",{"$f":"19.4%/12","v":1.6166666666666666E-2}]
[]
[null,"Min cash",{"$f":"2%","v":0.02}]
[]
[]
["Timeline "]
["Months",null,null,null,1,{"$f":"IF(E29=12,1,E29+1)","v":2},{"$f":"IF(F29=12,1,F29+1)","v":3},4,5,6,7,8,9,10,11,12,1,2,3,4,5,6,7,8,9,10,{"$f":"IF(Z29=12,1,Z29+1)","v":11},12,1,2,3,4,5,6,7,8,9,10,11,12]
["Years",null,null,null,2016,{"$f":"IF(F29=1,E30+1,E30)","v":2016},{"$f":"IF(G29=1,F30+1,F30)","v":2016},2016,2016,2016,2016,2016,2016,2016,2016,2016,2017,2017,2017,2017,2017,2017,2017,2017,2017,2017,2017,2017,2018,2018,2018,2018,2018,2018,2018,2018,2018,2018,2018,2018]
{"$rows_left_out":72}
{"sheet":"Valuation","index":5,"n_rows":0,"n_cols":0,"rows_kept":0,"cut":false,"hidden":false,"merged":[]}

{"sheet":"PF Module","index":7,"n_rows":122,"n_cols":16384,"rows_kept":122,"cut":false,"hidden":false,"merged":[]}
["Time assumption"]
[null,"Start a project",null,null,"Date",null,null,"2016-01-01"]
[null,"Construction",null,null,"Months",null,null,35]
[null,"COD",null,null,"Date",null,null,{"$f":"EDATE(H2,H3)","v":"2018-12-01"}]
[null,"Project live",null,null,"Years",null,null,19]
[null,"End date",null,null,"Date",null,null,{"$f":"EDATE(H4,H5*12)","v":"2037-12-01"}]
[]
["Operatng Assumpstion- Үйл ажиллагааны таамаглал"]
[null,"Capacity",null,null,"Tons / year",null,null,10000]
[null,"Project cost",null,null,"USD .000",null,null,1550000]
[]
[null,"Fixed costs",null,null,"USD /per year",null,null,15000]
[null,"Variuble cost",null,null,"USD /per ton/",null,null,12]
[]
[null,"Pricing",null,null,"USD /per ton/"]
[]
[null,null,null,null,1,null,null,2016,2018,2020,2025,2030]
[1,"Base case",null,null,null,null,null,40,42,45,47,50]
[2,"Low case",null,null,null,null,null,37,{"$f":"H19","v":37},{"$f":"I19","v":37},{"$f":"J19","v":37},{"$f":"K19","v":37}]
[3,"High case",null,null,null,null,null,50,50,50,50,50]
[]
[null,{"$f":"INDEX(B18:B20,$E$17)","v":"Base case"},null,null,null,null,null,{"$f":"INDEX(H18:H20,$E$17)","v":40},42,45,47,50]
[]
[]
["Financing Assumption"]
[null,"Debt size",null,null,null,null,null,{"$f":"I26/100","v":0.8},80]
[null,"Borrowing method",null,null,null,null,null,"pro  rata"]
[null,"Repayment years",null,null,null,null,null,10]
[null,"Repayment method",null,null,null,null,null,"annuity"]
[null,"Interest rate",null,null,null,null,null,0.08]
{"$rows_left_out":93}
{"sheet":"Annual Model with Sumif","index":8,"n_rows":4,"n_cols":17,"rows_kept":4,"cut":false,"hidden":false,"merged":[]}
[null,null,null,null,2016,{"$f":"E1+1","v":2017},{"$f":"F1+1","v":2018},2019,2020,2021,2022,2023,2024,2025,2026,2027,2028]
[null,null,null,"Revenue",{"$f":"SUMIF('PF Module'!$36:$36,'Annual Model with Sumif'!E$1,'PF Module'!55:55)","v":0},{"$f":"SUMIF('PF Module'!$36:$36,'Annual Model with Sumif'!F$1,'PF Module'!55:55)","v":0},{"$f":"SUMIF('PF Module'!$36:$36,'Annual Model with Sumif'!G$1,'PF Module'!55:55)","v":35000},{"$f":"SUMIF('PF Module'!$36:$36,'Annual Model with Sumif'!H$1,'PF Module'!55:55)","v":420000},{"$f":"SUMIF('PF Module'!$36:$36,'Annual Model with Sumif'!I$1,'PF Module'!55:55)","v":450000},{"$f":"SUMIF('PF Module'!$36:$36,'Annual Model with Sumif'!J$1,'PF Module'!55:55)","v":450000},{"$f":"SUMIF('PF Module'!$36:$36,'Annual Model with Sumif'!K$1,'PF Module'!55:55)","v":450000},{"$f":"SUMIF('PF Module'!$36:$36,'Annual Model with Sumif'!L$1,'PF Module'!55:55)","v":450000},{"$f":"SUMIF('PF Module'!$36:$36,'Annual Model with Sumif'!M$1,'PF Module'!55:55)","v":450000},{"$f":"SUMIF('PF Module'!$36:$36,'Annual Model with Sumif'!N$1,'PF Module'!55:55)","v":470000.00000000006},{"$f":"SUMIF('PF Module'!$36:$36,'Annual Model with Sumif'!O$1,'PF Module'!55:55)","v":470000.00000000006},{"$f":"SUMIF('PF Module'!$36:$36,'Annual Model with Sumif'!P$1,'PF Module'!55:55)","v":470000.00000000006},{"$f":"SUMIF('PF Module'!$36:$36,'Annual Model with Sumif'!Q$1,'PF Module'!55:55)","v":470000.00000000006}]
[null,null,null,"operating expence",{"$f":"SUMIF('PF Module'!$36:$36,'Annual Model with Sumif'!E$1,'PF Module'!50:50)","v":0},{"$f":"SUMIF('PF Module'!$36:$36,'Annual Model with Sumif'!F$1,'PF Module'!50:50)","v":0},{"$f":"SUMIF('PF Module'!$36:$36,'Annual Model with Sumif'!G$1,'PF Module'!50:50)","v":11250},{"$f":"SUMIF('PF Module'!$36:$36,'Annual Model with Sumif'!H$1,'PF Module'!50:50)","v":135000},{"$f":"SUMIF('PF Module'!$36:$36,'Annual Model with Sumif'!I$1,'PF Module'!50:50)","v":135000},{"$f":"SUMIF('PF Module'!$36:$36,'Annual Model with Sumif'!J$1,'PF Module'!50:50)","v":135000},{"$f":"SUMIF('PF Module'!$36:$36,'Annual Model with Sumif'!K$1,'PF Module'!50:50)","v":135000},{"$f":"SUMIF('PF Module'!$36:$36,'Annual Model with Sumif'!L$1,'PF Module'!50:50)","v":135000},{"$f":"SUMIF('PF Module'!$36:$36,'Annual Model with Sumif'!M$1,'PF Module'!50:50)","v":135000},{"$f":"SUMIF('PF Module'!$36:$36,'Annual Model with Sumif'!N$1,'PF Module'!50:50)","v":135000},{"$f":"SUMIF('PF Module'!$36:$36,'Annual Model with Sumif'!O$1,'PF Module'!50:50)","v":135000},{"$f":"SUMIF('PF Module'!$36:$36,'Annual Model with Sumif'!P$1,'PF Module'!50:50)","v":135000},{"$f":"SUMIF('PF Module'!$36:$36,'Annual Model with Sumif'!Q$1,'PF Module'!50:50)","v":135000}]
[null,null,null,"CAPEX",{"$f":"SUMIF('PF Module'!$36:$36,'Annual Model with Sumif'!E$1,'PF Module'!46:46)","v":531428.57142857125},{"$f":"SUMIF('PF Module'!$36:$36,'Annual Model with Sumif'!F$1,'PF Module'!46:46)","v":531428.57142857125},{"$f":"SUMIF('PF Module'!$36:$36,'Annual Model with Sumif'!G$1,'PF Module'!46:46)","v":487142.85714285698},{"$f":"SUMIF('PF Module'!$36:$36,'Annual Model with Sumif'!H$1,'PF Module'!46:46)","v":0},{"$f":"SUMIF('PF Module'!$36:$36,'Annual Model with Sumif'!I$1,'PF Module'!46:46)","v":0},{"$f":"SUMIF('PF Module'!$36:$36,'Annual Model with Sumif'!J$1,'PF Module'!46:46)","v":0},{"$f":"SUMIF('PF Module'!$36:$36,'Annual Model with Sumif'!K$1,'PF Module'!46:46)","v":0},{"$f":"SUMIF('PF Module'!$36:$36,'Annual Model with Sumif'!L$1,'PF Module'!46:46)","v":0},{"$f":"SUMIF('PF Module'!$36:$36,'Annual Model with Sumif'!M$1,'PF Module'!46:46)","v":0},{"$f":"SUMIF('PF Module'!$36:$36,'Annual Model with Sumif'!N$1,'PF Module'!46:46)","v":0},{"$f":"SUMIF('PF Module'!$36:$36,'Annual Model with Sumif'!O$1,'PF Module'!46:46)","v":0},{"$f":"SUMIF('PF Module'!$36:$36,'Annual Model with Sumif'!P$1,'PF Module'!46:46)","v":0},{"$f":"SUMIF('PF Module'!$36:$36,'Annual Model with Sumif'!Q$1,'PF Module'!46:46)","v":0}]