{"text_format":"1","workbook":"xlsx","n_sheets":13,"sheets":["Contents","Model Features","Summary","Master Scenario","S. Cement Fin.Model","Audit Sheet","Tornadio","Graphs","PE&ROE","Financials","Financing Structure","Discounting","Analyst Report"],"not_rendered":{"charts":4,"images":1,"macros":1,"external_links":0,"defined_names":0,"comments":1,"pivot_tables":0},"unopened":[{"sheet":"Tornadio","index":6,"reason":"not_a_worksheet"}],"bounds":{"document_bytes":16777216,"sheet_cells":100000,"rows_first":2000,"rows_last":500,"rows_between":2000,"halvings":0,"cell_chars":16384,"cell_head_chars":4096},"cells_cut":0,"cells_raw":0,"read":"whole","date_system":"1900"}

{"sheet":"Contents","index":0,"n_rows":23,"n_cols":5,"rows_kept":23,"cut":false,"hidden":false,"merged":[]}
[]
[]
[null,null,"Sheet Tab","Description","Author"]
[null,1,"Contents"]
[null,2,"Model Features"]
[null,3,"Summary"]
[null,4,"Master Scenario"]
[null,5,"S. Cement Fin.Model"]
[null,6,"Audit Sheet"]
[null,7,"Graphs"]
{"$rows_left_out":14}
{"sheet":"Model Features","index":1,"n_rows":26,"n_cols":17,"rows_kept":26,"cut":false,"hidden":false,"merged":[]}
[]
[null,null,null,null,null,null,null,null,null,null,null,null,null,null,null,null,"There are instructions for just about every cell as shown below"]
[null,"Items in this model"]
[]
[null,"This model shows that you can make a reasonable simple model from the data in TAWDAL"]
[]
[null,null,"1. Standard read of financial statements.  Can read from website"]
[null,null,"2. Switches for history and for projection in the financial model page -- key to making the model flexible.  Use TRUE/FALSE switches"]
[null,null,"3. Conditional Formatting by using formula option and TRUE/FALSE switch"]
[null,null,"4. Assumptions from history with flexible options for putting in data that varies over time with the INDEX function"]
{"$rows_left_out":17}
{"sheet":"Summary","index":2,"n_rows":27,"n_cols":6,"rows_kept":27,"cut":false,"hidden":false,"merged":[]}
[]
[null,"Valuation Assumptions",null,null,null,{"$f":"'Audit Sheet'!E10","v":"Model OK"}]
[null,null,"WACC",{"$f":"'Master Scenario'!D4","v":8.4500000000000006E-2}]
[null,null,"Terminal Growth",{"$f":"'S. Cement Fin.Model'!G148","v":0.02}]
[null,null,"Terminal EV/EBITDA",{"$f":"'S. Cement Fin.Model'!$G$149","v":11}]
[null,null,"Stable ROIC",{"$f":"'S. Cement Fin.Model'!$G$152","v":0.21150000000000002}]
[]
[null,null,"Apply Normalized Cash Flow",{"$f":"'S. Cement Fin.Model'!G154","v":false}]
[null,null,"Use Normalized ROIC",{"$f":"'S. Cement Fin.Model'!G155","v":false}]
[]
{"$rows_left_out":18}
{"sheet":"Master Scenario","index":3,"n_rows":39,"n_cols":15,"rows_kept":39,"cut":false,"hidden":false,"merged":[]}
[]
[]
[null,null,"Code No.",1]
[null,null,"WACC",{"$f":"'S. Cement Fin.Model'!G147","v":8.4500000000000006E-2}]
[null,null,"Terminal growth ",{"$f":"'S. Cement Fin.Model'!G148","v":0.02}]
[]
[null,null,null,1,2,3,4,5,6,7,null,"Growth","EV/EBITDA","Value Driver","Equity"]
[null,null,null,"Sales Gr.","COGS Mgn.","Admin Exp.","A/R Turn","Inventory Turn","A/P Turnover","CAPEX To Sales",null,"Share Value ","Share Value ","Share Value ","IRR"]
[null,null,null,null,null,null,null,null,null,null,null,{"$f":"'S. Cement Fin.Model'!G251","v":118.13240661762984},{"$f":"Summary!$E$15","v":102.03431908946267},{"$f":"Summary!$F$15","v":108.34277009779784},{"$f":"Summary!$D$27","v":8.4022194805783323E-2}]
[null,null," Base Case",2,1,4.4999999999999998E-2,0.15,0.75,0.9,7.0000000000000007E-2,1,116.31711301421291,99.513212223362714,105.58347729795774,7.7809873596814239E-2]
{"$rows_left_out":30}
{"sheet":"S. Cement Fin.Model","index":4,"n_rows":387,"n_cols":23,"rows_kept":387,"cut":false,"hidden":false,"merged":[]}
[null,null,"Timeline"]
[null,null,null,"Year",null,null,null,null,null,2010,{"$f":"J2+1","v":2011},{"$f":"K2+1","v":2012},2013,2014,2015,2016,2017,2018,2019,2020,2021,2022,2023]
[null,null,null,"Historic Period",null,null,2013,null,null,{"$f":"J2<=$G$3","v":true},{"$f":"K2<=$G$3","v":true},true,true,false,false,false,false,false,false,false,false,false,false]
[null,null,null,"Projection Period",null,null,2018,null,null,{"$f":"AND(J2>$G$3,J2<=$G$4)","v":false},{"$f":"AND(K2>$G$3,K2<=$G$4)","v":false},false,false,true,true,true,true,true,false,false,false,false,false]
[null,null,null,"Terminal period",null,null,{"$f":"G4","v":2018},null,null,{"$f":"J2=$G$5","v":false},{"$f":"K2=$G$5","v":false},false,false,false,false,false,false,true,false,false,false,false,false]
[]
[null,null,"Historical Statements"]
[null,null,null,null,null,"BALANCE SHEET",null,null,null,"2010-12-31","2011-12-31","2012-12-31","2013-12-31"]
[null,null,null,null,null,"Current Assets",null,null,null,345095,457228,478893,449854]
[null,null,null,null,null,"Inventory",null,null,null,525381,478867,322714,536554]
{"$rows_left_out":378}
{"sheet":"Audit Sheet","index":5,"n_rows":10,"n_cols":5,"rows_kept":10,"cut":false,"hidden":false,"merged":[]}
[]
[]
[]
[null,null,"Balance Sheet Test",{"$f":"'S. Cement Fin.Model'!G374","v":true}]
[null,null,"Debt Balance Test",{"$f":"'Financing Structure'!H68","v":true}]
[null,null,"P&L Test",{"$f":"'S. Cement Fin.Model'!G329","v":true}]
[null,null,"Dvd Test",true]
[]
[]
[null,null,"Aggregate Model Test",{"$f":"AND(D4:D7)","v":true},{"$f":"IF(D10,\"Model OK\",\"Model Problem\")","v":"Model OK"}]
{"$rows_left_out":1}
{"sheet":"Graphs","index":7,"n_rows":66,"n_cols":22,"rows_kept":66,"cut":false,"hidden":false,"merged":[]}
[]
[null,"Assumptions Graph"]
[]
[null,null,null,null,null,1,null,null,{"$f":"'S. Cement Fin.Model'!J2","v":2010},{"$f":"'S. Cement Fin.Model'!K2","v":2011},{"$f":"'S. Cement Fin.Model'!L2","v":2012},{"$f":"'S. Cement Fin.Model'!M2","v":2013},{"$f":"'S. Cement Fin.Model'!N2","v":2014},{"$f":"'S. Cement Fin.Model'!O2","v":2015},{"$f":"'S. Cement Fin.Model'!P2","v":2016},{"$f":"'S. Cement Fin.Model'!Q2","v":2017},{"$f":"'S. Cement Fin.Model'!R2","v":2018},{"$f":"'S. Cement Fin.Model'!S2","v":2019},{"$f":"'S. Cement Fin.Model'!T2","v":2020},{"$f":"'S. Cement Fin.Model'!U2","v":2021},{"$f":"'S. Cement Fin.Model'!V2","v":2022},{"$f":"'S. Cement Fin.Model'!W2","v":2023}]
[null,null,null,null,null,null,null,null,{"$f":"'S. Cement Fin.Model'!J3","v":true},{"$f":"'S. Cement Fin.Model'!K3","v":true},{"$f":"'S. Cement Fin.Model'!L3","v":true},{"$f":"'S. Cement Fin.Model'!M3","v":true},{"$f":"'S. Cement Fin.Model'!N3","v":false},{"$f":"'S. Cement Fin.Model'!O3","v":false},{"$f":"'S. Cement Fin.Model'!P3","v":false},{"$f":"'S. Cement Fin.Model'!Q3","v":false},{"$f":"'S. Cement Fin.Model'!R3","v":false},{"$f":"'S. Cement Fin.Model'!S3","v":false},{"$f":"'S. Cement Fin.Model'!T3","v":false},{"$f":"'S. Cement Fin.Model'!U3","v":false},{"$f":"'S. Cement Fin.Model'!V3","v":false},{"$f":"'S. Cement Fin.Model'!W3","v":false}]
[null,null,null,null,null,null,null,null,{"$f":"'S. Cement Fin.Model'!J4","v":false},{"$f":"'S. Cement Fin.Model'!K4","v":false},{"$f":"'S. Cement Fin.Model'!L4","v":false},{"$f":"'S. Cement Fin.Model'!M4","v":false},{"$f":"'S. Cement Fin.Model'!N4","v":true},{"$f":"'S. Cement Fin.Model'!O4","v":true},{"$f":"'S. Cement Fin.Model'!P4","v":true},{"$f":"'S. Cement Fin.Model'!Q4","v":true},{"$f":"'S. Cement Fin.Model'!R4","v":true},{"$f":"'S. Cement Fin.Model'!S4","v":false},{"$f":"'S. Cement Fin.Model'!T4","v":false},{"$f":"'S. Cement Fin.Model'!U4","v":false},{"$f":"'S. Cement Fin.Model'!V4","v":false},{"$f":"'S. Cement Fin.Model'!W4","v":false}]
[]
[null,"Number","Match","Index"]
[null,1,{"$f":"MATCH(B9,'S. Cement Fin.Model'!$B$62:$B$144,0)","v":11},{"$f":"INDEX('S. Cement Fin.Model'!F$62:F$144,Graphs!$C9)","v":"History & Projected Sales Growth"},null,null,null,null,{"$f":"INDEX('S. Cement Fin.Model'!J$62:J$144,Graphs!$C9)","v":0},{"$f":"INDEX('S. Cement Fin.Model'!K$62:K$144,Graphs!$C9)","v":0.12445950630049052},{"$f":"INDEX('S. Cement Fin.Model'!L$62:L$144,Graphs!$C9)","v":0.28398894000623498},{"$f":"INDEX('S. Cement Fin.Model'!M$62:M$144,Graphs!$C9)","v":-7.3484862581219001E-3},{"$f":"INDEX('S. Cement Fin.Model'!N$62:N$144,Graphs!$C9)","v":4.1152263374485631E-2},{"$f":"INDEX('S. Cement Fin.Model'!O$62:O$144,Graphs!$C9)","v":1.6600790513833896E-2},{"$f":"INDEX('S. Cement Fin.Model'!P$62:P$144,Graphs!$C9)","v":2.8382581648522587E-2},{"$f":"INDEX('S. Cement Fin.Model'!Q$62:Q$144,Graphs!$C9)","v":0.04},{"$f":"INDEX('S. Cement Fin.Model'!R$62:R$144,Graphs!$C9)","v":0.04},{"$f":"INDEX('S. Cement Fin.Model'!S$62:S$144,Graphs!$C9)","v":0.04},{"$f":"INDEX('S. Cement Fin.Model'!T$62:T$144,Graphs!$C9)","v":0.04},{"$f":"INDEX('S. Cement Fin.Model'!U$62:U$144,Graphs!$C9)","v":0.04},{"$f":"INDEX('S. Cement Fin.Model'!V$62:V$144,Graphs!$C9)","v":0.04},{"$f":"INDEX('S. Cement Fin.Model'!W$62:W$144,Graphs!$C9)","v":0.04}]
[null,{"$f":"B9+1","v":2},{"$f":"MATCH(B10,'S. Cement Fin.Model'!$B$62:$B$144,0)","v":13},{"$f":"INDEX('S. Cement Fin.Model'!F$62:F$144,Graphs!$C10)","v":"Other Revenue"},null,null,null,null,{"$f":"INDEX('S. Cement Fin.Model'!J$62:J$144,Graphs!$C10)","v":16572},{"$f":"INDEX('S. Cement Fin.Model'!K$62:K$144,Graphs!$C10)","v":4906},{"$f":"INDEX('S. Cement Fin.Model'!L$62:L$144,Graphs!$C10)","v":14980},{"$f":"INDEX('S. Cement Fin.Model'!M$62:M$144,Graphs!$C10)","v":-2009},{"$f":"INDEX('S. Cement Fin.Model'!N$62:N$144,Graphs!$C10)","v":-2009},{"$f":"INDEX('S. Cement Fin.Model'!O$62:O$144,Graphs!$C10)","v":-2009},{"$f":"INDEX('S. Cement Fin.Model'!P$62:P$144,Graphs!$C10)","v":-2009},{"$f":"INDEX('S. Cement Fin.Model'!Q$62:Q$144,Graphs!$C10)","v":-2009},{"$f":"INDEX('S. Cement Fin.Model'!R$62:R$144,Graphs!$C10)","v":-2009},{"$f":"INDEX('S. Cement Fin.Model'!S$62:S$144,Graphs!$C10)","v":-2009},{"$f":"INDEX('S. Cement Fin.Model'!T$62:T$144,Graphs!$C10)","v":-2009},{"$f":"INDEX('S. Cement Fin.Model'!U$62:U$144,Graphs!$C10)","v":-2009},{"$f":"INDEX('S. Cement Fin.Model'!V$62:V$144,Graphs!$C10)","v":-2009},{"$f":"INDEX('S. Cement Fin.Model'!W$62:W$144,Graphs!$C10)","v":-2009}]
{"$rows_left_out":57}
{"sheet":"PE&ROE","index":8,"n_rows":24,"n_cols":469,"rows_kept":24,"cut":false,"hidden":false,"merged":[]}
["Assumptions"]
[null,"Value Drivers"]
[null,null,null,"ROE",0.15,null,null,null,null,null,0.08,0.09,0.1,0.11,0.12,0.13,0.14000000000000001]
[null,null,null,"Growth",{"$f":"I5/100","v":0.05},null,null,null,"Price to Book",{"$f":"H24","v":1.9999999990288841},0.59999999970866602,0.79999999961155321,0.99999999951444352,1.1999999994173316,1.399999999320219,1.5999999992231064,1.7999999991259952]
[null,null,null,"COE",0.1,null,null,null,5]
[null,null,null,null,null,null,"PE Ratio",{"$f":"H23","v":13.333333326859227}]
["Preliminary Calculations"]
[null,null,null,"Dividend Payout Ratio",{"$f":"1-E4/E3","v":0.66666666666666663},null,null,"Market To Book Ratio:",null,"Growth",{"$f":"E4","v":0.05}]
[null,null,null,"Book Value Per Share",10]
[]
{"$rows_left_out":15}
{"sheet":"Financials","index":9,"n_rows":32,"n_cols":6,"rows_kept":32,"cut":false,"hidden":false,"merged":[]}
["Indicators","2009-12-31","2010-12-31","2011-12-31","2012-12-31"]
["Dividend Per Share",0,4,6.5,7]
["Earning Per Share",0,4.3099999999999996,5.43,7.2]
["Current Ratio",0.8,1.18,1.1399999999999999,1.04]
["Leverage %",15.85,15.12,15,12.92]
["Book value per share",30.11,22.03,21.45,20.64]
["PE",0,11.55,13.26,13.19]
["P/B Ratio",1.27,2.2599999999999998,3.36,4.5999999999999996]
["Return on Equity %",0,19.559999999999999,25.32,34.89]
["Return on Assets %",0,14.29,18.07,25.43]
{"$rows_left_out":23}
{"sheet":"Financing Structure","index":10,"n_rows":74,"n_cols":10,"rows_kept":74,"cut":false,"hidden":false,"merged":[]}
[]
[]
[]
[]
[]
[]
[null,null,"Assets"]
[null,null,"Cash",100]
[null,null,"Other Assets",1000]
[null,null,"Total Assets",{"$f":"SUM(D8:D9)","v":1100}]
{"$rows_left_out":65}
{"sheet":"Discounting","index":11,"n_rows":22,"n_cols":258,"rows_kept":22,"cut":false,"hidden":false,"merged":[]}
[]
[]
[]
[]
[null,"Growth Rate",5,null,null,{"$f":"C5/100","v":0.05},null,null,{"$f":"C15","v":9.9999999990778026},0.02,0.03,0.04,0.05]
[null,null,null,null,null,null,null,null,0.1,12.499999941438585,14.285713488059427,16.666655838002086,19.999852303593372]
[null,null,null,null,null,null,null,null,0.12,9.9999999995179714,11.111111104727952,12.499999916439604,14.28571320027341]
[null,"Cost of Capital",15,null,null,{"$f":"C8/100","v":0.15},null,null,0.14000000000000001,8.3333333333288451,9.0909090908508094,9.9999999992541735,11.111111101692057]
[null,null,null,null,null,null,null,null,0.16,7.1428571428571015,7.6923076923070974,8.3333333333258413,9.0909090908161314]
[]
{"$rows_left_out":13}
{"sheet":"Analyst Report","index":12,"n_rows":100,"n_cols":7,"rows_kept":100,"cut":false,"hidden":false,"merged":[]}
[" Company Snapshot   2013e 2014e 2015e 2016e           ",2011,2012,2013,2014,2015,2016]
[" Revenues (Sales)                 ",1716,2203,2430,2530,2572,2645]
[" % Growth in Revenues               ",0.12,0.28000000000000003,0.1,0.04,0.02,0.03]
[" Net Income                 ",831,1102,1189,1238,1254,1297]
[" % Growth in Gross Profit              ",0.24,0.28999999999999998,0.1,0.04,0.01,0.03]
[" EPS                  ",5.43,7.2,7.77,8.09,8.19,8.48]
[" Return On Equity (ROE)               ",0.22,0.19,0.2,0.25,0.35,0.38]
[" Retun On Asstes (ROA)               ",0.14000000000000001,0.12,0.14000000000000001,0.18,0.25,0.28000000000000003]
[" EBIT Margins                 ",0.51,0.52,0.51,0.51,0.51,0.51]
[" Net Margins                 ",0.49,0.43,0.43,0.48,0.5,0.49]
{"$rows_left_out":90}