{"text_format":"1","workbook":"xlsx","n_sheets":11,"sheets":["Key Points About Model","Summary","Valuation","Scenario analysis","Historic Data from PDF","Assumptions and Free Cash Flow","Tornado Diagram","LBO transaction assumption","LBO","Scatter","Graphs"],"not_rendered":{"charts":3,"images":0,"macros":1,"external_links":0,"defined_names":0,"comments":0,"pivot_tables":0},"unopened":[],"bounds":{"document_bytes":16777216,"sheet_cells":100000,"rows_first":2000,"rows_last":500,"rows_between":2000,"halvings":0,"cell_chars":16384,"cell_head_chars":4096},"cells_cut":0,"cells_raw":0,"read":"whole","date_system":"1900"}

{"sheet":"Key Points About Model","index":0,"n_rows":13,"n_cols":2,"rows_kept":13,"cut":false,"hidden":false,"merged":[]}
[]
[null,"Points:"]
[]
[null,"1. Demonstrates as usual how to integrate history in model"]
[null,"2.  Focus on Free Cash Flow and EV/EBITDA"]
[null,"3. Use together with Files that Download Data on Multiples and Cost of Capital"]
[null,"4. Includes Alternative Methods for Terminal Value"]
[null,"5. Includes Very Detailed Analysis of Stabalised Cash Flow "]
[null,"6. Graphs with the UNION Function"]
[]
{"$rows_left_out":4}
{"sheet":"Summary","index":1,"n_rows":27,"n_cols":14,"rows_kept":27,"cut":false,"hidden":false,"merged":[]}
[]
[]
[null,null,null,null,null,null,null,null,null,null,"Share Price",{"$f":"'Assumptions and Free Cash Flow'!W75","v":612.5}]
[null,null,null,null,null,null,null,null,null,null,"P/E Ratio",{"$f":"'Assumptions and Free Cash Flow'!W78","v":20.504301075268817}]
[null,null,null,null,null,null,null,null,null,null,"EV/EBITDA",{"$f":"'Assumptions and Free Cash Flow'!W84","v":10.729030416700645}]
[null,null,null,null,null,null,null,null,null,null,"P/B Ratio",{"$f":"'Assumptions and Free Cash Flow'!W87","v":2.1485456092345192}]
[]
[null,null,null,null,null,null,null,null,null,null,null,"DCF with growth method","DCF with value driver formula","DCF with multiple terminal value"]
[null,null,null,null,null,null,null,null,null,null,"Enterprise Value",{"$f":"Valuation!E56","v":100640.00482031557},{"$f":"Valuation!E57","v":110522.5748131201},{"$f":"Valuation!E58","v":83874.285298603325}]
[null,null,null,null,null,null,null,null,null,null,"Less: Bridge Equity to EV",{"$f":"-Valuation!$D$104","v":-39364},{"$f":"-Valuation!$D$104","v":-39364},{"$f":"-Valuation!$D$104","v":-39364}]
{"$rows_left_out":18}
{"sheet":"Valuation","index":2,"n_rows":164,"n_cols":55,"rows_kept":164,"cut":false,"hidden":false,"merged":[]}
["Free Cash Flow and Valuation"]
[null,"Period Switches"]
[null,null,"Year",null,null,null,null,2000,2001,2002,2003,2004,2005,2006,2007,2008,2009,2010,2011,2012,2013,2014,2015,2016,2017,2018,2019,2020,2021,2022,2023,2024,2025]
[null,null,"Valuation Explicit Cash Flow Switch",2016,null,null,null,null,{"$f":"AND(Valuation!I3>=$D$4,Valuation!I3<=$D$5)","v":false},{"$f":"AND(Valuation!J3>=$D$4,Valuation!J3<=$D$5)","v":false},{"$f":"AND(Valuation!K3>=$D$4,Valuation!K3<=$D$5)","v":false},{"$f":"AND(Valuation!L3>=$D$4,Valuation!L3<=$D$5)","v":false},{"$f":"AND(Valuation!M3>=$D$4,Valuation!M3<=$D$5)","v":false},{"$f":"AND(Valuation!N3>=$D$4,Valuation!N3<=$D$5)","v":false},{"$f":"AND(Valuation!O3>=$D$4,Valuation!O3<=$D$5)","v":false},{"$f":"AND(Valuation!P3>=$D$4,Valuation!P3<=$D$5)","v":false},{"$f":"AND(Valuation!Q3>=$D$4,Valuation!Q3<=$D$5)","v":false},{"$f":"AND(Valuation!R3>=$D$4,Valuation!R3<=$D$5)","v":false},{"$f":"AND(Valuation!S3>=$D$4,Valuation!S3<=$D$5)","v":false},{"$f":"AND(Valuation!T3>=$D$4,Valuation!T3<=$D$5)","v":false},{"$f":"AND(Valuation!U3>=$D$4,Valuation!U3<=$D$5)","v":false},{"$f":"AND(Valuation!V3>=$D$4,Valuation!V3<=$D$5)","v":false},{"$f":"AND(Valuation!W3>=$D$4,Valuation!W3<=$D$5)","v":false},{"$f":"AND(Valuation!X3>=$D$4,Valuation!X3<=$D$5)","v":true},{"$f":"AND(Valuation!Y3>=$D$4,Valuation!Y3<=$D$5)","v":true},{"$f":"AND(Valuation!Z3>=$D$4,Valuation!Z3<=$D$5)","v":true},{"$f":"AND(Valuation!AA3>=$D$4,Valuation!AA3<=$D$5)","v":true},{"$f":"AND(Valuation!AB3>=$D$4,Valuation!AB3<=$D$5)","v":true},{"$f":"AND(Valuation!AC3>=$D$4,Valuation!AC3<=$D$5)","v":true},{"$f":"AND(Valuation!AD3>=$D$4,Valuation!AD3<=$D$5)","v":false},{"$f":"AND(Valuation!AE3>=$D$4,Valuation!AE3<=$D$5)","v":false},{"$f":"AND(Valuation!AF3>=$D$4,Valuation!AF3<=$D$5)","v":false},{"$f":"AND(Valuation!AG3>=$D$4,Valuation!AG3<=$D$5)","v":false}]
[null,null,"Terminal year switch",2021,null,null,null,null,{"$f":"Valuation!I3=$D$5","v":false},{"$f":"Valuation!J3=$D$5","v":false},{"$f":"Valuation!K3=$D$5","v":false},{"$f":"Valuation!L3=$D$5","v":false},{"$f":"Valuation!M3=$D$5","v":false},{"$f":"Valuation!N3=$D$5","v":false},{"$f":"Valuation!O3=$D$5","v":false},{"$f":"Valuation!P3=$D$5","v":false},{"$f":"Valuation!Q3=$D$5","v":false},{"$f":"Valuation!R3=$D$5","v":false},{"$f":"Valuation!S3=$D$5","v":false},{"$f":"Valuation!T3=$D$5","v":false},{"$f":"Valuation!U3=$D$5","v":false},{"$f":"Valuation!V3=$D$5","v":false},{"$f":"Valuation!W3=$D$5","v":false},{"$f":"Valuation!X3=$D$5","v":false},{"$f":"Valuation!Y3=$D$5","v":false},{"$f":"Valuation!Z3=$D$5","v":false},{"$f":"Valuation!AA3=$D$5","v":false},{"$f":"Valuation!AB3=$D$5","v":false},{"$f":"Valuation!AC3=$D$5","v":true},{"$f":"Valuation!AD3=$D$5","v":false},{"$f":"Valuation!AE3=$D$5","v":false},{"$f":"Valuation!AF3=$D$5","v":false},{"$f":"Valuation!AG3=$D$5","v":false}]
[]
["General Valuation Assumptions and Explicit Cash Flow"]
[null,"Basic Valuation Assumptions"]
[null,null,"WACC",{"$f":"I9/1000","v":5.7000000000000002E-2},null,null,null,null,57]
[null,null,"Terminal growth rate",{"$f":"I10/1000","v":1.2999999999999999E-2},null,null,null,null,13]
{"$rows_left_out":155}
{"sheet":"Scenario analysis","index":3,"n_rows":43,"n_cols":15,"rows_kept":43,"cut":false,"hidden":false,"merged":[]}
[]
[]
[]
[null,null,null,"Scenario",2]
[null,null,null,null,1,2,3,4,5]
["Base Variables"]
[null,null,null,"Scenario Name","Volume","Price","COGS pct of sales","SG&A in pct of sales","Admin in pct of sales",null,"DCF with growth method","DCF with value driver formula","DCF with multiple terminal value","IRR from LBO"]
[null,null,null,null,null,null,null,null,null,null,{"$f":"Valuation!E56","v":100640.00482031557},{"$f":"Valuation!E53","v":64275.599172613474},{"$f":"Valuation!E57","v":110522.5748131201},{"$f":"LBO!D34","v":1.7943301796913148E-2}]
[null,null,1,"Base case",1,1,0.44,0.28999999999999998,7.0000000000000007E-2,1,129062.2387150493,79668.412107314856,130692.04860783118,3.8537636399269118E-2]
[null,null,2,"Bear case",2,3,0.44500000000000001,0.3,7.4999999999999997E-2,2,100640.00482031557,64275.599172613474,110522.5748131201,1.7943301796913148E-2]
{"$rows_left_out":34}
{"sheet":"Historic Data from PDF","index":4,"n_rows":188,"n_cols":32,"rows_kept":188,"cut":false,"hidden":false,"merged":[]}
[null,null,null,null,null,null,null,2001,2002,2003,2004,2005,2006,2007,2008,2009,2010,2011,2012,2013,2014,2015,2016,2017,2018,2019,2020,2021,2022,2023,2024,2025]
[null,"Historical switch",2015,null,null,null,{"$f":"Valuation!H3<=$C$2","v":true},{"$f":"Valuation!I3<=$C$2","v":true},{"$f":"Valuation!J3<=$C$2","v":true},{"$f":"Valuation!K3<=$C$2","v":true},{"$f":"Valuation!L3<=$C$2","v":true},{"$f":"Valuation!M3<=$C$2","v":true},{"$f":"Valuation!N3<=$C$2","v":true},{"$f":"Valuation!O3<=$C$2","v":true},{"$f":"Valuation!P3<=$C$2","v":true},{"$f":"Valuation!Q3<=$C$2","v":true},{"$f":"Valuation!R3<=$C$2","v":true},{"$f":"Valuation!S3<=$C$2","v":true},{"$f":"Valuation!T3<=$C$2","v":true},{"$f":"Valuation!U3<=$C$2","v":true},{"$f":"Valuation!V3<=$C$2","v":true},{"$f":"Valuation!W3<=$C$2","v":true},{"$f":"Valuation!X3<=$C$2","v":false},{"$f":"Valuation!Y3<=$C$2","v":false},{"$f":"Valuation!Z3<=$C$2","v":false},{"$f":"Valuation!AA3<=$C$2","v":false},{"$f":"Valuation!AB3<=$C$2","v":false},{"$f":"Valuation!AC3<=$C$2","v":false},{"$f":"Valuation!AD3<=$C$2","v":false},{"$f":"Valuation!AE3<=$C$2","v":false},{"$f":"Valuation!AF3<=$C$2","v":false},{"$f":"Valuation!AG3<=$C$2","v":false}]
[null,"Full data switch",2005,null,null,null,{"$f":"AND(Valuation!H3>=$C$3,Valuation!H3<=$C$2)","v":false},{"$f":"AND(Valuation!I3>=$C$3,Valuation!I3<=$C$2)","v":false},{"$f":"AND(Valuation!J3>=$C$3,Valuation!J3<=$C$2)","v":false},{"$f":"AND(Valuation!K3>=$C$3,Valuation!K3<=$C$2)","v":false},{"$f":"AND(Valuation!L3>=$C$3,Valuation!L3<=$C$2)","v":false},{"$f":"AND(Valuation!M3>=$C$3,Valuation!M3<=$C$2)","v":true},{"$f":"AND(Valuation!N3>=$C$3,Valuation!N3<=$C$2)","v":true},{"$f":"AND(Valuation!O3>=$C$3,Valuation!O3<=$C$2)","v":true},{"$f":"AND(Valuation!P3>=$C$3,Valuation!P3<=$C$2)","v":true},{"$f":"AND(Valuation!Q3>=$C$3,Valuation!Q3<=$C$2)","v":true},{"$f":"AND(Valuation!R3>=$C$3,Valuation!R3<=$C$2)","v":true},{"$f":"AND(Valuation!S3>=$C$3,Valuation!S3<=$C$2)","v":true},{"$f":"AND(Valuation!T3>=$C$3,Valuation!T3<=$C$2)","v":true},{"$f":"AND(Valuation!U3>=$C$3,Valuation!U3<=$C$2)","v":true},{"$f":"AND(Valuation!V3>=$C$3,Valuation!V3<=$C$2)","v":true},{"$f":"AND(Valuation!W3>=$C$3,Valuation!W3<=$C$2)","v":true},{"$f":"AND(Valuation!X3>=$C$3,Valuation!X3<=$C$2)","v":false},{"$f":"AND(Valuation!Y3>=$C$3,Valuation!Y3<=$C$2)","v":false},{"$f":"AND(Valuation!Z3>=$C$3,Valuation!Z3<=$C$2)","v":false},{"$f":"AND(Valuation!AA3>=$C$3,Valuation!AA3<=$C$2)","v":false},{"$f":"AND(Valuation!AB3>=$C$3,Valuation!AB3<=$C$2)","v":false},{"$f":"AND(Valuation!AC3>=$C$3,Valuation!AC3<=$C$2)","v":false},{"$f":"AND(Valuation!AD3>=$C$3,Valuation!AD3<=$C$2)","v":false},{"$f":"AND(Valuation!AE3>=$C$3,Valuation!AE3<=$C$2)","v":false},{"$f":"AND(Valuation!AF3>=$C$3,Valuation!AF3<=$C$2)","v":false},{"$f":"AND(Valuation!AG3>=$C$3,Valuation!AG3<=$C$2)","v":false}]
[null,"Last historic year",null,null,null,null,{"$f":"Valuation!H3=$C$2","v":false},{"$f":"Valuation!I3=$C$2","v":false},{"$f":"Valuation!J3=$C$2","v":false},{"$f":"Valuation!K3=$C$2","v":false},{"$f":"Valuation!L3=$C$2","v":false},{"$f":"Valuation!M3=$C$2","v":false},{"$f":"Valuation!N3=$C$2","v":false},{"$f":"Valuation!O3=$C$2","v":false},{"$f":"Valuation!P3=$C$2","v":false},{"$f":"Valuation!Q3=$C$2","v":false},{"$f":"Valuation!R3=$C$2","v":false},{"$f":"Valuation!S3=$C$2","v":false},{"$f":"Valuation!T3=$C$2","v":false},{"$f":"Valuation!U3=$C$2","v":false},{"$f":"Valuation!V3=$C$2","v":false},{"$f":"Valuation!W3=$C$2","v":true},{"$f":"Valuation!X3=$C$2","v":false},{"$f":"Valuation!Y3=$C$2","v":false},{"$f":"Valuation!Z3=$C$2","v":false},{"$f":"Valuation!AA3=$C$2","v":false},{"$f":"Valuation!AB3=$C$2","v":false},{"$f":"Valuation!AC3=$C$2","v":false},{"$f":"Valuation!AD3=$C$2","v":false},{"$f":"Valuation!AE3=$C$2","v":false},{"$f":"Valuation!AF3=$C$2","v":false},{"$f":"Valuation!AG3=$C$2","v":false}]
[".","BALANCE SHEET",null,null,null,null,null,null,null,null,null,null,null,null,null,null,null,null,null,null,null,null,"Financing","Direct","Net Debt","Total receivables","Total other current liabilities"]
[null,"Intangible assets",null,null,null,null,null,null,null,null,null,20672,21279,21205,84678,81611,87813,89041,91216,94236,81754,72920,null,1]
[null,"Property plant and equipment",null,null,null,null,null,null,null,null,null,20355,20367,22109,34043,31825,32420,31848,31991,31738,28748,26678,null,1]
[null,"Investments in associates",null,null,null,null,null,null,null,null,null,1105,579,622,2224,2667,4877,5051,6241,3771,4277,4676,-1]
[null,"Receivables",null,null,null,null,null,null,null,null,null,1235,1139,1476,1707,1604,1747,1650,2208,2049,2131,1854,null,1,null,1]
[null,"Deferred tax assets",null,null,null,null,null,null,null,null,null,1005,822,733,1254,1483,1301,1199,1170,1130,1430,1697,null,1]
{"$rows_left_out":179}
{"sheet":"Assumptions and Free Cash Flow","index":5,"n_rows":188,"n_cols":33,"rows_kept":188,"cut":false,"hidden":false,"merged":[]}
[null,null,null,null,null,null,null,null,2001,2002,2003,2004,2005,2006,2007,2008,2009,2010,2011,2012,2013,2014,2015,2016,2017,2018,2019,2020,2021,2022,2023,2024,2025]
[null,null,"Historical switch",2015,null,null,null,{"$f":"Valuation!H3<=$D$2","v":true},{"$f":"Valuation!I3<=$D$2","v":true},{"$f":"Valuation!J3<=$D$2","v":true},{"$f":"Valuation!K3<=$D$2","v":true},{"$f":"Valuation!L3<=$D$2","v":true},{"$f":"Valuation!M3<=$D$2","v":true},{"$f":"Valuation!N3<=$D$2","v":true},{"$f":"Valuation!O3<=$D$2","v":true},{"$f":"Valuation!P3<=$D$2","v":true},{"$f":"Valuation!Q3<=$D$2","v":true},{"$f":"Valuation!R3<=$D$2","v":true},{"$f":"Valuation!S3<=$D$2","v":true},{"$f":"Valuation!T3<=$D$2","v":true},{"$f":"Valuation!U3<=$D$2","v":true},{"$f":"Valuation!V3<=$D$2","v":true},{"$f":"Valuation!W3<=$D$2","v":true},{"$f":"Valuation!X3<=$D$2","v":false},{"$f":"Valuation!Y3<=$D$2","v":false},{"$f":"Valuation!Z3<=$D$2","v":false},{"$f":"Valuation!AA3<=$D$2","v":false},{"$f":"Valuation!AB3<=$D$2","v":false},{"$f":"Valuation!AC3<=$D$2","v":false},{"$f":"Valuation!AD3<=$D$2","v":false},{"$f":"Valuation!AE3<=$D$2","v":false},{"$f":"Valuation!AF3<=$D$2","v":false},{"$f":"Valuation!AG3<=$D$2","v":false}]
[null,null,"Full data switch",2005,null,null,null,{"$f":"AND(Valuation!H3>=$D$3,Valuation!H3<=$D$2)","v":false},{"$f":"AND(Valuation!I3>=$D$3,Valuation!I3<=$D$2)","v":false},{"$f":"AND(Valuation!J3>=$D$3,Valuation!J3<=$D$2)","v":false},{"$f":"AND(Valuation!K3>=$D$3,Valuation!K3<=$D$2)","v":false},{"$f":"AND(Valuation!L3>=$D$3,Valuation!L3<=$D$2)","v":false},{"$f":"AND(Valuation!M3>=$D$3,Valuation!M3<=$D$2)","v":true},{"$f":"AND(Valuation!N3>=$D$3,Valuation!N3<=$D$2)","v":true},{"$f":"AND(Valuation!O3>=$D$3,Valuation!O3<=$D$2)","v":true},{"$f":"AND(Valuation!P3>=$D$3,Valuation!P3<=$D$2)","v":true},{"$f":"AND(Valuation!Q3>=$D$3,Valuation!Q3<=$D$2)","v":true},{"$f":"AND(Valuation!R3>=$D$3,Valuation!R3<=$D$2)","v":true},{"$f":"AND(Valuation!S3>=$D$3,Valuation!S3<=$D$2)","v":true},{"$f":"AND(Valuation!T3>=$D$3,Valuation!T3<=$D$2)","v":true},{"$f":"AND(Valuation!U3>=$D$3,Valuation!U3<=$D$2)","v":true},{"$f":"AND(Valuation!V3>=$D$3,Valuation!V3<=$D$2)","v":true},{"$f":"AND(Valuation!W3>=$D$3,Valuation!W3<=$D$2)","v":true},{"$f":"AND(Valuation!X3>=$D$3,Valuation!X3<=$D$2)","v":false},{"$f":"AND(Valuation!Y3>=$D$3,Valuation!Y3<=$D$2)","v":false},{"$f":"AND(Valuation!Z3>=$D$3,Valuation!Z3<=$D$2)","v":false},{"$f":"AND(Valuation!AA3>=$D$3,Valuation!AA3<=$D$2)","v":false},{"$f":"AND(Valuation!AB3>=$D$3,Valuation!AB3<=$D$2)","v":false},{"$f":"AND(Valuation!AC3>=$D$3,Valuation!AC3<=$D$2)","v":false},{"$f":"AND(Valuation!AD3>=$D$3,Valuation!AD3<=$D$2)","v":false},{"$f":"AND(Valuation!AE3>=$D$3,Valuation!AE3<=$D$2)","v":false},{"$f":"AND(Valuation!AF3>=$D$3,Valuation!AF3<=$D$2)","v":false},{"$f":"AND(Valuation!AG3>=$D$3,Valuation!AG3<=$D$2)","v":false}]
[null,null,"Last historic year",null,null,null,null,{"$f":"Valuation!H3=$D$2","v":false},{"$f":"Valuation!I3=$D$2","v":false},{"$f":"Valuation!J3=$D$2","v":false},{"$f":"Valuation!K3=$D$2","v":false},{"$f":"Valuation!L3=$D$2","v":false},{"$f":"Valuation!M3=$D$2","v":false},{"$f":"Valuation!N3=$D$2","v":false},{"$f":"Valuation!O3=$D$2","v":false},{"$f":"Valuation!P3=$D$2","v":false},{"$f":"Valuation!Q3=$D$2","v":false},{"$f":"Valuation!R3=$D$2","v":false},{"$f":"Valuation!S3=$D$2","v":false},{"$f":"Valuation!T3=$D$2","v":false},{"$f":"Valuation!U3=$D$2","v":false},{"$f":"Valuation!V3=$D$2","v":false},{"$f":"Valuation!W3=$D$2","v":true},{"$f":"Valuation!X3=$D$2","v":false},{"$f":"Valuation!Y3=$D$2","v":false},{"$f":"Valuation!Z3=$D$2","v":false},{"$f":"Valuation!AA3=$D$2","v":false},{"$f":"Valuation!AB3=$D$2","v":false},{"$f":"Valuation!AC3=$D$2","v":false},{"$f":"Valuation!AD3=$D$2","v":false},{"$f":"Valuation!AE3=$D$2","v":false},{"$f":"Valuation!AF3=$D$2","v":false},{"$f":"Valuation!AG3=$D$2","v":false}]
[]
[". Financial Ratios for Analysis of Assumptions"]
[]
[null,"EBITDA Analysis"]
[null,null,"Operating profit before depreciation amortisation and impairment",null,null,null,null,{"$f":"'Historic Data from PDF'!C100","v":0},{"$f":"'Historic Data from PDF'!H100","v":0},{"$f":"'Historic Data from PDF'!I100","v":0},{"$f":"'Historic Data from PDF'!J100","v":0},{"$f":"'Historic Data from PDF'!K100","v":0},{"$f":"'Historic Data from PDF'!L100","v":6314},{"$f":"'Historic Data from PDF'!M100","v":7035},{"$f":"'Historic Data from PDF'!N100","v":8134},{"$f":"'Historic Data from PDF'!O100","v":11610},{"$f":"'Historic Data from PDF'!P100","v":13169},{"$f":"'Historic Data from PDF'!Q100","v":14236},{"$f":"'Historic Data from PDF'!R100","v":13600},{"$f":"'Historic Data from PDF'!S100","v":13812},{"$f":"'Historic Data from PDF'!T100","v":13592},{"$f":"'Historic Data from PDF'!U100","v":13338},{"$f":"'Historic Data from PDF'!V100","v":13213}]
[null,null,"Less: Restructuring Cash Payments from Cash Flow",null,true,null,null,{"$f":"IF($E$10,'Historic Data from PDF'!G106)","v":0},{"$f":"IF($E$10,'Historic Data from PDF'!H106)","v":0},{"$f":"IF($E$10,'Historic Data from PDF'!I106)","v":0},{"$f":"IF($E$10,'Historic Data from PDF'!J106)","v":0},{"$f":"IF($E$10,'Historic Data from PDF'!K106)","v":0},{"$f":"IF($E$10,'Historic Data from PDF'!L106)","v":-537},{"$f":"IF($E$10,'Historic Data from PDF'!M106)","v":-477},{"$f":"IF($E$10,'Historic Data from PDF'!N106)","v":-379},{"$f":"IF($E$10,'Historic Data from PDF'!O106)","v":-482},{"$f":"IF($E$10,'Historic Data from PDF'!P106)","v":-507},{"$f":"IF($E$10,'Historic Data from PDF'!Q106)","v":-446},{"$f":"IF($E$10,'Historic Data from PDF'!R106)","v":-448},{"$f":"IF($E$10,'Historic Data from PDF'!S106)","v":-324},{"$f":"IF($E$10,'Historic Data from PDF'!T106)","v":-617},{"$f":"IF($E$10,'Historic Data from PDF'!U106)","v":-397},{"$f":"IF($E$10,'Historic Data from PDF'!V106)","v":-586}]
{"$rows_left_out":179}
{"sheet":"Tornado Diagram","index":6,"n_rows":0,"n_cols":0,"rows_kept":0,"cut":false,"hidden":false,"merged":[]}

{"sheet":"LBO transaction assumption","index":7,"n_rows":33,"n_cols":22,"rows_kept":33,"cut":false,"hidden":false,"merged":[]}
[]
[null,null,null,null,null,null,null,null,null,null,"Holding Period and Exit EV/EBITDA"]
[null,null,"Entry year",2016,null,null,null,null,{"$f":"LBO!D33","v":1.7687190329755742E-2},1,{"$f":"J3+1","v":2},{"$f":"K3+1","v":3},4,5,6,7,8,9,10,null,"Max","Hold Period"]
[null,null,"Holding period",10,null,null,null,null,10,-0.28382381861247308,-0.11567878799628595,-5.099353219522984E-2,-1.4219024689083426E-2,8.6857521491834344E-3,2.437007791431034E-2,3.5813525101848764E-2,4.4550392455368959E-2,5.1451397864136883E-2,5.3355955567075286E-2,null,{"$f":"MAX(J4:S4)","v":5.3355955567075286E-2},{"$f":"MATCH(U4,J4:S4,0)","v":10}]
[null,null,"Exit year",{"$f":"D3+D4","v":2026},null,null,null,null,{"$f":"I4+1","v":11},-0.21656140879066377,-7.6183266126850113E-2,-2.3741864952101843E-2,6.3071302816279928E-3,2.4941417102179786E-2,3.7678945463753166E-2,4.6969391414926065E-2,5.4066574130923639E-2,5.96790174987476E-2,6.0470910002914158E-2,null,{"$f":"MAX(J5:S5)","v":6.0470910002914158E-2},{"$f":"MATCH(U5,J5:S5,0)","v":10}]
[null,null,null,null,null,null,null,null,{"$f":"I5+1","v":12},-0.14929899896885424,-3.8345960973502402E-2,2.0231958240299885E-3,2.5603223116472673E-2,4.0181663351850805E-2,5.0141569215023774E-2,5.7412498439393111E-2,6.2976693012747997E-2,6.7387103779901647E-2,6.7144262072750038E-2,null,{"$f":"MAX(J6:S6)","v":6.7387103779901647E-2},{"$f":"MATCH(U6,J6:S6,0)","v":9}]
[null,null,"Current EV/EBITDA multiple",10.5,null,null,null,null,{"$f":"I6+1","v":13},-8.2036589147045036E-2,-1.9740469652554937E-3,2.6489719867333061E-2,4.3829433959330144E-2,5.4539891084508074E-2,6.1868998954725862E-2,6.7235732926712366E-2,7.1358887775120117E-2,7.4641744911566832E-2,7.3431096590441447E-2,null,{"$f":"MAX(J7:S7)","v":7.4641744911566832E-2},{"$f":"MATCH(U7,J7:S7,0)","v":9}]
[null,null,"Acq. Premium",0.2,null,null,null,null,{"$f":"I7+1","v":14},-1.4774179325235615E-2,3.3090596575993114E-2,4.9810328728736142E-2,6.1115348034856742E-2,6.8123996792782915E-2,7.2951168433935898E-2,7.6514482089224289E-2,7.9276749767849708E-2,8.1496893888948652E-2,7.9376573709128762E-2,null,{"$f":"MAX(J8:S8)","v":8.1496893888948652E-2},{"$f":"MATCH(U8,J8:S8,0)","v":9}]
[null,null,"Entry EV/EBITDA multiple",{"$f":"D7*(1+D8)","v":12.6}]
[]
{"$rows_left_out":24}
{"sheet":"LBO","index":8,"n_rows":104,"n_cols":21,"rows_kept":104,"cut":false,"hidden":false,"merged":[]}
[]
[]
[null,"Column in Summary Page",null,null,{"$f":"MATCH(E4,Valuation!3:3)","v":25},{"$f":"MATCH(F4,Valuation!3:3)","v":26},{"$f":"MATCH(G4,Valuation!3:3)","v":27},{"$f":"MATCH(H4,Valuation!3:3)","v":28},{"$f":"MATCH(I4,Valuation!3:3)","v":29},{"$f":"MATCH(J4,Valuation!3:3)","v":30},{"$f":"MATCH(K4,Valuation!3:3)","v":31},{"$f":"MATCH(L4,Valuation!3:3)","v":32},{"$f":"MATCH(M4,Valuation!3:3)","v":33},{"$f":"MATCH(N4,Valuation!3:3)","v":33},{"$f":"MATCH(O4,Valuation!3:3)","v":33},{"$f":"MATCH(P4,Valuation!3:3)","v":33},{"$f":"MATCH(Q4,Valuation!3:3)","v":33},{"$f":"MATCH(R4,Valuation!3:3)","v":33},{"$f":"MATCH(S4,Valuation!3:3)","v":33},{"$f":"MATCH(T4,Valuation!3:3)","v":33},{"$f":"MATCH(U4,Valuation!3:3)","v":33}]
[null,"Year",null,2016,{"$f":"'LBO transaction assumption'!D3+1","v":2017},{"$f":"E4+1","v":2018},{"$f":"F4+1","v":2019},2020,2021,2022,2023,2024,2025,2026,2027,2028,{"$f":"P4+1","v":2029},{"$f":"Q4+1","v":2030},{"$f":"R4+1","v":2031},{"$f":"S4+1","v":2032},{"$f":"T4+1","v":2033}]
[null,"Exit year",null,{"$f":"'LBO transaction assumption'!D5","v":2026},{"$f":"E4=$D$5","v":false},false,false,false,false,false,false,false,false,true,false,false,false,false,false,false,false]
[null,"Holding period",null,null,{"$f":"E4<=$D$5","v":true},true,true,true,true,true,true,true,true,true,false,false,false,false,false,false,false]
[null,"Date",null,{"$f":"IF(D5,DATE(D4,12,31),DATE(D4,7,1))","v":"2016-12-31"},"2017-07-01","2018-07-01","2019-07-01","2020-07-01","2021-07-01","2022-07-01","2023-07-01","2024-07-01","2025-07-01","2026-12-31","2027-07-01","2028-07-01","2029-07-01","2030-07-01","2031-07-01","2032-07-01","2033-07-01"]
[null,"Period",null,null,1,{"$f":"E8+1","v":2},{"$f":"F8+1","v":3},4,5,6,7,8,9,10,11,12,{"$f":"P8+1","v":13},{"$f":"Q8+1","v":14},{"$f":"R8+1","v":15},{"$f":"S8+1","v":16},{"$f":"T8+1","v":17}]
[]
["Operating Cash Flow and Transferred Data"]
{"$rows_left_out":95}
{"sheet":"Scatter","index":9,"n_rows":0,"n_cols":0,"rows_kept":0,"cut":false,"hidden":false,"merged":[]}

{"sheet":"Graphs","index":10,"n_rows":230,"n_cols":29,"rows_kept":230,"cut":false,"hidden":false,"merged":[]}
[null,"Titles from Assumption Page"]
[null,null,null,"From Union Function","Row"]
[null,null,null,null,null,null,null,null,null,"Code #","Row"]
[null,{"$f":"IF(ISTEXT('Assumptions and Free Cash Flow'!C8),'Assumptions and Free Cash Flow'!C8,\"\")","v":""},null,{"$f":"union(B4:B230,A6)","v":0},{"$f":"MATCH(D4,'Assumptions and Free Cash Flow'!C:C,0)","v":{"$error":"#N/A"}},null,null,null,null,115,{"$f":"INDEX(E5:E130,J4)","v":188}]
[null,{"$f":"IF(ISTEXT('Assumptions and Free Cash Flow'!C9),'Assumptions and Free Cash Flow'!C9,\"\")","v":"Operating profit before depreciation amortisation and impairment"},null,"Operating profit before depreciation amortisation and impairment",{"$f":"MATCH(D5,'Assumptions and Free Cash Flow'!C:C,0)","v":9}]
[null,{"$f":"IF(ISTEXT('Assumptions and Free Cash Flow'!C10),'Assumptions and Free Cash Flow'!C10,\"\")","v":"Less: Restructuring Cash Payments from Cash Flow"},null,"Less: Restructuring Cash Payments from Cash Flow",{"$f":"MATCH(D6,'Assumptions and Free Cash Flow'!C:C,0)","v":10},null,null,null,null,43,{"$f":"INDEX(E5:E128,J6)","v":72}]
[null,{"$f":"IF(ISTEXT('Assumptions and Free Cash Flow'!C11),'Assumptions and Free Cash Flow'!C11,\"\")","v":"Less: Income from associates"},null,"Less: Income from associates",{"$f":"MATCH(D7,'Assumptions and Free Cash Flow'!C:C,0)","v":11}]
[null,{"$f":"IF(ISTEXT('Assumptions and Free Cash Flow'!C12),'Assumptions and Free Cash Flow'!C12,\"\")","v":"EBITDA"},null,"EBITDA",{"$f":"MATCH(D8,'Assumptions and Free Cash Flow'!C:C,0)","v":12}]
[null,{"$f":"IF(ISTEXT('Assumptions and Free Cash Flow'!C13),'Assumptions and Free Cash Flow'!C13,\"\")","v":""},null,"Net Revenues",{"$f":"MATCH(D9,'Assumptions and Free Cash Flow'!C:C,0)","v":14},null,"Graph"]
[null,{"$f":"IF(ISTEXT('Assumptions and Free Cash Flow'!C14),'Assumptions and Free Cash Flow'!C14,\"\")","v":"Net Revenues"},null,"COGS ",{"$f":"MATCH(D10,'Assumptions and Free Cash Flow'!C:C,0)","v":15},null,null,null,{"$f":"'Assumptions and Free Cash Flow'!M1","v":2005},{"$f":"'Assumptions and Free Cash Flow'!N1","v":2006},{"$f":"'Assumptions and Free Cash Flow'!O1","v":2007},{"$f":"'Assumptions and Free Cash Flow'!P1","v":2008},{"$f":"'Assumptions and Free Cash Flow'!Q1","v":2009},{"$f":"'Assumptions and Free Cash Flow'!R1","v":2010},{"$f":"'Assumptions and Free Cash Flow'!S1","v":2011},{"$f":"'Assumptions and Free Cash Flow'!T1","v":2012},{"$f":"'Assumptions and Free Cash Flow'!U1","v":2013},{"$f":"'Assumptions and Free Cash Flow'!V1","v":2014},{"$f":"'Assumptions and Free Cash Flow'!W1","v":2015},{"$f":"'Assumptions and Free Cash Flow'!X1","v":2016},{"$f":"'Assumptions and Free Cash Flow'!Y1","v":2017},{"$f":"'Assumptions and Free Cash Flow'!Z1","v":2018},{"$f":"'Assumptions and Free Cash Flow'!AA1","v":2019},{"$f":"'Assumptions and Free Cash Flow'!AB1","v":2020},{"$f":"'Assumptions and Free Cash Flow'!AC1","v":2021},{"$f":"'Assumptions and Free Cash Flow'!AD1","v":2022},{"$f":"'Assumptions and Free Cash Flow'!AE1","v":2023},{"$f":"'Assumptions and Free Cash Flow'!AF1","v":2024},{"$f":"'Assumptions and Free Cash Flow'!AG1","v":2025}]
{"$rows_left_out":220}