{"text_format":"1","workbook":"xlsx","n_sheets":5,"sheets":["Debt Sizing Analysis","Simulation","Chart2","Wind Simulation Graoh","FPL Example"],"not_rendered":{"charts":4,"images":0,"macros":1,"external_links":0,"defined_names":4,"comments":0,"pivot_tables":0},"unopened":[{"sheet":"Chart2","index":2,"reason":"not_a_worksheet"},{"sheet":"Wind Simulation Graoh","index":3,"reason":"not_a_worksheet"}],"bounds":{"document_bytes":16777216,"sheet_cells":100000,"rows_first":2000,"rows_last":500,"rows_between":2000,"halvings":0,"cell_chars":16384,"cell_head_chars":4096},"cells_cut":0,"cells_raw":0,"read":"whole","date_system":"1900"}

{"sheet":"Debt Sizing Analysis","index":0,"n_rows":19,"n_cols":15,"rows_kept":19,"cut":false,"hidden":false,"merged":[]}
[null,null,null,null,null,null,null,null,null,null,null,null,"Decline  ","Decline  ","Decline  "]
[null,null,null,null,"Target","Pct Reduction","Production","vs Base","vs P90","DSCR Reqd",null,"Example","Rel to P50","Rel to P90","Rel to P50"]
[]
[null,null,null,"P50 DSCR",1.4,{"$f":"(E4-1)/E4","v":0.28571428571428564},{"$f":"INDEX('FPL Example'!$B$20:$H$20,'FPL Example'!$N$4)","v":536.6},null,null,{"$f":"E4","v":1.4},null,{"$f":"E4*100","v":140}]
[null,null,null,"P90 10-yr DSCR",1.35,{"$f":"(E5-1)/E5","v":0.2592592592592593},{"$f":"INDEX('FPL Example'!$B$18:$H$18,'FPL Example'!$N$4)","v":452.6},{"$f":"1-G5/G4","v":0.1565411852404025},null,{"$f":"(E16-1)+E5","v":1.5355943437914275},null,{"$f":"E5*100","v":135},{"$f":"1-L5/L4","v":3.5714285714285698E-2}]
[null,null,null,"P99 1-yr DSCR",1,0,{"$f":"INDEX('FPL Example'!B7:H7,'FPL Example'!N4)","v":335.76669015343009},{"$f":"1-G6/G4","v":0.37427005189446505},{"$f":"1-G6/G5","v":0.2581381127851744},{"$f":"E17","v":1.5981335127519596},null,100,{"$f":"1-L6/L4","v":0.2857142857142857},{"$f":"1-L6/L5","v":0.2592592592592593},{"$f":"1-L6/L4","v":0.2857142857142857}]
[]
[null,null,null,"Pct Reduction = DSCR-1/DSCR"]
[null,null,null,null,null,null,null,"Pct Red = (DSCR-1)/DSCR"]
[null,null,null,"Max P90 vs P50 Before P90 Constraint",{"$f":"M5","v":3.5714285714285698E-2},null,null,"Pct Red * DSCR = (DSCR-1)"]
[null,null,null,"Constraint Applied",{"$f":"IF(H5>E10,D5,D4)","v":"P90 10-yr DSCR"},null,null,"Pct Red * DSCR - DSCR = -1"]
[null,null,null,null,null,null,null,"DSCR - Pct Red * DSCR = 1"]
[null,null,null,"Max P99 vs P90 Before P99 Constraint",{"$f":"N6","v":0.2592592592592593},null,null,"DSCR * (1-Pct Red) = 1"]
[null,null,null,"Constraint Applied",{"$f":"IF(I6>E13,D6,D5)","v":"P90 10-yr DSCR"},null,null,"DSCR = 1/(1-Pct Red)"]
[]
[null,null,null,"Required DSCR Difference - P90",{"$f":"1/(1-H5)","v":1.1855943437914274}]
[null,null,null,"Required DSCR Difference - P99",{"$f":"1/(1-H6)","v":1.5981335127519596}]
[]
[null,null,null,"Final Constraint",{"$f":"INDEX(D4:D6,MATCH(MAX(J4:J6),J4:J6,0))","v":"P99 1-yr DSCR"}]

{"sheet":"Simulation","index":1,"n_rows":5026,"n_cols":22,"rows_kept":5026,"cut":false,"hidden":false,"merged":[]}
[]
[null,"Expected Production",100]
[null,null,null,null,null,null,null,0.5,0.25,0.1,0.05,0.01]
[null,null,"Value","Squared",null,null,null,"P50","P75","P90","P95","P99"]
[null,"Std Deviation from Wind Changes",12,{"$f":"C5^2","v":144},null,null,null,{"$f":"NORMINV($H$3,$C$2,C5)","v":100},{"$f":"NORMINV(I$3,$C$2,$C5)","v":91.906122997647017},84.621381213464787,80.26175647658232,72.083825511509914]
[null,"Standard Deviation from Permanent Factors",10,{"$f":"C6^2","v":100},null,"P 10-year",null,{"$f":"NORMINV($H$3,$C$2,C6)","v":100},93.255102498039179,87.184484344553994,83.551463730485267,76.736521259591598]
[null,"Total MSE",{"$f":"D7^0.5","v":15.620499351813308},{"$f":"SUM(D5:D6)","v":244},null,"P 1-year",null,{"$f":"NORMINV($H$3,$C$2,C7)","v":100},89.46413329425738,79.981524601095231,74.306564986376756,63.66128454145278]
[]
[null,"Year",1,2,3,4,5,6,7,8,9,10,11,12,13,14,15,16,17,18,19,20]
[null,"Base",100,100,100,100,100,100,100,100,100,100,100,100,100,100,100,100,100,100,100,100]
[null,"Random Factor",{"$f":"RAND()","v":0.49392551487715763},{"$f":"RAND()","v":0.55652314545941539},0.29094088843992361,0.89206402667654761,0.59886255552966916,0.23010398638387064,0.26580137552592287,3.0119380565067355E-2,0.89307375599510186,0.86734881791413365,0.91069191767420321,0.77600917532764324,0.50792944490038994,0.69852096450328038,0.41704115346426618,0.85762756712346366,0.25833383858179026,0.11306315711058024,0.47761173319273742,0.39929301379172455]
[null,"Std Deviations Away from Mean from Wind",{"$f":"NORMINV(C11,C10,$C$5)","v":99.817275225091834},{"$f":"NORMINV(D11,D10,$C$5)","v":101.70591874097897},93.39234265000799,114.85095635824405,103.004848739324,91.137946772940026,92.493264799226537,77.451496220589533,114.91649972993734,113.36735170313025,116.1403370369312,109.10541058758388,100.23852975629137,106.2418165369335,97.486374673907108,112.83665320327071,92.218112586954931,85.475227292876625,99.326217381604067,96.937870298940226]
[null,"Random Factor One - Time",{"$f":"RAND()","v":0.5522805037594879},{"$f":"C13","v":0.5522805037594879},{"$f":"D13","v":0.5522805037594879},0.5522805037594879,0.5522805037594879,0.5522805037594879,0.5522805037594879,0.5522805037594879,0.5522805037594879,0.5522805037594879,0.5522805037594879,0.5522805037594879,0.5522805037594879,0.5522805037594879,0.5522805037594879,0.5522805037594879,0.5522805037594879,0.5522805037594879,0.5522805037594879,0.5522805037594879]
[null,"Std Deviations Away from Mean from Permanent Factors",{"$f":"NORMINV(C13,C10,$C$6)","v":101.31425152413503},{"$f":"NORMINV(D13,D10,$C$6)","v":101.31425152413503},101.31425152413503,101.31425152413503,101.31425152413503,101.31425152413503,101.31425152413503,101.31425152413503,101.31425152413503,101.31425152413503,101.31425152413503,101.31425152413503,101.31425152413503,101.31425152413503,101.31425152413503,101.31425152413503,101.31425152413503,101.31425152413503,101.31425152413503,101.31425152413503]
[null,"Total Deviation",{"$f":"(C12-C10)+(C14-C10)","v":1.1315267492268646},{"$f":"(D12-D10)+(D14-D10)","v":3.0201702651140039},-5.2934058258569792,16.165207882379079,4.3191002634590347,-7.5478017029249429,-6.1924836766384317,-21.234252255275436,16.230751254072374,14.681603227265285,17.454588561066231,10.419662111718907,1.5527812804264016,7.5560680610685296,-1.1993738019578615,14.150904727405745,-6.4676358889100385,-13.210521182988344,0.6404689057390982,-1.7478781769247433]
[null,"Total Wind",{"$f":"C10+C15","v":101.13152674922686},{"$f":"D10+D15","v":103.020170265114},94.706594174143021,116.16520788237908,104.31910026345903,92.452198297075057,93.807516323361568,78.765747744724564,116.23075125407237,114.68160322726528,117.45458856106623,110.41966211171891,101.5527812804264,107.55606806106853,98.800626198042139,114.15090472740575,93.532364111089962,86.789478817011656,100.6404689057391,98.252121823075257]
[]
[null,"Wind Variation",{"$f":"C12","v":99.817275225091834},{"$f":"D12","v":101.70591874097897},93.39234265000799,114.85095635824405,103.004848739324,91.137946772940026,92.493264799226537,77.451496220589533,114.91649972993734,113.36735170313025,116.1403370369312,109.10541058758388,100.23852975629137,106.2418165369335,97.486374673907108,112.83665320327071,92.218112586954931,85.475227292876625,99.326217381604067,96.937870298940226]
[null,"P95 with Permanent Factors",{"$f":"NORMINV(5%,C18,$C$6)","v":83.368738955577101},{"$f":"NORMINV(5%,D18,$C$6)","v":85.25738247146424},76.943806380493271,98.402420088729315,86.556312469809285,74.689410503425307,76.044728529711819,61.002959951074807,98.467963460422624,96.918815433615521,99.691800767416481,92.656874318069157,83.789993486776638,89.793280267418766,81.037838404392375,96.388116933755981,75.769576317440197,69.026691023361906,82.877681112089334,80.489334029425493]
[null,"P5 with Permanent Factors",{"$f":"NORMINV(95%,C18,$C$6)","v":116.26581149460655},{"$f":"NORMINV(95%,D18,$C$6)","v":118.15445501049369},109.84087891952271,131.29949262775875,119.45338500883872,107.58648304245474,108.94180106874126,93.900032490104252,131.36503599945206,129.81588797264496,132.58887330644592,125.55394685709859,116.68706602580609,122.69035280644822,113.93491094342183,129.28518947278542,108.66664885646965,101.92376356239134,115.77475365111879,113.38640656845494]
[]
[null,"P50",{"$f":"C10","v":100},{"$f":"D10","v":100},100,100,100,100,100,100,100,100,100,100,100,100,100,100,100,100,100,100]
[null,"Wind Speed Variation",{"$f":"C12","v":99.817275225091834},{"$f":"D12","v":101.70591874097897},93.39234265000799,114.85095635824405,103.004848739324,91.137946772940026,92.493264799226537,77.451496220589533,114.91649972993734,113.36735170313025,116.1403370369312,109.10541058758388,100.23852975629137,106.2418165369335,97.486374673907108,112.83665320327071,92.218112586954931,85.475227292876625,99.326217381604067,96.937870298940226]
[null,"Total Variation",{"$f":"C16","v":101.13152674922686},{"$f":"D16","v":103.020170265114},94.706594174143021,116.16520788237908,104.31910026345903,92.452198297075057,93.807516323361568,78.765747744724564,116.23075125407237,114.68160322726528,117.45458856106623,110.41966211171891,101.5527812804264,107.55606806106853,98.800626198042139,114.15090472740575,93.532364111089962,86.789478817011656,100.6404689057391,98.252121823075257]
[]
[null,null,null,{"$f":"C16","v":101.13152674922686}]
[null,null,1,null,null,{"$f":"STDEV(D27:D5026)","v":{"$error":"#DIV/0!"}}]
[null,null,2]
[null,null,3]
[null,null,4]
[null,null,5]
[null,null,6]
[null,null,7]
[null,null,8]
[null,null,9]
[null,null,10]
[null,null,11]
[null,null,12]
[null,null,13]
[null,null,14]
[null,null,15]
[null,null,16]
[null,null,17]
[null,null,18]
[null,null,19]
[null,null,20]
[null,null,21]
[null,null,22]
[null,null,23]
[null,null,24]
[null,null,25]
[null,null,26]
[null,null,27]
[null,null,28]
[null,null,29]
[null,null,30]
[null,null,31]
[null,null,32]
[null,null,33]
[null,null,34]
[null,null,35]
[null,null,36]
[null,null,37]
[null,null,38]
[null,null,39]
[null,null,40]
[null,null,41]
[null,null,42]
[null,null,43]
[null,null,44]
[null,null,45]
[null,null,46]
[null,null,47]
[null,null,48]
[null,null,49]
[null,null,50]
[null,null,51]
[null,null,52]
[null,null,53]
[null,null,54]
[null,null,55]
[null,null,56]
[null,null,57]
[null,null,58]
[null,null,59]
[null,null,60]
[null,null,61]
[null,null,62]
[null,null,63]
[null,null,64]
[null,null,65]
[null,null,66]
[null,null,67]
[null,null,68]
[null,null,69]
[null,null,70]
[null,null,71]
[null,null,72]
[null,null,73]
[null,null,74]
[null,null,75]
[null,null,76]
[null,null,77]
[null,null,78]
[null,null,79]
[null,null,80]
[null,null,81]
[null,null,82]
[null,null,83]
[null,null,84]
[null,null,85]
[null,null,86]
[null,null,87]
[null,null,88]
[null,null,89]
[null,null,90]
[null,null,91]
[null,null,92]
[null,null,93]
[null,null,94]
[null,null,95]
[null,null,96]
[null,null,97]
[null,null,98]
[null,null,99]
[null,null,100]
[null,null,101]
[null,null,102]
[null,null,103]
[null,null,104]
[null,null,105]
[null,null,106]
[null,null,107]
[null,null,108]
[null,null,109]
[null,null,110]
[null,null,111]
[null,null,112]
[null,null,113]
[null,null,114]
[null,null,115]
[null,null,116]
[null,null,117]
[null,null,118]
[null,null,119]
[null,null,120]
[null,null,121]
[null,null,122]
[null,null,123]
[null,null,124]
[null,null,125]
[null,null,126]
[null,null,127]
[null,null,128]
[null,null,129]
[null,null,130]
[null,null,131]
[null,null,132]
[null,null,133]
[null,null,134]
[null,null,135]
[null,null,136]
[null,null,137]
[null,null,138]
[null,null,139]
[null,null,140]
[null,null,141]
[null,null,142]
[null,null,143]
[null,null,144]
[null,null,145]
[null,null,146]
[null,null,147]
[null,null,148]
[null,null,149]
[null,null,150]
[null,null,151]
[null,null,152]
[null,null,153]
[null,null,154]
[null,null,155]
[null,null,156]
[null,null,157]
[null,null,158]
[null,null,159]
[null,null,160]
[null,null,161]
[null,null,162]
[null,null,163]
[null,null,164]
[null,null,165]
[null,null,166]
[null,null,167]
[null,null,168]
[null,null,169]
[null,null,170]
[null,null,171]
[null,null,172]
[null,null,173]
[null,null,174]
[null,null,175]
[null,null,176]
[null,null,177]
[null,null,178]
[null,null,179]
[null,null,180]
[null,null,181]
[null,null,182]
[null,null,183]
[null,null,184]
[null,null,185]
[null,null,186]
[null,null,187]
[null,null,188]
[null,null,189]
[null,null,190]
[null,null,191]
[null,null,192]
[null,null,193]
[null,null,194]
[null,null,195]
[null,null,196]
[null,null,197]
[null,null,198]
[null,null,199]
[null,null,200]
[null,null,201]
[null,null,202]
[null,null,203]
[null,null,204]
[null,null,205]
[null,null,206]
[null,null,207]
[null,null,208]
[null,null,209]
[null,null,210]
[null,null,211]
[null,null,212]
[null,null,213]
[null,null,214]
[null,null,215]
[null,null,216]
[null,null,217]
[null,null,218]
[null,null,219]
[null,null,220]
[null,null,221]
[null,null,222]
[null,null,223]
[null,null,224]
[null,null,225]
[null,null,226]
[null,null,227]
[null,null,228]
[null,null,229]
[null,null,230]
[null,null,231]
[null,null,232]
[null,null,233]
[null,null,234]
[null,null,235]
[null,null,236]
[null,null,237]
[null,null,238]
[null,null,239]
[null,null,240]
[null,null,241]
[null,null,242]
[null,null,243]
[null,null,244]
[null,null,245]
[null,null,246]
[null,null,247]
[null,null,248]
[null,null,249]
[null,null,250]
[null,null,251]
[null,null,252]
[null,null,253]
[null,null,254]
[null,null,255]
[null,null,256]
[null,null,257]
[null,null,258]
[null,null,259]
[null,null,260]
[null,null,261]
[null,null,262]
[null,null,263]
[null,null,264]
[null,null,265]
[null,null,266]
[null,null,267]
[null,null,268]
[null,null,269]
[null,null,270]
[null,null,271]
[null,null,272]
[null,null,273]
[null,null,274]
[null,null,275]
[null,null,276]
[null,null,277]
[null,null,278]
[null,null,279]
[null,null,280]
[null,null,281]
[null,null,282]
[null,null,283]
[null,null,284]
[null,null,285]
[null,null,286]
[null,null,287]
[null,null,288]
[null,null,289]
[null,null,290]
[null,null,291]
[null,null,292]
[null,null,293]
[null,null,294]
[null,null,295]
[null,null,296]
[null,null,297]
[null,null,298]
[null,null,299]
[null,null,300]
[null,null,301]
[null,null,302]
[null,null,303]
[null,null,304]
[null,null,305]
[null,null,306]
[null,null,307]
[null,null,308]
[null,null,309]
[null,null,310]
[null,null,311]
[null,null,312]
[null,null,313]
[null,null,314]
[null,null,315]
[null,null,316]
[null,null,317]
[null,null,318]
[null,null,319]
[null,null,320]
[null,null,321]
[null,null,322]
[null,null,323]
[null,null,324]
[null,null,325]
[null,null,326]
[null,null,327]
[null,null,328]
[null,null,329]
[null,null,330]
[null,null,331]
[null,null,332]
[null,null,333]
[null,null,334]
[null,null,335]
[null,null,336]
[null,null,337]
[null,null,338]
[null,null,339]
[null,null,340]
[null,null,341]
[null,null,342]
[null,null,343]
[null,null,344]
[null,null,345]
[null,null,346]
[null,null,347]
[null,null,348]
[null,null,349]
[null,null,350]
[null,null,351]
[null,null,352]
[null,null,353]
[null,null,354]
[null,null,355]
[null,null,356]
[null,null,357]
[null,null,358]
[null,null,359]
[null,null,360]
[null,null,361]
[null,null,362]
[null,null,363]
[null,null,364]
[null,null,365]
[null,null,366]
[null,null,367]
[null,null,368]
[null,null,369]
[null,null,370]
[null,null,371]
[null,null,372]
[null,null,373]
[null,null,374]
{"$rows_left_out":4627}
{"sheet":"FPL Example","index":4,"n_rows":69,"n_cols":14,"rows_kept":69,"cut":false,"hidden":false,"merged":[]}
[]
["Site","LB II","CGordo","SW Mesa","Hancock","HWinds","New Mex","Montfort","Total project","Portfolio forecast",null,null,{"$f":"TRANSPOSE(B2:H2)","v":"LB II"}]
["Rated power",103.5,41.3,74.900000000000006,97.7,145.80000000000001,204,30,697,null,null,null,"CGordo"]
["Net energy (GWh/year)",333,104.5,231.8,288.5,476.5,536.6,57.6,2029,null,null,null,"SW Mesa",6]
["Net capacity factor (%)",36.700000000000003,28.9,35.299999999999997,33.700000000000003,37.299999999999997,30,21.9,33,null,null,null,"Hancock"]
["1-Year Average",null,null,null,null,null,null,null,null,null,null,null,"HWinds"]
["P99",{"$f":"_xlfn.NORM.INV(1%,B11,B45)","v":243.75646583578478},{"$f":"_xlfn.NORM.INV(1%,C11,C45)","v":72.536388714560005},171.26714322934382,184.83041118483402,321.77349227313567,335.76669015343009,21.817727189308314,null,null,null,null,"New Mex"]
["P95",269.89999999999998,81.900000000000006,189,215.2,367.1,394.6,32.299999999999997,1550,1756,null,null,"Montfort"]
["P90",283.8,86.9,198.4,231.4,391.2,425.9,43.8,1661,1816]
["P75",307.10000000000002,95.2,214.2,258.39999999999998,431.6,478.3,52.9,1838,1917]
["P50",333,104.5,231.8,288.5,476.5,536.6,57.6,2029,2029]
["Variation (%)"]
["P95/P50",81,78,82,75,77,74,56]
["P90/P50",85,83,86,80,82,79,76]
["P75/P50",92,91,92,90,91,89,92]
["10-Year Average"]
["P95",300.3,93.6,208.8,238.4,402.8,428.8,41.5,1714,1828]
["P90",307.5,96,213.9,249.5,419.1,452.6,48.9,1787,1872]
["P75",319.60000000000002,100,222.3,268,446.3,492.4,54.6,1903,1946]
["P50",333,104.5,231.8,288.5,476.5,536.6,57.6,2029,2029]
["Ratio of 1-year to 10-year (%)"]
["P95",90,88,91,90,91,92,78]
["P90",92,91,93,93,93,94,90]
["P75",96,95,96,96,97,97,97]
["P50",100,100,100,100,100,100,100]
[]
["Standard Deviation - 10yr",{"$f":"1-B18/B20","v":7.6576576576576572E-2},{"$f":"1-C18/C20","v":8.1339712918660267E-2},7.7221742881794619E-2,0.13518197573656843,0.12046169989506816,0.1565411852404025,0.15104166666666674]
["P95",19.880188403514833,6.626729467838282,13.983007133970681,30.458637278779612,44.806418511897391,65.537746480088757,9.7881049937794806]
["P90",19.897755724845648,6.6325852416152253,13.967444214695583,30.431861696822814,44.789457984554559,65.545548270079877,6.7886460708296976]
["P75",19.866869727974972,6.6717099832751989,14.084721075803206,30.393345479364822,44.774586998869168,65.531018057947577,4.4478066555168159]
["P50",10,10,10,10,10,10,10]
[]
["Goal Seek"]
[0.05,{"$f":"_xlfn.NORM.INV($A34,B$20,B28)-B17","v":0},0,0,0,0,0,0]
[0.1,0,0,0,0,0,0,0]
[0.25,0,0,0,0,0,0,0]
[0.5,0,0,0,0,0,0,0]
[]
[]
["Permanent Deviation/Mean",{"$f":"B28/B20","v":5.9700265476020517E-2},{"$f":"C28/C20","v":6.341367911806968E-2},6.0323585565015873E-2,0.10557586578433141,9.4032357842386963E-2,0.122135196571168,0.16993237836422709]
["Capacity Factor",{"$f":"B5/100","v":0.36700000000000005},0.28899999999999998,0.35299999999999998,0.33700000000000002,0.373,0.3,0.21899999999999997]
[]
[]
["Standard Deviation - 1 Year"]
["P95",38.362076093632623,13.739824401205977,26.020552405823675,44.563235779132661,66.510477411147491,86.32987013147121,15.38130784736776]
["P90",38.390963986761008,13.733352970873861,26.062158478817455,44.555366740732843,66.559943659973925,86.379668970212393,10.768197215798834]
["P75",38.399397459295074,13.788200632102097,26.093799045698582,44.626326777018683,66.568839610901378,86.435709338876606,6.9682304269763149]
["P50",20,20,20,20,20,20,20]
[]
["Goal Seek"]
[0.05,{"$f":"NORMINV($A51,B$20,B45)-B8","v":0},0,0,0,0,0,0]
[0.1,0,0,0,0,0,0,0]
[0.25,0,0,0,0,0,0,0]
[0.5,0,0,0,0,0,0,0]
[]
["Total Deviation/Mean",{"$f":"B45/B20","v":0.11520142971060848},{"$f":"C45/C20","v":0.13148157321728207},0.11225432444272508,0.15446528866250489,0.13958127473483209,0.16088309752417296,0.26703659457235696]
["Capacity Factor",{"$f":"B41","v":0.36700000000000005},{"$f":"C41","v":0.28899999999999998},0.35299999999999998,0.33700000000000002,0.373,0.3,0.21899999999999997]
[]
["Std Deviation - Wind Effect"]
["P95",{"$f":"(B45^2-B28^2)^0.5","v":32.808946817208472},{"$f":"(C45^2-C28^2)^0.5","v":12.036163472471573},21.944125842592623,32.529269869247088,49.153112471088335,56.192973432879484,11.864974998972658]
["P90",{"$f":"(B46^2-B29^2)^0.5","v":32.832079327193895},12.025547672988447,22.003331717818632,32.543547733255068,49.235460325549148,56.260361831204946,8.3587293175067146]
["P75",32.860633171754138,12.066596975542305,21.966041538113444,32.676499080856701,49.261006549020173,56.363263933201289,5.3640703983615685]
[]
["Wind Deviation/Mean",{"$f":"B60/B20","v":9.8525365817442853E-2},{"$f":"C60/C20","v":0.11517859782269448},9.4668359976672223E-2,0.1127531017998166,0.1031544857735327,0.10472041265911197,0.20598914928771975]
["Capacity Factor",{"$f":"B57","v":0.36700000000000005},{"$f":"C57","v":0.28899999999999998},0.35299999999999998,0.33700000000000002,0.373,0.3,0.21899999999999997]
[]
[null,{"$f":"B45","v":38.362076093632623},{"$f":"B67^2","v":1471.6488822136596}]
[null,{"$f":"B28","v":19.880188403514833},{"$f":"B68^2","v":395.22189095924563}]
[null,{"$f":"C69^0.5","v":32.808946817208472},{"$f":"C67-C68","v":1076.4269912544139}]