{"text_format":"1","workbook":"xlsx","n_sheets":6,"sheets":["Contents","Update","Amazon Model","Amazon DCF","Sensitivity and Presentation","Tornado Diagram"],"not_rendered":{"charts":3,"images":0,"macros":1,"external_links":0,"defined_names":0,"comments":1,"pivot_tables":0},"unopened":[{"sheet":"Tornado Diagram","index":5,"reason":"not_a_worksheet"}],"bounds":{"document_bytes":16777216,"sheet_cells":100000,"rows_first":2000,"rows_last":500,"rows_between":2000,"halvings":0,"cell_chars":16384,"cell_head_chars":4096},"cells_cut":0,"cells_raw":0,"read":"whole","date_system":"1900"}

{"sheet":"Contents","index":0,"n_rows":16,"n_cols":5,"rows_kept":16,"cut":false,"hidden":false,"merged":[]}
[null,null,"Go to Charts by Pressing Shift and Enter on Menu Item "]
[]
[null,null,"Sheet Tab","Description","Author"]
[null,1,"Contents"]
[null,2,"Update"]
[null,3,"Amazon Model"]
[null,4,"Amazon DCF"]
[null,5,"Sensitivity and Presentation"]
[null,6,"Tornado Diagram"]
[]
[null," File Name: ",null,{"$f":"File_name()","v":"C:\\Users\\stormy daniels\\Documents\\Courses\\Chapters\\Chapter 1. Models and Analysis\\A. Corporate Models Templates and Exercises\\A. Featured Corporate Finance Models\\Amazon - History from Database.xlsm"}]
[]
[null," Last Save Date ",null,{"$f":"lastsaved()","v":{"$error":"#VALUE!"}}]
[null," Last Save By",null,{"$f":"last_save_by()","v":"stormy daniels"}]
[]
[null," Colour Codes "]

{"sheet":"Update","index":1,"n_rows":116,"n_cols":15,"rows_kept":116,"cut":false,"hidden":false,"merged":[]}
["Contents","Update"]
[]
[null,null,null,null,null,"Fiscal Year",null,107,107,null,2013,2014,2015,2016,2017]
[null,"Income Statement",null,null,null,"Income Statement"]
[null,null,"Sales/Revenue",null,null,null,"Sales/Revenue",108,108,null,74450000,88990000,107010000,135990000,177870000]
[null,null,"COGS excluding D&A",null,null,null,"COGS excluding D&A",111,111,null,51380000,58570000,66000000,80780000,101000000]
[null,null,"Cash Gross Margin",null,null,null,"Cash Gross Margin","Calc",null,null,23070000,30420000,41010000,55210000,76870000]
[null,null,"Research & Development",null,null,null,"Research & Development",121,121,null,6570000,9280000,12540000,16090000,22620000]
[null,null,"Other SG&A",null,null,null,"Other SG&A",122,122,null,12850000,16650000,20410000,27280000,38990000]
[null,null,"Other Operating Expense",null,null,null,"Other Operating Expense",124,124,null,0,0,0,0,0]
[null,null,"EBITDA Calculated",null,null,null,"EBITDA Calculated",null,null,null,3650000,4490000,8060000,11840000,15260000]
[null,null,"Unusual Expense",null,null,null,"Unusual Expense",125,125,null,0,0,0,-67000,-109000]
[null,null,"Depreciation",null,null,null,"Depreciation",113,113,null,2630000,4010000.25,5380000,7200000,10570000]
[null,null,"Amortization of Intangibles",null,null,null,"Amortization of Intangibles",114,114,null,168000,181000,270000,287000,366000]
[null,null,"EBIT Computed",null,null,null,"EBIT Computed",null,null,null,852000,298999.75,2410000,4420000,4433000]
[null,null,"Non Operating Income/Expense",null,null,null,"Non Operating Income/Expense",127,127,null,-250000,-251000,-427000,-144000,23000]
[null,null,"Non-Operating Interest Income",null,null,null,"Non-Operating Interest Income",128,128,null,38000,39000,50000,100000,202000]
[null,null,"Equity in Affiliates (Pretax)",null,null,null,"Equity in Affiliates (Pretax)",129,129,null,0,0,0,0,0]
[null,null,"Interest Expense",null,null,null,"Interest Expense",130,130,null,141000,210000,459000,484000,848000]
[null,null,"Pretax Income Computed",null,null,null,"Pretax Income Computed",null,null,null,499000,-123000.25,1574000,3892000,3810000]
{"$rows_left_out":97}
{"sheet":"Amazon Model","index":2,"n_rows":447,"n_cols":29,"rows_kept":447,"cut":false,"hidden":false,"merged":[]}
["Contents","Amazon Model",null,2,"Jan Start",{"$f":"F2=1","v":true}]
[null,{"$f":"INDEX(INDIRECT(#REF!&\"A:A\"),MATCH(C10,INDIRECT(#REF!&\"A:A\"),0)+1)","v":{"$error":"#REF!"}},null,null,"First Month",1,null,{"$f":"DATE(F3,$F$2,1)","v":"2012-01-01"},{"$f":"H3+1","v":"2013-01-01"},{"$f":"I3+1","v":"2014-01-01"},{"$f":"J3+1","v":"2015-01-01"},{"$f":"K3+1","v":"2016-01-01"},{"$f":"L3+1","v":"2017-01-01"},{"$f":"M3+1","v":"2018-01-01"},"2019-01-01","2020-01-01","2021-01-01","2022-01-01","2023-01-01","2024-01-01","2025-01-01","2026-01-01","2027-01-01","2028-01-01","2029-01-01","2030-01-01","2031-01-01","2032-01-01"]
[null,"Last Annual Date",null,null,"First Year",{"$f":"IF(F1,H13,H13-1)","v":2012},null,{"$f":"EOMONTH(H2,11)","v":"2012-12-31"},"2013-12-31","2014-12-31","2015-12-31","2016-12-31","2017-12-31","2018-12-31","2019-12-31","2020-12-31","2021-12-31","2022-12-31","2023-12-31","2024-12-31","2025-12-31","2026-12-31","2027-12-31","2028-12-31","2029-12-31","2030-12-31","2031-12-31","2032-12-31"]
[null,null,null,null,null,null,null,{"$f":"YEAR(H3)","v":2012},{"$f":"YEAR(I3)","v":2013},2014,2015,2016,2017,2018,2019,2020,2021,2022,2023,2024,2025,2026,2027,2028,2029,2030,2031,2032]
[null,null,"Histoic Year",null,"Last Year",{"$f":"IF(F1,L13,L13-1)","v":2016},null,{"$f":"H3<=$F$6","v":true},true,true,true,true,false,false,false,false,false,false,false,false,false,false,false,false,false,false,false,false]
[null,null,"Partial Historic Year",null,null,{"$f":"DATE(F5+1,F2,1)-1","v":"2016-12-31"},null,{"$f":"YEAR(H3)=$F$7","v":false},false,false,false,false,true,false,false,false,false,false,false,false,false,false,false,false,false,false,false,false]
[null,null,"Assumption Year",null,"Annual Row",{"$f":"F5+1","v":2017},null,{"$f":"OR(H5:H6)","v":true},true,true,true,true,true,false,false,false,false,false,false,false,false,false,false,false,false,false,false,false]
[]
["Profit and Loss"]
[null,null,"View Ratios"]
[null,null,"All values USD millions."]
[]
[null,null,"Fiscal Year",null,null,null,null,2012,2013,2014,2015,2016,2017,2018,2019,2020,2021,2022,2023,2024,2025,2026,2027,2028,2029,2030,2031,2032]
[null,null,"Income Statement"]
[null,null,null,"Sales/Revenue",null,null,null,61090000,74450000,88990000,107010000,135990000]
[null,null,null,"COGS excluding D&A",null,null,null,44140000,51380000,58570000,66000000,80780000]
[null,null,null,"Cash Gross Margin",null,null,null,16950000,23070000,30420000,41010000,55210000]
[null,null,null,"Research & Development",null,null,null,4560000,6570000,9280000,12540000,16090000]
[null,null,null,"Other SG&A",null,null,null,9720000,12850000,16650000,20410000,27280000]
[null,null,null,"Other Operating Expense",null,null,null,0,0,0,0,0]
{"$rows_left_out":428}
{"sheet":"Amazon DCF","index":3,"n_rows":121,"n_cols":16384,"rows_kept":121,"cut":false,"hidden":false,"merged":[]}
["Contents"]
[null,"Period",null,null,{"$f":"E72","v":1638.1935494511924},null,null,1,2,3,4,5,6,7,8,9,10,11,12,13,14,15,16,17,18,19,20]
[null,"Year",null,null,null,null,null,{"$f":"E9","v":2018},{"$f":"H3+1","v":2019},{"$f":"I3+1","v":2020},2021,2022,2023,2024,2025,2026,2027,2028,2029,2030,2031,2032,2033,2034,2035,2036,2037]
[null,"Holding Period",null,null,null,{"$f":"E9","v":2018},{"$f":"E10","v":2030},{"$f":"H3<=$G$4","v":true},{"$f":"I3<=$G$4","v":true},true,true,true,true,true,true,true,true,true,true,true,false,false,false,false,false,false,false]
[null,"Exit Period",null,null,null,null,{"$f":"E10","v":2030},{"$f":"H3=$G$5","v":false},{"$f":"I3=$G$5","v":false},false,false,false,false,false,false,false,false,false,false,true,false,false,false,false,false,false,false]
[null,null,null,null,null,null,"Growth Method",null,{"$f":"E2","v":1638.1935494511924}]
[null,null,null,null,null,null,"EV/EBITDA Method",null,{"$f":"E82","v":1324.7241774842962}]
["Value Assumptions"]
[null,"Valuation Start",null,null,2018]
[null,"Holding Period",null,null,2030]
[]
[null,"WACC - Required Return",null,null,0.09]
[null,"Terminal Growth",null,null,0.04]
[null,"Terminal EV/EBITDA",null,null,14]
[null,"Terminal ROIC",null,null,0.15]
[]
[null,"Depreciation Rate",null,null,{"$f":"LOOKUP(F17,'Amazon Model'!140:140,'Amazon Model'!172:172)","v":0.23960066555740434},2016]
[null,"Depreciation Life",null,null,{"$f":"1/E17","v":4.1736111111111107}]
[null,"Stable Cap Exp to Revenues",null,null,0]
[null,"Working Capital to EBITDA",null,null,-1.6]
{"$rows_left_out":102}
{"sheet":"Sensitivity and Presentation","index":4,"n_rows":39,"n_cols":22,"rows_kept":39,"cut":false,"hidden":false,"merged":[]}
["Contents","Sensitivity and Presentation",null,"Scenario Number",null,1]
[null,null,null,null,null,null,null,{"$f":"'Amazon DCF'!E82","v":1324.7241774842962}]
[]
[null,null,null,"WACC"]
[null,null,null,"Terminal Growth"]
[null,null,null,"Explicit Period"]
[null,null,null,"Terminal EV/EBITDA"]
[null,null,null,null,null,null,null,null,null,null,null,null,null,null,null,null,null,null,null,null,null,"Value Driver"]
[null,null,null,null,1,null,2,null,3,null,4,null,5,null,6,7,8,8,null,"DCF Value Growth","EV/EBITDA"]
[null,null,null,null,"Sales Growth",null,"COGS Percent",null,"R&D Growth",null,"SG&A to Sales",null,"Cap Exp to Sales",null,"A/R to Sales","Inventory to COGS","A/P to Expense","Other Liabilities to Exp",null,{"$f":"'Amazon DCF'!I6","v":1638.1935494511924},{"$f":"'Amazon DCF'!I7","v":1324.7241774842962}]
[null,null,null,"Base Case",1,{"$f":"INDEX('Amazon Model'!$C$203:$C$206,'Sensitivity and Presentation'!E11)","v":"Base Case"},1,{"$f":"INDEX('Amazon Model'!$C$211:$C$214,'Sensitivity and Presentation'!G11)","v":"Base Case"},1,{"$f":"INDEX('Amazon Model'!$C$219:$C$222,'Sensitivity and Presentation'!I11)","v":"Base Case"},1,{"$f":"INDEX('Amazon Model'!$C$227:$C$230,'Sensitivity and Presentation'!K11)","v":"Base Case"},1,{"$f":"INDEX('Amazon Model'!$C$235:$C$238,'Sensitivity and Presentation'!M11)","v":"Base Case"},null,0.15,0.18,7.0000000000000007E-2,1,1638.1935494511924,1324.7241774842962]
[null,null,null,"Best Case",2,{"$f":"INDEX('Amazon Model'!$C$203:$C$206,'Sensitivity and Presentation'!E12)","v":"Case 1 - Higher Growth"},2,{"$f":"INDEX('Amazon Model'!$C$211:$C$214,'Sensitivity and Presentation'!G12)","v":"Case 2 - Lower Cost/High Price"},2,{"$f":"INDEX('Amazon Model'!$C$219:$C$222,'Sensitivity and Presentation'!I12)","v":"Case 2 - Lower Spending"},2,{"$f":"INDEX('Amazon Model'!$C$227:$C$230,'Sensitivity and Presentation'!K12)","v":"Case 2 - Lower Cost"},2,{"$f":"INDEX('Amazon Model'!$C$235:$C$238,'Sensitivity and Presentation'!M12)","v":"Case 2 - Lower Cap Exp"},null,null,null,null,2,4374.5102756997385,3391.0849629628533]
[null,null,null,"Worst Case",3,{"$f":"INDEX('Amazon Model'!$C$203:$C$206,'Sensitivity and Presentation'!E13)","v":"Case 2 - Lower Growth"},3,{"$f":"INDEX('Amazon Model'!$C$211:$C$214,'Sensitivity and Presentation'!G13)","v":"Case 3 - Higher Cost/Lower Price"},3,{"$f":"INDEX('Amazon Model'!$C$219:$C$222,'Sensitivity and Presentation'!I13)","v":"Case 3 - Higher Spending"},3,{"$f":"INDEX('Amazon Model'!$C$227:$C$230,'Sensitivity and Presentation'!K13)","v":"Case 3 - Higher Cost"},3,{"$f":"INDEX('Amazon Model'!$C$235:$C$238,'Sensitivity and Presentation'!M13)","v":"Case 3 - Lower Cap Exp"},null,null,null,null,3,328.59140623678167,282.1297889882967]
[null,"Best Case",1,{"$f":"E10&\" \"&B14","v":"Sales Growth Best Case"},{"$f":"IF(E$9=$C14,E$12,E$11)","v":2},{"$f":"INDEX('Amazon Model'!$C$203:$C$206,'Sensitivity and Presentation'!E14)","v":"Case 1 - Higher Growth"},{"$f":"IF(G$9=$C14,G$12,G$11)","v":1},{"$f":"INDEX('Amazon Model'!$C$211:$C$214,'Sensitivity and Presentation'!G14)","v":"Base Case"},{"$f":"IF(I$9=$C14,I$12,I$11)","v":1},{"$f":"INDEX('Amazon Model'!$C$219:$C$222,'Sensitivity and Presentation'!I14)","v":"Base Case"},{"$f":"IF(K$9=$C14,K$12,K$11)","v":1},{"$f":"INDEX('Amazon Model'!$C$227:$C$230,'Sensitivity and Presentation'!K14)","v":"Base Case"},{"$f":"IF(M$9=$C14,M$12,M$11)","v":1},{"$f":"INDEX('Amazon Model'!$C$235:$C$238,'Sensitivity and Presentation'!M14)","v":"Base Case"},null,null,null,null,4,2113.6893404401858,1696.0094934132592]
[null,null,2,{"$f":"G10&\" \"&B14","v":"COGS Percent Best Case"},{"$f":"IF(E$9=$C15,E$12,E$11)","v":1},{"$f":"INDEX('Amazon Model'!$C$203:$C$206,'Sensitivity and Presentation'!E15)","v":"Base Case"},2,{"$f":"INDEX('Amazon Model'!$C$211:$C$214,'Sensitivity and Presentation'!G15)","v":"Case 2 - Lower Cost/High Price"},1,{"$f":"INDEX('Amazon Model'!$C$219:$C$222,'Sensitivity and Presentation'!I15)","v":"Base Case"},1,{"$f":"INDEX('Amazon Model'!$C$227:$C$230,'Sensitivity and Presentation'!K15)","v":"Base Case"},1,{"$f":"INDEX('Amazon Model'!$C$235:$C$238,'Sensitivity and Presentation'!M15)","v":"Base Case"},null,null,null,null,5,2530.6727424596065,2003.2217806642664]
[null,null,3,{"$f":"I10&\" \"&B14","v":"R&D Growth Best Case"},1,{"$f":"INDEX('Amazon Model'!$C$203:$C$206,'Sensitivity and Presentation'!E16)","v":"Base Case"},1,{"$f":"INDEX('Amazon Model'!$C$211:$C$214,'Sensitivity and Presentation'!G16)","v":"Base Case"},2,{"$f":"INDEX('Amazon Model'!$C$219:$C$222,'Sensitivity and Presentation'!I16)","v":"Case 2 - Lower Spending"},1,{"$f":"INDEX('Amazon Model'!$C$227:$C$230,'Sensitivity and Presentation'!K16)","v":"Base Case"},1,{"$f":"INDEX('Amazon Model'!$C$235:$C$238,'Sensitivity and Presentation'!M16)","v":"Base Case"},null,null,null,null,6,1799.4925358431267,1451.6162579228258]
[null,null,4,{"$f":"K10&\" \"&B14","v":"SG&A to Sales Best Case"},1,{"$f":"INDEX('Amazon Model'!$C$203:$C$206,'Sensitivity and Presentation'!E17)","v":"Base Case"},1,{"$f":"INDEX('Amazon Model'!$C$211:$C$214,'Sensitivity and Presentation'!G17)","v":"Base Case"},1,{"$f":"INDEX('Amazon Model'!$C$219:$C$222,'Sensitivity and Presentation'!I17)","v":"Base Case"},2,{"$f":"INDEX('Amazon Model'!$C$227:$C$230,'Sensitivity and Presentation'!K17)","v":"Case 2 - Lower Cost"},1,{"$f":"INDEX('Amazon Model'!$C$235:$C$238,'Sensitivity and Presentation'!M17)","v":"Base Case"},null,null,null,null,7,2122.0905086269972,1705.4004187998846]
[null,null,5,{"$f":"M10&\" \"&B14","v":"Cap Exp to Sales Best Case"},1,{"$f":"INDEX('Amazon Model'!$C$203:$C$206,'Sensitivity and Presentation'!E18)","v":"Base Case"},1,{"$f":"INDEX('Amazon Model'!$C$211:$C$214,'Sensitivity and Presentation'!G18)","v":"Base Case"},1,{"$f":"INDEX('Amazon Model'!$C$219:$C$222,'Sensitivity and Presentation'!I18)","v":"Base Case"},1,{"$f":"INDEX('Amazon Model'!$C$227:$C$230,'Sensitivity and Presentation'!K18)","v":"Base Case"},2,{"$f":"INDEX('Amazon Model'!$C$235:$C$238,'Sensitivity and Presentation'!M18)","v":"Case 2 - Lower Cap Exp"},null,null,null,null,8,1898.0318254482752,1496.2789740090464]
[null,null,6,{"$f":"O10&\" \"&B14","v":"A/R to Sales Best Case"},1,{"$f":"INDEX('Amazon Model'!$C$203:$C$206,'Sensitivity and Presentation'!E19)","v":"Base Case"},1,{"$f":"INDEX('Amazon Model'!$C$211:$C$214,'Sensitivity and Presentation'!G19)","v":"Base Case"},1,{"$f":"INDEX('Amazon Model'!$C$219:$C$222,'Sensitivity and Presentation'!I19)","v":"Base Case"},1,{"$f":"INDEX('Amazon Model'!$C$227:$C$230,'Sensitivity and Presentation'!K19)","v":"Base Case"},1,{"$f":"INDEX('Amazon Model'!$C$235:$C$238,'Sensitivity and Presentation'!M19)","v":"Base Case"},null,null,null,null,9,1638.1935494511924,1324.7241774842962]
[null,null,7,{"$f":"P10&\" \"&B14","v":"Inventory to COGS Best Case"},1,{"$f":"INDEX('Amazon Model'!$C$203:$C$206,'Sensitivity and Presentation'!E20)","v":"Base Case"},1,{"$f":"INDEX('Amazon Model'!$C$211:$C$214,'Sensitivity and Presentation'!G20)","v":"Base Case"},1,{"$f":"INDEX('Amazon Model'!$C$219:$C$222,'Sensitivity and Presentation'!I20)","v":"Base Case"},1,{"$f":"INDEX('Amazon Model'!$C$227:$C$230,'Sensitivity and Presentation'!K20)","v":"Base Case"},1,{"$f":"INDEX('Amazon Model'!$C$235:$C$238,'Sensitivity and Presentation'!M20)","v":"Base Case"},null,null,null,null,10,1638.1935494511924,1324.7241774842962]
{"$rows_left_out":19}