{"text_format":"1","workbook":"xlsx","n_sheets":15,"sheets":["Outline","Summary","Football Field","Scenario","AZIZA Financial Stmt","AZIZA Model","DCF","Graph Data","Periodic Model","Stable Cap Exp to Dep","PE Analysis","Loan ex.","Chart2","IRR AND ROI","Proofs of DCF"],"not_rendered":{"charts":12,"images":0,"macros":1,"external_links":2,"defined_names":59,"comments":1,"pivot_tables":0},"unopened":[{"sheet":"Chart2","index":12,"reason":"not_a_worksheet"}],"bounds":{"document_bytes":16777216,"sheet_cells":100000,"rows_first":2000,"rows_last":500,"rows_between":2000,"halvings":0,"cell_chars":16384,"cell_head_chars":4096},"cells_cut":0,"cells_raw":0,"read":"whole","date_system":"1900"}

{"sheet":"Outline","index":0,"n_rows":13,"n_cols":2,"rows_kept":13,"cut":false,"hidden":false,"merged":[]}
[]
[]
[null,"Review of DCF "]
[null,"Making a Cash Cycle Model"]
[null,"Making a Waterfall Graph"]
[null,"Scenario Analysis"]
{"$rows_left_out":8}
{"sheet":"Summary","index":1,"n_rows":18,"n_cols":28,"rows_kept":18,"cut":false,"hidden":false,"merged":[]}
[]
[null,null,null,null,null,null,null,null,null,null,null,null,null,"Low Case",null,null,null,"Growth","EV/EBITDA","Value Driver"]
[null,null,null,null,null,null,null,null,null,null,null,null,null,null,"PV of Expicit Cash Flow",null,null,{"$f":"DCF!E44","v":3777180.1725308183},{"$f":"R3","v":3777180.1725308183},{"$f":"S3","v":3777180.1725308183},null,null,null,null,null,null,"Min",{"$f":"'Graph Data'!G98","v":0.56641791195337376}]
[null,null,null,null,null,null,null,null,null,null,null,null,null,null,"Add: Terminal Value",null,null,{"$f":"DCF!E81","v":21187995.364790551},{"$f":"DCF!E98","v":36732872.375260502},{"$f":"DCF!E113","v":23205626.773974549},null,null,null,null,null,null,"Max",{"$f":"'Graph Data'!G99","v":0.93240880935109716}]
[null,null,null,null,null,null,null,null,"Cap Exp",{"$f":"'AZIZA Model'!H33","v":4800000},null,null,null,null,"Less: Value of Bridge",null,null,{"$f":"-DCF!E87","v":-2752933.2740979185},{"$f":"R5","v":-2752933.2740979185},{"$f":"S5","v":-2752933.2740979185}]
[null,null,null,null,null,null,null,null,null,null,null,null,null,null,"Net Equity Value",null,null,{"$f":"R3+R4+R5","v":22212242.263223451},{"$f":"S3+S4+S5","v":37757119.273693398},24229873.672407448]
{"$rows_left_out":13}
{"sheet":"Football Field","index":2,"n_rows":50,"n_cols":12,"rows_kept":50,"cut":false,"hidden":false,"merged":[]}
[null,"First, Make a Low and High Case"]
[]
[null,null,null,"Low","High"]
[null,null,{"$f":"TRANSPOSE(Summary!R2:T2)","v":"Growth"},{"$f":"TRANSPOSE(Summary!R8:T8)","v":1.6526965969660306},{"$f":"TRANSPOSE(Summary!R18:T18)","v":3.6477664524500835},null,null,null,"WACC",null,{"$f":"Summary!K8","v":0.15},{"$f":"Summary!L8","v":0.12}]
[null,null,"EV/EBITDA",2.8093094697688539,4.2438809710359271,null,null,null,"Terminal Growth",null,{"$f":"Summary!K9","v":0.03},{"$f":"Summary!L9","v":0.05}]
[null,null,"Value Driver",1.802817981577935,3.1360831889808365,null,null,null,"Terminal EV/EBITDA",null,{"$f":"Summary!K10","v":7},{"$f":"Summary!L10","v":9}]
{"$rows_left_out":45}
{"sheet":"Scenario","index":3,"n_rows":18,"n_cols":20,"rows_kept":18,"cut":false,"hidden":false,"merged":[]}
[]
[null,null,"Code Number",null,1]
[null,null,null,null,null,null,null,1,2,3,4,5,6,7]
[null,null,null,null,"Base Case","Low Case","High Case",{"$f":"TRANSPOSE(C5:C11)","v":"Revenue Growth"},"COGS Percent Assumption","Admin as Pct of Revenue","Doubtful Debts % of Revenue","Sales and Mkting Growth","Cap Exp Forecast","Net Revenues Projection",{"$f":"INDEX(E4:N4,$E$2)","v":"Base Case"}]
[null,1,"Revenue Growth",null,1,2,3,{"$f":"IF(H$3=$B5,$F5,$E5)","v":2},{"$f":"IF(I$3=$B5,$F5,$E5)","v":1},1,1,1,1,1,1,null,null,null,1,{"$f":"TRANSPOSE(E4:N4)","v":"Base Case"}]
[null,2,"COGS Percent Assumption",null,1,2,3,{"$f":"IF(H$3=$B6,$F6,$E6)","v":1},2,1,1,1,1,1,1,null,null,null,2,"Low Case"]
{"$rows_left_out":13}
{"sheet":"AZIZA Financial Stmt","index":4,"n_rows":113,"n_cols":26,"rows_kept":113,"cut":false,"hidden":false,"merged":[]}
[null,null,null,"JOD",null,null,null,null,null,2008,{"$f":"J1+1","v":2009},{"$f":"K1+1","v":2010},2011,2012,2013,2014,2015,2016,2017,2018,2019,2020,2021,2022,2023,2024]
["Historic",null,null,null,2015,null,null,null,null,{"$f":"J1<=$E$2","v":true},{"$f":"K1<=$E$2","v":true},true,true,true,true,true,true,false,false,false,false,false,false,false,false,false]
[null,"Last",null,null,2015,null,null,null,null,{"$f":"J1=$E$3","v":false},{"$f":"K1=$E$3","v":false},false,false,false,false,false,true,false,false,false,false,false,false,false,false,false]
[null,"Projected",null,null,null,null,null,null,null,{"$f":"NOT(J2)","v":false},{"$f":"NOT(K2)","v":false},false,false,false,false,false,false,true,true,true,true,true,true,true,true,true]
[]
["Income Statement"]
{"$rows_left_out":108}
{"sheet":"AZIZA Model","index":5,"n_rows":288,"n_cols":29,"rows_kept":288,"cut":false,"hidden":false,"merged":[]}
[null,null,null,"JOD",null,null,null,null,null,2008,{"$f":"J1+1","v":2009},2010,2011,2012,2013,2014,2015,2016,2017,2018,2019,2020,2021,2022,2023,2024]
[null,"Historic",null,null,2015,null,null,null,null,{"$f":"J1<=$E$2","v":true},true,true,true,true,true,true,true,false,false,false,false,false,false,false,false,false]
[null,"Last",null,null,2015,null,null,null,null,{"$f":"J1=$E$3","v":false},false,false,false,false,false,false,true,false,false,false,false,false,false,false,false,false]
[null,"Projected",null,null,null,null,null,null,null,{"$f":"NOT(J2)","v":false},false,false,false,false,false,false,false,true,true,true,true,true,true,true,true,true]
["Operating Assumptions Analysis"]
[null,null,"Revenues",null,null,null,null,null,null,{"$f":"IF(J2,'AZIZA Financial Stmt'!J7)","v":12551497},{"$f":"IF(K2,'AZIZA Financial Stmt'!K7)","v":12445619},{"$f":"IF(L2,'AZIZA Financial Stmt'!L7)","v":17843682},{"$f":"IF(M2,'AZIZA Financial Stmt'!M7)","v":18668526},{"$f":"IF(N2,'AZIZA Financial Stmt'!N7)","v":18862818},{"$f":"IF(O2,'AZIZA Financial Stmt'!O7)","v":26173760},{"$f":"IF(P2,'AZIZA Financial Stmt'!P7)","v":29532749},{"$f":"IF(Q2,'AZIZA Financial Stmt'!Q7)","v":30444532},{"$f":"IF(R2,'AZIZA Financial Stmt'!R7)","v":false}]
{"$rows_left_out":283}
{"sheet":"DCF","index":6,"n_rows":147,"n_cols":16,"rows_kept":147,"cut":false,"hidden":false,"merged":[]}
[null,null,null,null,null,null,2015,{"$f":"G1+1","v":2016},{"$f":"H1+1","v":2017},2018,2019,2020,2021,2022,2023,2024]
[null,null,"Explicit period",null,null,null,{"$f":"AND(G1>=$E$21,G1<=$E$23)","v":false},{"$f":"AND(H1>=$E$21,H1<=$E$23)","v":false},true,true,true,true,true,false,false,false]
[null,null,"Terminal period",null,null,null,{"$f":"G1=$E$23","v":false},{"$f":"H1=$E$23","v":false},false,false,false,false,true,false,false,false]
[]
["Valuation Assumptions",null,null,null,"Low Case","High Case"]
[null,"Basic Assumptions"]
{"$rows_left_out":142}
{"sheet":"Graph Data","index":7,"n_rows":113,"n_cols":21,"rows_kept":113,"cut":false,"hidden":false,"merged":[]}
[]
[]
[null,1,{"$f":"MATCH(B3,'AZIZA Model'!AB:AB,0)","v":11},{"$f":"INDEX('AZIZA Model'!C:C,'Graph Data'!C3)&INDEX('AZIZA Model'!D:D,'Graph Data'!C3)&INDEX('AZIZA Model'!B:B,'Graph Data'!C3)","v":"Revenue Growth"},{"$f":"INDEX('AZIZA Model'!J:J,'Graph Data'!$C3)","v":0},{"$f":"INDEX('AZIZA Model'!K:K,'Graph Data'!$C3)","v":-8.435487814720477E-3},{"$f":"INDEX('AZIZA Model'!L:L,'Graph Data'!$C3)","v":0.43373198231441923},{"$f":"INDEX('AZIZA Model'!M:M,'Graph Data'!$C3)","v":4.6226109611233746E-2},{"$f":"INDEX('AZIZA Model'!N:N,'Graph Data'!$C3)","v":1.0407463342312129E-2},{"$f":"INDEX('AZIZA Model'!O:O,'Graph Data'!$C3)","v":0.38758482428235275},{"$f":"INDEX('AZIZA Model'!P:P,'Graph Data'!$C3)","v":0.12833421717017357},{"$f":"INDEX('AZIZA Model'!Q:Q,'Graph Data'!$C3)","v":3.0873624395751254E-2},{"$f":"INDEX('AZIZA Model'!R:R,'Graph Data'!$C3)","v":0.10702055354500395},{"$f":"INDEX('AZIZA Model'!S:S,'Graph Data'!$C3)","v":0.05},{"$f":"INDEX('AZIZA Model'!T:T,'Graph Data'!$C3)","v":0.05},{"$f":"INDEX('AZIZA Model'!U:U,'Graph Data'!$C3)","v":0.05},{"$f":"INDEX('AZIZA Model'!V:V,'Graph Data'!$C3)","v":0.05},{"$f":"INDEX('AZIZA Model'!W:W,'Graph Data'!$C3)","v":0.05},{"$f":"INDEX('AZIZA Model'!X:X,'Graph Data'!$C3)","v":0.05},{"$f":"INDEX('AZIZA Model'!Y:Y,'Graph Data'!$C3)","v":0.05},{"$f":"INDEX('AZIZA Model'!Z:Z,'Graph Data'!$C3)","v":0.05}]
[null,2,{"$f":"MATCH(B4,'AZIZA Model'!AB:AB,0)","v":20},{"$f":"INDEX('AZIZA Model'!C:C,'Graph Data'!C4)&INDEX('AZIZA Model'!D:D,'Graph Data'!C4)&INDEX('AZIZA Model'!B:B,'Graph Data'!C4)","v":"COGS Percent Assumption"},{"$f":"INDEX('AZIZA Model'!J:J,'Graph Data'!$C4)","v":0.79769695997218504},{"$f":"INDEX('AZIZA Model'!K:K,'Graph Data'!$C4)","v":0.67225623731531559},{"$f":"INDEX('AZIZA Model'!L:L,'Graph Data'!$C4)","v":0.62935323550374866},{"$f":"INDEX('AZIZA Model'!M:M,'Graph Data'!$C4)","v":0.84764437213736099},{"$f":"INDEX('AZIZA Model'!N:N,'Graph Data'!$C4)","v":0.82033357900182258},{"$f":"INDEX('AZIZA Model'!O:O,'Graph Data'!$C4)","v":0.73944793616681337},{"$f":"INDEX('AZIZA Model'!P:P,'Graph Data'!$C4)","v":0.7653943085352467},{"$f":"INDEX('AZIZA Model'!Q:Q,'Graph Data'!$C4)","v":0.76158474040592905},{"$f":"INDEX('AZIZA Model'!R:R,'Graph Data'!$C4)","v":0.72957050174487192},{"$f":"INDEX('AZIZA Model'!S:S,'Graph Data'!$C4)","v":0.73},{"$f":"INDEX('AZIZA Model'!T:T,'Graph Data'!$C4)","v":0.74},{"$f":"INDEX('AZIZA Model'!U:U,'Graph Data'!$C4)","v":0.74},{"$f":"INDEX('AZIZA Model'!V:V,'Graph Data'!$C4)","v":0.74},{"$f":"INDEX('AZIZA Model'!W:W,'Graph Data'!$C4)","v":0.74},{"$f":"INDEX('AZIZA Model'!X:X,'Graph Data'!$C4)","v":0.74},{"$f":"INDEX('AZIZA Model'!Y:Y,'Graph Data'!$C4)","v":0.74},{"$f":"INDEX('AZIZA Model'!Z:Z,'Graph Data'!$C4)","v":0.74}]
[null,3,{"$f":"MATCH(B5,'AZIZA Model'!AB:AB,0)","v":23},{"$f":"INDEX('AZIZA Model'!C:C,'Graph Data'!C5)&INDEX('AZIZA Model'!D:D,'Graph Data'!C5)&INDEX('AZIZA Model'!B:B,'Graph Data'!C5)","v":"Admin as Pct of Revenue"},{"$f":"INDEX('AZIZA Model'!J:J,'Graph Data'!$C5)","v":4.996447834071107E-2},{"$f":"INDEX('AZIZA Model'!K:K,'Graph Data'!$C5)","v":5.9732424719091917E-2},{"$f":"INDEX('AZIZA Model'!L:L,'Graph Data'!$C5)","v":6.8657354463053086E-2},{"$f":"INDEX('AZIZA Model'!M:M,'Graph Data'!$C5)","v":4.9827929639436989E-2},{"$f":"INDEX('AZIZA Model'!N:N,'Graph Data'!$C5)","v":4.8621261149845163E-2},{"$f":"INDEX('AZIZA Model'!O:O,'Graph Data'!$C5)","v":4.1606966776844355E-2},{"$f":"INDEX('AZIZA Model'!P:P,'Graph Data'!$C5)","v":3.7003802118116401E-2},{"$f":"INDEX('AZIZA Model'!Q:Q,'Graph Data'!$C5)","v":4.0213887998015542E-2},{"$f":"INDEX('AZIZA Model'!R:R,'Graph Data'!$C5)","v":4.9453513150639311E-2},{"$f":"INDEX('AZIZA Model'!S:S,'Graph Data'!$C5)","v":4.9453513150639311E-2},{"$f":"INDEX('AZIZA Model'!T:T,'Graph Data'!$C5)","v":4.9453513150639311E-2},{"$f":"INDEX('AZIZA Model'!U:U,'Graph Data'!$C5)","v":4.9453513150639311E-2},{"$f":"INDEX('AZIZA Model'!V:V,'Graph Data'!$C5)","v":4.9453513150639311E-2},{"$f":"INDEX('AZIZA Model'!W:W,'Graph Data'!$C5)","v":4.9453513150639311E-2},{"$f":"INDEX('AZIZA Model'!X:X,'Graph Data'!$C5)","v":4.9453513150639311E-2},{"$f":"INDEX('AZIZA Model'!Y:Y,'Graph Data'!$C5)","v":4.9453513150639311E-2},{"$f":"INDEX('AZIZA Model'!Z:Z,'Graph Data'!$C5)","v":4.9453513150639311E-2}]
[null,4,{"$f":"MATCH(B6,'AZIZA Model'!AB:AB,0)","v":26},{"$f":"INDEX('AZIZA Model'!C:C,'Graph Data'!C6)&INDEX('AZIZA Model'!D:D,'Graph Data'!C6)&INDEX('AZIZA Model'!B:B,'Graph Data'!C6)","v":"Doubtful Debts % of Revenue"},{"$f":"INDEX('AZIZA Model'!J:J,'Graph Data'!$C6)","v":1.560419446381575E-2},{"$f":"INDEX('AZIZA Model'!K:K,'Graph Data'!$C6)","v":5.7563227670716904E-3},{"$f":"INDEX('AZIZA Model'!L:L,'Graph Data'!$C6)","v":0},{"$f":"INDEX('AZIZA Model'!M:M,'Graph Data'!$C6)","v":0},{"$f":"INDEX('AZIZA Model'!N:N,'Graph Data'!$C6)","v":6.8091628726948432E-3},{"$f":"INDEX('AZIZA Model'!O:O,'Graph Data'!$C6)","v":4.5255397832356815E-3},{"$f":"INDEX('AZIZA Model'!P:P,'Graph Data'!$C6)","v":4.480111214841531E-3},{"$f":"INDEX('AZIZA Model'!Q:Q,'Graph Data'!$C6)","v":4.5819065308673494E-3},{"$f":"INDEX('AZIZA Model'!R:R,'Graph Data'!$C6)","v":5.2196547040658549E-3},{"$f":"INDEX('AZIZA Model'!S:S,'Graph Data'!$C6)","v":5.2196547040658549E-3},{"$f":"INDEX('AZIZA Model'!T:T,'Graph Data'!$C6)","v":5.2196547040658549E-3},{"$f":"INDEX('AZIZA Model'!U:U,'Graph Data'!$C6)","v":5.2196547040658549E-3},{"$f":"INDEX('AZIZA Model'!V:V,'Graph Data'!$C6)","v":5.2196547040658549E-3},{"$f":"INDEX('AZIZA Model'!W:W,'Graph Data'!$C6)","v":5.2196547040658549E-3},{"$f":"INDEX('AZIZA Model'!X:X,'Graph Data'!$C6)","v":5.2196547040658549E-3},{"$f":"INDEX('AZIZA Model'!Y:Y,'Graph Data'!$C6)","v":5.2196547040658549E-3},{"$f":"INDEX('AZIZA Model'!Z:Z,'Graph Data'!$C6)","v":5.2196547040658549E-3}]
{"$rows_left_out":108}
{"sheet":"Periodic Model","index":8,"n_rows":21,"n_cols":30,"rows_kept":21,"cut":false,"hidden":false,"merged":[]}
["``"]
[null,null,null,null,"Months in Period"]
["Date",null,null,null,12,null,"2016-01-01",{"$f":"EDATE(G3,$E$3)","v":"2017-01-01"},{"$f":"EDATE(H3,$E$3)","v":"2018-01-01"},"2019-01-01","2020-01-01","2021-01-01","2022-01-01","2023-01-01","2024-01-01","2025-01-01","2026-01-01","2027-01-01","2028-01-01","2029-01-01","2030-01-01","2031-01-01","2032-01-01","2033-01-01","2034-01-01","2035-01-01","2036-01-01","2037-01-01","2038-01-01","2039-01-01"]
[]
[]
["Operating Analysis"]
{"$rows_left_out":16}
{"sheet":"Stable Cap Exp to Dep","index":9,"n_rows":16,"n_cols":304,"rows_kept":16,"cut":false,"hidden":false,"merged":[]}
[]
[]
["Assumptions",null,null,null,null,null,"Stable Ratio",null,{"$f":"stable_capexp(E5,E4)","v":1.1723050646731472}]
[null,"Growth",null,null,{"$f":"DCF!E8","v":0.03}]
[null,"Life",null,null,10]
[]
{"$rows_left_out":11}
{"sheet":"PE Analysis","index":10,"n_rows":32,"n_cols":302,"rows_kept":32,"cut":false,"hidden":false,"merged":[]}
[]
[null,null,"Short-term","Long-term"]
[null,"Years",1,5]
[null,"ROE",0.15,0.18,null,null,"P/E",{"$f":"C32","v":13.333321195915666}]
[null,"G",0.05,0.03,null,null,"Value driver",{"$f":"(1-C5/C4)/(C6-C5)","v":13.333333333333332},{"$f":"_xlfn.FORMULATEXT(H5)","v":"=(1-C5/C4)/(C6-C5)"}]
[null,"Cost of Capital",0.1,{"$f":"C6","v":0.1}]
{"$rows_left_out":27}
{"sheet":"Loan ex.","index":11,"n_rows":39,"n_cols":21,"rows_kept":39,"cut":false,"hidden":false,"merged":[]}
[]
[null,1,2,3,4,5,6,7,8,9,10,11,12,13,14,15,16,17,18,19,20]
["Country Risk premium",0.14499999999999999]
["Accumulated risk premium",{"$f":"1-B3","v":0.85499999999999998},{"$f":"B4*(1-$B$3)","v":0.73102499999999992},{"$f":"C4*(1-$B$3)","v":0.62502637499999991},0.53439755062499994,0.45690990578437496,0.39065796944564057,0.33401256387602268,0.28558074211399936,0.24417153450746945,0.20876666200388638,0.17849549601332285,0.15261364909139102,0.13048466997313932,0.11156439282703412,9.5387555867114171E-2,8.1556360266382619E-2,6.9730688027757143E-2,5.9619738263732354E-2,5.0974876215491162E-2,4.3583519164244945E-2]
[]
["USD Loan",100]
{"$rows_left_out":34}
{"sheet":"IRR AND ROI","index":13,"n_rows":45,"n_cols":22,"rows_kept":45,"cut":false,"hidden":false,"merged":[]}
[]
[]
[null,0,1,2,3,4,5,6,7,8,9,10,11,12,13,14,15,16,17,18,19,20]
["EBITDA",null,200,200,200,200,200,200,200,200,200,200,200,200,200,200,200,200,200,200,200,200]
["CAPPEX",1000]
["DEP.",null,{"$f":"$B$5/20","v":50},{"$f":"$B$5/20","v":50},50,50,50,50,50,50,50,50,50,50,50,50,50,50,50,50,50,50]
{"$rows_left_out":40}
{"sheet":"Proofs of DCF","index":14,"n_rows":23,"n_cols":304,"rows_kept":23,"cut":false,"hidden":false,"merged":[]}
[]
[]
[]
["WACC",0.15,null,null,1,2,3,4,5,6,7,8,9,10,11,12,13,14,15,16,17,18,19,20,21,22,23,24,25,26,27,28,29,30,31,32,33,34,35,36,37,38,39,40,41,42,43,44,45,46,47,48,49,50,51,52,53,54,55,56,57,58,59,60,61,62,63,64,65,66,67,68,69,70,71,72,73,74,75,76,77,78,79,80,81,82,83,84,85,86,87,88,89,90,91,92,93,94,95,96,97,98,99,100,101,102,103,104,105,106,107,108,109,110,111,112,113,114,115,116,117,118,119,120,121,122,123,124,125,126,127,128,129,130,131,132,133,134,135,136,137,138,139,140,141,142,143,144,145,146,147,148,149,150,151,152,153,154,155,156,157,158,159,160,161,162,163,164,165,166,167,168,169,170,171,172,173,174,175,176,177,178,179,180,181,182,183,184,185,186,187,188,189,190,191,192,193,194,195,196,197,198,199,200,201,202,203,204,205,206,207,208,209,210,211,212,213,214,215,216,217,218,219,220,221,222,223,224,225,226,227,228,229,230,231,232,233,234,235,236,237,238,239,240,241,242,243,244,245,246,247,248,249,250,251,252,253,254,255,256,257,258,259,260,261,262,263,264,265,266,267,268,269,270,271,272,273,274,275,276,277,278,279,280,281,282,283,284,285,286,287,288,289,290,291,292,293,294,295,296,297,298,299,300]
["G",0.05]
["Revenues",1000,null,null,1000,{"$f":"E6*(1+$B$5)","v":1050},{"$f":"F6*(1+$B$5)","v":1102.5},1157.625,1215.5062500000001,1276.2815625000003,1340.0956406250004,1407.1004226562504,1477.4554437890631,1551.3282159785163,1628.8946267774422,1710.3393581163143,1795.8563260221301,1885.6491423232367,1979.9315994393985,2078.9281794113685,2182.874588381937,2292.0183178010338,2406.6192336910858,2526.9501953756403,2653.2977051444223,2785.9625904016434,2925.2607199217259,3071.5237559178122,3225.0999437137029,3386.3549408993881,3555.6726879443577,3733.4563223415757,3920.1291384586548,4116.1355953815873,4321.9423751506665,4538.0394939081998,4764.9414686036098,5003.1885420337903,5253.3479691354796,5516.0153675922538,5791.816135971867,6081.4069427704608,6385.4772899089839,6704.7511544044337,7039.9887121246556,7391.9881477308891,7761.587555117434,8149.666932873306,8557.1502795169708,8985.0077934928195,9434.2581831674615,9905.9710923258353,10401.269646942128,10921.333129289234,11467.399785753696,12040.769775041381,12642.808263793451,13274.948676983124,13938.696110832281,14635.630916373895,15367.412462192591,16135.783085302221,16942.572239567333,17789.700851545702,18679.185894122988,19613.145188829138,20593.802448270595,21623.492570684124,22704.667199218333,23839.900559179252,{"$f":"BR6*(1+$B$5)","v":25031.895587138217},26283.490366495127,27597.664884819886,28977.54812906088,30426.425535513925,31947.746812289621,33545.134152904102,35222.390860549305,36983.510403576773,38832.685923755613,40774.320219943394,42813.036230940568,44953.6880424876,47201.372444611981,49561.441066842584,52039.513120184718,54641.488776193954,57373.563215003654,60242.241375753838,63254.353444541535,66417.071116768609,69737.924672607041,73224.820906237394,76886.061951549273,80730.365049126733,84766.883301583075,89005.22746666224,93455.488839995349,98128.263281995125,103034.67644609489,108186.41026839965,113595.73078181963,119275.51732091061,125239.29318695614,131501.25784630395,138076.32073861916,144980.13677555014,152229.14361432765,159840.60079504404,167832.63083479626,176224.26237653609,185035.47549536292,194287.24927013108,204001.61173363763,214201.69232031953,224911.77693633552,236157.36578315232,247965.23407230995,260363.49577592546,273381.67056472175,287050.75409295782,301403.29179760575,316473.45638748608,332297.12920686038,348911.98566720344,366357.58495056361,384675.46419809182,403909.23740799644,424104.69927839626,445309.93424231611,467575.43095443194,490954.20250215358,515501.91262726131,541277.00825862435,{"$f":"ED6*(1+$B$5)","v":568340.85867155564},596757.90160513343,626595.79668539017,657925.58651965973,690821.86584564275,725362.95913792495,761631.10709482117,799712.66244956222,839698.29557204037,881683.21035064245,925767.37086817459,972055.7394115834,1020658.5263821626,1071691.4527012708,1125276.0253363345,1181539.8266031512,1240616.8179333087,1302647.6588299742,1367780.0417714729,1436169.0438600467,1507977.4960530491,1583376.3708557016,1662545.1893984869,1745672.4488684114,1832956.0713118319,1924603.8748774235,2020834.0686212948,2121875.7720523598,2227969.5606549778,2339368.0386877269,2456336.4406221132,2579153.262653219,2708110.9257858801,2843516.4720751741,2985692.2956789332,3134976.91046288,3291725.7559860242,3456312.0437853257,3629127.6459745923,3810584.0282733222,4001113.2296869885,4201168.891171338,4411227.3357299054,4631788.7025164012,4863378.1376422215,5106547.0445243325,5361874.3967505498,5629968.1165880775,5911466.522417482,6207039.8485383559,6517391.8409652738,6843261.4330135379,7185424.5046642153,7544695.7298974264,7921930.516392298,8318027.0422119135,8733928.3943225089,9170624.8140386343,9629156.0547405668,10110613.857477596,10616144.550351476,11146951.777869051,11704299.366762504,12289514.33510063,{"$f":"GP6*(1+$B$5)","v":12903990.051855663},13549189.554448446,14226649.032170869,14937981.483779414,15684880.557968386,16469124.585866805,17292580.815160148,18157209.855918158,19065070.348714065,20018323.866149768,21019240.059457257,22070202.062430121,23173712.165551629,24332397.773829211,25549017.662520673,26826468.545646708,28167791.972929046,29576181.5715755,31054990.650154278,32607740.182661992,34238127.191795096,35950033.551384851,37747535.228954099,39634911.990401804,41616657.589921899,43697490.469417997,45882364.992888898,48176483.242533341,50585307.404660009,53114572.774893008,55770301.41363766,58558816.484319545,61486757.308535524,64561095.173962303,67789149.932660416,71178607.429293439,74737537.800758108,78474414.690796018,82398135.425335824,86518042.196602613,90843944.306432754,95386141.521754399,100155448.59784213,105163221.02773423,110421382.07912095,115942451.18307701,121739573.74223086,127826552.4293424,134217880.05080953,140928774.05335,147975212.75601751,155373973.39381838,163142672.06350932,171299805.66668478,179864795.95001903,188858035.74752,198300937.53489602,208215984.41164082,218626783.63222286,229558122.81383401,241036028.95452571,253087830.40225202,265742221.92236462,279029333.01848286,{"$f":"JB6*(1+$B$5)","v":292980799.66940701},307629839.65287739,323011331.63552129,339161898.21729738,356119993.12816226,373925992.7845704,392622292.42379892,412253407.04498887,432866077.39723831,454509381.26710027,477234850.3304553,501096592.84697807,526151422.48932701,552458993.61379337,580081943.29448307,609086040.4592073,639540342.48216772,671517359.60627615,705093227.58659005,740347888.96591961,777365283.41421568,816233547.58492649,857045224.96417284,899897486.21238148,944892360.5230006,992136978.54915071,1041743827.4766083,1093831018.8504388,1148522569.7929609,1205948698.282609,1266246133.1967394,1329558439.8565764,1396036361.8494053,1465838179.9418757,1539130088.9389696,1616086593.3859181,1696890923.0552142,1781735469.2079749,1870822242.6683738,1964363354.8017926,2062581522.5418823,2165710598.6689763]
{"$rows_left_out":17}