{"text_format":"1","workbook":"xlsx","n_sheets":24,"sheets":["TABLE OF CONTENTS","INPUTS -->","Acquirer Financials","Target Financials","Transaction Assumptions","Synergies","TRANSACTION -->","Sources and Uses","Goodwill","Pro-Forma Balance Sheet","Debt Issues","Consolidated Financials","CONSOLIDATION -->","Summary","EPS Chart","Debt Leverage Chart","ROE Chart","ROI Chart","Interest Coverage Chart","Verification","Rating Band Chart","Working Chart","Bond Rating Standards","Sheet11"],"not_rendered":{"charts":18,"images":1,"macros":1,"external_links":2,"defined_names":133,"comments":6,"pivot_tables":0},"unopened":[{"sheet":"EPS Chart","index":14,"reason":"not_a_worksheet"},{"sheet":"Debt Leverage Chart","index":15,"reason":"not_a_worksheet"},{"sheet":"ROE Chart","index":16,"reason":"not_a_worksheet"},{"sheet":"ROI Chart","index":17,"reason":"not_a_worksheet"},{"sheet":"Interest Coverage Chart","index":18,"reason":"not_a_worksheet"},{"sheet":"Rating Band Chart","index":20,"reason":"not_a_worksheet"},{"sheet":"Working Chart","index":21,"reason":"not_a_worksheet"}],"bounds":{"document_bytes":16777216,"sheet_cells":100000,"rows_first":2000,"rows_last":500,"rows_between":2000,"halvings":0,"cell_chars":16384,"cell_head_chars":4096},"cells_cut":0,"cells_raw":0,"read":"whole","date_system":"1900"}

{"sheet":"TABLE OF CONTENTS","index":0,"n_rows":34,"n_cols":5,"rows_kept":34,"cut":false,"hidden":false,"merged":[]}
[]
[]
[null,null,"Sheet Tab","Description","Author"]
[null,1,"TABLE OF CONTENTS"]
[null,2,"INPUTS -->"]
[null,3,"Acquirer Financials"]
[null,4,"Target Financials"]
[null,5,"Transaction Assumptions"]
[null,6,"Synergies"]
[null,7,"TRANSACTION -->"]
[null,8,"Sources and Uses"]
[null,9,"Goodwill"]
[null,10,"Pro-Forma Balance Sheet"]
[null,11,"Debt Issues"]
[null,12,"Consolidated Financials"]
{"$rows_left_out":20}
{"sheet":"INPUTS -->","index":1,"n_rows":6,"n_cols":3,"rows_kept":6,"cut":false,"hidden":false,"merged":[]}
["INPUTS -->"]
[]
[]
[]
[]
[null,null,false]

{"sheet":"Acquirer Financials","index":2,"n_rows":100,"n_cols":15,"rows_kept":100,"cut":false,"hidden":false,"merged":[]}
["Acquirer Financials",null,null,null,"Units","Formula"]
[]
["Year",null,null,null,null,null,2011,{"$f":"G3+1","v":2012},{"$f":"H3+1","v":2013},2014,2015,2016,2017,2018,2019]
[]
["Assumptions"]
[]
[null,"Operating Assumptions"]
[null,null,"Revenues",null,null,null,null,5200,5357.04,5518.8226079999995,5685.4910507615996,5857.192880494601,6034.0801054855374,6216.3093246711996,6404.0418662762695]
[null,null,"Operating Expesnes",null,null,null,null,4780,4923.7440000000006,5071.8168287999997,5224.3489722297591,5381.4748518950983,5543.3329439404106,5710.0659013958521,5881.8206802174154]
[null,null,"Capital Expenditures",null,null,null,null,425,137.69999999999999,151.63830000000019,155.47493105999928,159.41257146601271,163.45397456204498,167.6019709003337,171.85947045416975]
[]
[null,"Interest Rates, taxes and depreciation"]
[null,null,"Short-term Interest Rate",null,null,null,null,0.05,0.05,0.05,0.05,0.05,0.05,0.05,0.05]
[null,null,"Tax  Rate",null,null,null,null,0.4,0.4,0.4,0.4,0.4,0.4,0.4,0.4]
[null,null,"Depereciation Rate",null,null,null,null,0.04,0.04,0.04,0.04,0.04,0.04,0.04,0.04]
{"$rows_left_out":86}
{"sheet":"Target Financials","index":3,"n_rows":100,"n_cols":15,"rows_kept":100,"cut":false,"hidden":false,"merged":[]}
["Target Financials",null,null,null,"Units","Formula"]
[]
["Year",null,null,null,null,null,2011,{"$f":"G3+1","v":2012},{"$f":"H3+1","v":2013},2014,2015,2016,2017,2018,2019]
[]
["Assumptions"]
[]
[null,"Operating Assumptions"]
[null,null,"Revenues",null,null,null,null,742.5,833.08500000000004,934.72137000000021,1048.7573771400002,1176.7057771510804,1320.2638819635124,1481.3360755630611,1662.0590767817546]
[null,null,"Operating Expesnes",null,null,null,null,510.61363636363643,569.19940909090928,634.85846427272736,708.45225873218203,790.9473173520538,883.42805078464085,987.11113691031619,1103.3616568219229]
[null,null,"Capital Expenditures",null,null,null,null,137.36363636363637,154.02000000000001,172.70640000000006,193.6704600000003,217.19001290400027,243.57678639796816,273.18053809659381,306.39369517761355]
[]
[null,"Interest Rates, taxes and depreciation"]
[null,null,"Short-term Interest Rate",null,null,null,null,7.0000000000000007E-2,7.0000000000000007E-2,7.0000000000000007E-2,7.0000000000000007E-2,7.0000000000000007E-2,7.0000000000000007E-2,7.0000000000000007E-2,7.0000000000000007E-2]
[null,null,"Tax  Rate",null,null,null,null,0.2,0.2,0.2,0.2,0.2,0.2,0.2,0.2]
[null,null,"Depereciation Rate",null,null,null,null,0.04,0.04,0.04,0.04,0.04,0.04,0.04,0.04]
{"$rows_left_out":86}
{"sheet":"Transaction Assumptions","index":4,"n_rows":29,"n_cols":17,"rows_kept":29,"cut":false,"hidden":false,"merged":[]}
["Transaction Assumptions"]
[null,"General",null,null,null,null,null,null,"Acquirer Debt Retired",null,null,null,null,null,"Model Verified",null,{"$f":"Verification!E12","v":false}]
[null,null,"Target Company Name",null,null,"Target",null,null,null,"Switch for Total Debt Retirement",null,null,true]
[null,null,"Acquirer Company Name",null,null,"Acquiror"]
[null,null,"Scenario Name",null,null,null,null,null,null,"Debt Retired",null,null,null,null,"Source Minus Uses",null,{"$f":"'Sources and Uses'!G20","v":0}]
[null,null,"Transaction Date",null,null,"2011-01-01",null,null,null,null,"Issue 1",null,null,null,"Goodwill",null,{"$f":"Goodwill!H23","v":356.2615609090908}]
[null,"Transaction Financing",null,null,null,null,null,null,null,null,null,"Amount of Debt",{"$f":"IF(M3,'Target Financials'!G72,0)","v":300}]
[null,null,"Purchase Price",null,null,null,null,null,null,null,null,"Interest Rate",{"$f":"'Target Financials'!H13","v":7.0000000000000007E-2}]
[null,null,null,"Equity Value - Cash Consideration",null,1700,null,null,null,null,null,"Term",0]
[null,null,null,"Equity Value - Consideration in Shares",null,0]
[null,null,null,"Target Debt Value",null,{"$f":"'Target Financials'!H72","v":389.68503636363641},null,null,null,null,"Issue 2"]
[null,null,null,null,"Target Enterprise Value",{"$f":"F9+F10+F11","v":2089.6850363636363},null,null,null,null,null,"Amount of Debt",0]
[null,null,null,null,null,null,null,null,null,null,null,"Interest Rate",0]
[null,null,null,null,"EV/EBITDA",{"$f":"total_enterprise_value/'Target Financials'!H35","v":9.0116771145741463},null,null,null,null,null,"Term",0]
[null,null,null,null,"P/E Ratio",{"$f":"equity_consideration_cash/'Target Financials'!H43","v":12.04704402904691}]
{"$rows_left_out":15}
{"sheet":"Synergies","index":5,"n_rows":8,"n_cols":12,"rows_kept":8,"cut":false,"hidden":false,"merged":[]}
["Synergies"]
[null,null,null,null,2011,{"$f":"E2+1","v":2012},{"$f":"F2+1","v":2013},2014,2015,2016,2017,2018]
[]
["Revenue Increases",null,null,null,null,{"$f":"synergie","v":50},{"$f":"F4","v":50},50,50,50,50,50]
[]
["Expense Reductions"]
[]
["Capital Expenditure Reductions"]

{"sheet":"TRANSACTION -->","index":6,"n_rows":1,"n_cols":1,"rows_kept":1,"cut":false,"hidden":false,"merged":[]}
["TRANSACTION -->"]

{"sheet":"Sources and Uses","index":7,"n_rows":24,"n_cols":8,"rows_kept":24,"cut":false,"hidden":false,"merged":[]}
["Sources and Uses"]
[null,null,null,null,null,null,"Amount","Shares"]
[null,null,"Uses",null,null,null,{"$f":"YEAR(transaction_date-1)","v":2010},{"$f":"G3","v":2010}]
[null,null,null,"Target Equity - Cash",null,null,{"$f":"equity_consideration_cash","v":1700}]
[null,null,null,"Target Equity - Shares",null,null,{"$f":"equity_consideration_shares","v":0},{"$f":"equity_consideration_shares","v":0}]
[null,null,null,"Target Debt Retired",null,null,{"$f":"debt_retired_1","v":300}]
[null,null,null,"Transaction Fees",null,null,{"$f":"transaction_cost","v":104.48425181818182}]
[null,null,null,"Acquirer Debt"]
[null,null,null,"Working Capital"]
[null,null,null,"Debt Issue Costs",null,null,{"$f":"debt_issue_costs","v":0}]
[null,null,null,null,"Total Uses",null,{"$f":"SUM(G4:G10)","v":2104.4842518181817}]
[]
[null,null,"Sources"]
[null,null,null,"New Shares Issued",null,null,{"$f":"value_of_shares","v":535.48425181818197},{"$f":"shares_issued","v":59.498250202020223}]
[null,null,null,"New Debt Issued - 1",null,null,{"$f":"debt_issue_1","v":1569}]
{"$rows_left_out":10}
{"sheet":"Goodwill","index":8,"n_rows":23,"n_cols":8,"rows_kept":23,"cut":false,"hidden":false,"merged":[]}
["Goodwill"]
[]
[null,null,null,"Goodwill Calculation",null,null,null,{"$f":"YEAR(transaction_date-1)","v":2010}]
[]
[null,null,null,"Step 1: Equity Purchase Price vs Book Value"]
[]
[null,null,null,null,"Equity Purchase Price - Total Consideration",null,null,{"$f":"'Sources and Uses'!G4+'Sources and Uses'!G5","v":1700}]
[null,null,null,null,"Less: Book Value of Target Company Equity",null,null,{"$f":"'Target Financials'!H73","v":448.22269090909089}]
[null,null,null,null,null,"Net",null,{"$f":"H7-H8","v":1251.7773090909091}]
[]
[null,null,null,"Step 2: Add Transaction Costs",null,null,null,{"$f":"'Sources and Uses'!G7","v":104.48425181818182}]
[]
[null,null,null,"Step 3: Less Asset Write-ups"]
[null,null,null,null,null,"Intangible Asset Write-up",null,{"$f":"write_up","v":1000}]
[]
{"$rows_left_out":9}
{"sheet":"Pro-Forma Balance Sheet","index":9,"n_rows":28,"n_cols":17,"rows_kept":28,"cut":false,"hidden":false,"merged":[]}
["Pro-Forma Balance Sheet"]
[]
[null,null,null,null,null,null,{"$f":"YEAR(transaction_date-1)","v":2010},{"$f":"YEAR(transaction_date-1)","v":2010}]
[null,null,"Assets",null,null,null,{"$f":"acquirer_name","v":"Acquiror"},{"$f":"target_name","v":"Target"},"Debt Issue","Debt Retired","Cash Changes","Asset Write-up","Goodwill","Eliminate Target Equity","New Equity Issues","Total Adj","Adjusted Balance Sheet"]
[]
[null,null,null,"Restricted Cash",null,null,null,null,null,null,null,null,null,null,null,{"$f":"SUM(I6:O6)","v":0},{"$f":"P6+H6+G6","v":0}]
[null,null,null,"Cash and Temporary Investments",null,null,{"$f":"'Acquirer Financials'!H60","v":0},{"$f":"'Target Financials'!H60","v":0},null,null,null,null,null,null,null,0,0]
[null,null,null,"Other Current Assets",null,null,{"$f":"'Acquirer Financials'!H61","v":260},{"$f":"'Target Financials'!H61","v":89.1},null,null,null,null,null,null,null,0,349.1]
[null,null,null,"Gross Plant Value",null,null,{"$f":"'Acquirer Financials'!H62","v":1925},{"$f":"'Target Financials'!H62","v":937.36363636363637},null,null,null,null,null,null,null,0,2862.3636363636365]
[null,null,null,"Accumulated Depreciation",null,null,{"$f":"'Acquirer Financials'!H63","v":177},{"$f":"'Target Financials'!H63","v":137.49454545454546},null,null,null,null,null,null,null,0,314.49454545454546]
[null,null,null,null,"Net Plant",null,{"$f":"'Acquirer Financials'!H64","v":1748},{"$f":"'Target Financials'!H64","v":799.86909090909091},null,null,null,null,null,null,null,0,2547.869090909091]
[null,null,null,"Intangible Assets",null,null,null,null,null,null,null,{"$f":"Goodwill!H14","v":1000},null,null,null,1000,1000]
[null,null,null,"Deferred Debits and Goodwill",null,null,null,null,null,null,null,null,{"$f":"Goodwill!H23","v":356.2615609090908},null,null,356.2615609090908,356.2615609090908]
[null,null,null,null,"Total Assets",null,{"$f":"G11+G8","v":2008},{"$f":"H6+H7+H8+H11+H12+H13","v":888.96909090909094},0,0,0,1000,356.2615609090908,0,0,1356.2615609090908,4253.2306518181813]
[]
{"$rows_left_out":14}
{"sheet":"Debt Issues","index":10,"n_rows":50,"n_cols":12,"rows_kept":50,"cut":false,"hidden":false,"merged":[]}
["Debt Issues"]
["Total Debt Issues",null,null,null,{"$f":"'Pro-Forma Balance Sheet'!H3","v":2010},{"$f":"E2+1","v":2011},2012,2013,2014,2015,2016,2017]
["Aggregation of All Debt Issues"]
[null,"New Issues",null,null,{"$f":"E12+E19+E26+E33-E40-E47","v":1269},0,0,0,0,0,0,0]
[null,"Debt Maturities",null,null,0,0,600,0,0,0,450,0]
[null,"Ending Balance",null,null,{"$f":"E15+E21+E28+E35-E42-E49","v":2019},2319,1719,1719,1719,1719,1269,1269]
[null,"Interest Expense",null,null,82.724999999999994,111.44999999999999,99.45,87.45,87.45,87.45,72.45,57.45]
[]
["Check",null,null,null,{"$f":"E6='Pro-Forma Balance Sheet'!Q20","v":false}]
[]
["Target Existing Debt"]
[null,"New Issues",null,null,{"$f":"'Target Financials'!H21","v":0},{"$f":"'Target Financials'!I21","v":0},{"$f":"'Target Financials'!J21","v":0},{"$f":"'Target Financials'!K21","v":0},{"$f":"'Target Financials'!L21","v":0},{"$f":"'Target Financials'!M21","v":0},{"$f":"'Target Financials'!N21","v":0},{"$f":"'Target Financials'!O21","v":0}]
[null,"Debt Maturities",null,null,{"$f":"'Target Financials'!H19","v":0},{"$f":"MIN('Target Financials'!I19,E15)","v":0},{"$f":"MIN('Target Financials'!J19,F15)","v":150},{"$f":"MIN('Target Financials'!K19,G15)","v":0},{"$f":"MIN('Target Financials'!L19,H15)","v":0},{"$f":"MIN('Target Financials'!M19,I15)","v":0},{"$f":"MIN('Target Financials'!N19,J15)","v":150},{"$f":"MIN('Target Financials'!O19,K15)","v":0}]
[null,"Retired Debt",null,null,{"$f":"debt_retired_1","v":300}]
[null,"Ending Balance",null,null,{"$f":"'Target Financials'!H18-E14","v":0},{"$f":"'Target Financials'!I18","v":300},{"$f":"'Target Financials'!J18","v":150},{"$f":"'Target Financials'!K18","v":150},{"$f":"'Target Financials'!L18","v":150},{"$f":"'Target Financials'!M18","v":150},{"$f":"'Target Financials'!N18","v":0},{"$f":"'Target Financials'!O18","v":0}]
{"$rows_left_out":36}
{"sheet":"Consolidated Financials","index":11,"n_rows":127,"n_cols":12,"rows_kept":127,"cut":false,"hidden":false,"merged":[]}
["Consolidated Financials"]
["Year",null,null,null,{"$f":"YEAR(transaction_date)","v":2011},{"$f":"E2+1","v":2012},{"$f":"F2+1","v":2013},2014,2015,2016,2017,2018]
[]
["Assumptions"]
[]
[null,"Interest Rate on Revolver",null,null,null,{"$f":"revolver_rate","v":7.0000000000000007E-2},7.0000000000000007E-2,7.0000000000000007E-2,7.0000000000000007E-2,7.0000000000000007E-2,7.0000000000000007E-2,7.0000000000000007E-2]
[null,"Interest Rate on Cash Balance",null,null,null,{"$f":"income_rate","v":0.04},0.04,0.04,0.04,0.04,0.04,0.04]
[null,"Income Tax Rate",null,null,null,{"$f":"tax_rate","v":0.3},0.3,0.3,0.3,0.3,0.3,0.3]
[null,"Dividend Per Share",null,null,null,{"$f":"div_per_share","v":1},1,1,1,1,1,1]
[]
["Income Statement"]
[null,"Revenues"]
[null,null,"Target",null,null,{"$f":"'Target Financials'!I33","v":833.08500000000004},{"$f":"'Target Financials'!J33","v":934.72137000000021},{"$f":"'Target Financials'!K33","v":1048.7573771400002},{"$f":"'Target Financials'!L33","v":1176.7057771510804},{"$f":"'Target Financials'!M33","v":1320.2638819635124},{"$f":"'Target Financials'!N33","v":1481.3360755630611},{"$f":"'Target Financials'!O33","v":1662.0590767817546}]
[null,null,"Acquirer",null,null,{"$f":"'Acquirer Financials'!I33","v":5357.04},{"$f":"'Acquirer Financials'!J33","v":5518.8226079999995},{"$f":"'Acquirer Financials'!K33","v":5685.4910507615996},{"$f":"'Acquirer Financials'!L33","v":5857.192880494601},{"$f":"'Acquirer Financials'!M33","v":6034.0801054855374},{"$f":"'Acquirer Financials'!N33","v":6216.3093246711996},{"$f":"'Acquirer Financials'!O33","v":6404.0418662762695}]
[null,null,"Synergies",null,null,{"$f":"Synergies!E4","v":0},{"$f":"Synergies!F4","v":50},{"$f":"Synergies!G4","v":50},{"$f":"Synergies!H4","v":50},{"$f":"Synergies!I4","v":50},{"$f":"Synergies!J4","v":50},{"$f":"Synergies!K4","v":50}]
{"$rows_left_out":113}
{"sheet":"CONSOLIDATION -->","index":12,"n_rows":1,"n_cols":1,"rows_kept":1,"cut":false,"hidden":false,"merged":[]}
["CONSOLIDATION -->"]

{"sheet":"Summary","index":13,"n_rows":18,"n_cols":21,"rows_kept":18,"cut":false,"hidden":false,"merged":[]}
[]
[null,null,null,"Equity Consideration",null,{"$f":"equity_consideration_cash","v":1700},null,"Synergies",{"$f":"synergie","v":50},null,null,null,"Years on Graph",null,{"$f":"'Transaction Assumptions'!M29","v":7}]
[null,null,null,"Equity Issued",null,{"$f":"value_of_shares","v":535.48425181818197},null,"Write-up",{"$f":"write_up","v":1000},null,null,null,"Business Risk Category"]
[null,null,null,"Debt Issued",null,{"$f":"debt_issue_1","v":1569},null,"Scenario",null,null,null,null,"Target Bond Rating"]
[]
[]
[null,null,null,null,null,null,null,null,null,null,null,null,null,null,null,null,null,null,"Equity Value",{"$f":"equity_consideration_cash","v":1700}]
[]
[null,null,null,null,null,null,null,null,null,null,null,null,null,null,null,null,null,null,"Debt",{"$f":"debt_issue_1","v":1569}]
[]
[null,null,null,null,null,null,null,null,null,null,null,null,null,null,null,null,null,null,"Equity",{"$f":"value_of_shares","v":535.48425181818197}]
[]
[]
[null,null,null,null,null,null,null,null,null,null,null,null,null,null,null,null,null,null,"Sources/Uses",null,{"$f":"'Sources and Uses'!G20","v":0}]
[]
{"$rows_left_out":4}
{"sheet":"Verification","index":19,"n_rows":12,"n_cols":5,"rows_kept":12,"cut":false,"hidden":false,"merged":[]}
["Verification"]
[]
[]
[null,null,"Sources and Uses",null,{"$f":"'Sources and Uses'!G22","v":true}]
[]
[null,null,"Pro-Forma Balance Sheet",null,{"$f":"'Pro-Forma Balance Sheet'!Q27","v":false}]
[]
[null,null,"On-Going Balance Sheet",null,{"$f":"'Consolidated Financials'!D92","v":false}]
[]
[null,null,"Debt Reconciliation",null,{"$f":"'Debt Issues'!E9","v":false}]
[]
[null,null,"Aggregate Check",null,{"$f":"AND(E4:E10)","v":false}]

{"sheet":"Bond Rating Standards","index":22,"n_rows":42,"n_cols":18,"rows_kept":42,"cut":false,"hidden":false,"merged":[[4,10,4,11],[4,12,4,13],[4,14,4,15],[4,16,4,17]]}
["Bond Rating Standards"]
[]
[]
[]
[null,null,null,null,null,null,null,null,null,null,"AA",null,"A",null,"BBB",null,"BB"]
[null,null,null,null,null,null,null,null,null,null,"From","To","From","To","From","To","From","To"]
[null,null,null,null,null,null,null,null,null,1,2.5,3,1.5,2.5,1,1.5]
[null,null,null,null,null,null,null,null,null,2,3,4,2,3,1,2]
[null,null,null,null,null,null,null,null,null,3,3.5,4.5,2.5,3.5,1.5,2.5,1,1.5]
[null,null,null,null,null,null,null,null,null,4,4.2,5,3,4.2,2.5,3.5,1.5,2.5]
[null,null,null,null,null,null,null,null,null,5,4.5,5.5,3.8,4.5,2.8,3.8,1.8,2.8]
[null,null,null,null,null,null,null,null,null,6,5.2,6,4.2,5.2,3,4.2,2,3]
[null,null,null,null,null,null,null,null,null,7,6.5,8,4.5,6.5,3.2,4.5,2.2000000000000002,3.2]
[null,null,null,null,null,null,null,null,null,8,7.5,10,5.5,7.5,3.5,5.5,2.5,3.5]
[null,null,null,null,null,null,null,null,null,9,null,null,7,10,4,7,2.8,4]
{"$rows_left_out":28}
{"sheet":"Sheet11","index":23,"n_rows":40,"n_cols":9,"rows_kept":40,"cut":false,"hidden":false,"merged":[]}
["Sheet11","='Transaction Assumptions'!$E$3",null,null,null,null,null,null,{"$f":"\"EPS Comparison: \"&target_name&\" Combined with \"&acquirer_name&CHAR(10)&\" Transaction Value \"&TEXT(total_enterprise_value,\"0,0\")&\" Shares Issued \"&TEXT(shares_issued,\"0,0\")","v":"EPS Comparison: Target Combined with Acquiror\n Transaction Value 2,090 Shares Issued 59"}]
["debt_2","='Transaction Assumptions'!$E$24",null,null,null,null,null,null,{"$f":"\"Interest Coverage Comparison: \"&target_name&\" Combined with \"&acquirer_name&CHAR(10)&\" Transaction Value \"&TEXT(total_enterprise_value,\"0,0\")&\" Debt Issued \"&TEXT(debt_issue_1+debt_2,\"0,0\")","v":"Interest Coverage Comparison: Target Combined with Acquiror\n Transaction Value 2,090 Debt Issued 1,569"}]
["debt_cap1","=OFFSET('Consolidated Financials'!$F$116,0,0,1,'Transaction Assumptions'!$L$26)",null,null,null,null,null,null,{"$f":"\"Debt to Capital Comparison: \"&target_name&\" Combined with \"&acquirer_name&\" Transaction Value \"&TEXT(total_enterprise_value,\"0,0\")&\" Debt Issued \"&TEXT(debt_issue_1+debt_2,\"0,0\")","v":"Debt to Capital Comparison: Target Combined with Acquiror Transaction Value 2,090 Debt Issued 1,569"}]
["debt_cap2","=OFFSET('Consolidated Financials'!$F$123,0,0,1,'Transaction Assumptions'!$L$26)",null,null,null,null,null,null,{"$f":"\"ROE Comparison: \"&target_name&\" Combined with \"&acquirer_name&CHAR(10)&\" Transaction Value \"&TEXT(total_enterprise_value,\"0,0\")&\" Shares Issued \"&TEXT(shares_issued,\"0,0\")","v":"ROE Comparison: Target Combined with Acquiror\n Transaction Value 2,090 Shares Issued 59"}]
["debt_issue_1","='Transaction Assumptions'!$E$19",null,null,null,null,null,null,{"$f":"\"ROI Comparison: \"&target_name&\" Combined with \"&acquirer_name&\" Transaction Value \"&TEXT(total_enterprise_value,\"0,0\")&\" Shares Issued \"&TEXT(shares_issued,\"0,0\")","v":"ROI Comparison: Target Combined with Acquiror Transaction Value 2,090 Shares Issued 59"}]
["debt_issue_costs","='Transaction Assumptions'!$L$16"]
["debt_rate_1","='Transaction Assumptions'!$E$20"]
["debt_rate_2","='Transaction Assumptions'!$E$25"]
["debt_retire_rate_1","='Transaction Assumptions'!$L$7"]
["debt_retire_term_1","='Transaction Assumptions'!$L$8"]
["debt_retired_1","='Transaction Assumptions'!$L$6"]
["debt_retirement_switch","='Transaction Assumptions'!$L$2"]
["debt_target","='Transaction Assumptions'!$E$10"]
["debt_term_1","='Transaction Assumptions'!$E$21"]
["debt_term_2","='Transaction Assumptions'!$E$26"]
{"$rows_left_out":25}