{"text_format":"1","workbook":"xlsx","n_sheets":16,"sheets":["Valuation Summary","Master Scenario","Working Model","Credit Analysis Summary","Copper Prices","Chart1","Chart2","Chart3","Stock Prices","Back-up Data","Stable Period","Sheet1","FCX_BS","FCX_IS","FCX_CF","Sheet4"],"not_rendered":{"charts":8,"images":1,"macros":1,"external_links":1,"defined_names":36,"comments":0,"pivot_tables":0},"unopened":[{"sheet":"Chart1","index":5,"reason":"not_a_worksheet"},{"sheet":"Chart2","index":6,"reason":"not_a_worksheet"},{"sheet":"Chart3","index":7,"reason":"not_a_worksheet"}],"bounds":{"document_bytes":16777216,"sheet_cells":100000,"rows_first":2000,"rows_last":500,"rows_between":2000,"halvings":0,"cell_chars":16384,"cell_head_chars":4096},"cells_cut":0,"cells_raw":0,"read":"whole","date_system":"1900"}

{"sheet":"Valuation Summary","index":0,"n_rows":318,"n_cols":9,"rows_kept":318,"cut":false,"hidden":false,"merged":[]}
[]
[null,null,null,null,null,null,"Scenario"]
["Current Stock Price",null,{"$f":"'Stock Prices'!L925","v":33.28}]
[null,null,null,null,null,null,null,"Graph"]
["WACC",null,{"$f":"'Working Model'!E281","v":8.2000000000000003E-2}]
[null,null,null,null,null,null,null,"Sensitivity in Special Case"]
[null,null,"Growth","EV/EBITDA","ROIC",null,null,"Volumes",{"$f":"'Working Model'!H178","v":1600}]
["Value from DCF",null,{"$f":"'Working Model'!E282","v":1.9E-2},{"$f":"'Working Model'!$E$283","v":7.4},{"$f":"'Working Model'!E285","v":0.11700000000000001},null,null,"Prices",{"$f":"'Working Model'!$H$190","v":5000}]
[null,null,null,null,null,null,null,"Cost",{"$f":"'Working Model'!$H$204","v":0.5}]
[null,"Explicit Period Cash Flow",{"$f":"'Working Model'!E395","v":16319793.396520821},{"$f":"C10","v":16319793.396520821},{"$f":"C10","v":16319793.396520821},null,null,"Cap Exp",{"$f":"'Working Model'!$G$221","v":2000}]
[null,"Terminal Value",{"$f":"'Working Model'!E398","v":39396585.226162933},{"$f":"'Working Model'!$E$416","v":37597720.878505774},{"$f":"'Working Model'!E432","v":38923603.088198632}]
[null,"Enterprise Value",{"$f":"SUM(C10:C11)","v":55716378.622683756},{"$f":"SUM(D10:D11)","v":53917514.275026597},{"$f":"SUM(E10:E11)","v":55243396.484719455}]
[null,"Bridge EV vs Equity Value",{"$f":"'Working Model'!$E$409","v":-13592000},{"$f":"C13","v":-13592000},{"$f":"D13","v":-13592000}]
[null,"Equity Value",{"$f":"SUM(C12:C13)","v":42124378.622683756},{"$f":"SUM(D12:D13)","v":40325514.275026597},{"$f":"SUM(E12:E13)","v":41651396.484719455}]
[null,"Shares",{"$f":"'Working Model'!E420","v":949530},{"$f":"C15","v":949530},{"$f":"D15","v":949530}]
{"$rows_left_out":304}
{"sheet":"Master Scenario","index":1,"n_rows":22,"n_cols":11,"rows_kept":22,"cut":false,"hidden":false,"merged":[]}
[]
[null,"WACC",null,{"$f":"'Valuation Summary'!C5","v":8.2000000000000003E-2}]
[null,"Scenario No",null,1]
[]
[]
[null,"Copper px","Copper Volumes","Operating Costs","SG&A%","Cap Exp","AR to Sales","Inventories to CGS","A/P to Expense","Tax Rate","interest Rate"]
["Base case",1,1,1,0.05,1,0.1,0.45,0.3,0.3,0.06]
["Downside case",2,2,2,0.06,2,0.15,0.6,0.2,0.35,0.08]
["High case",3,3,3,0.03,3,0.08,0.3,0.4,0.25,0.05]
["Special case",4,5,4,0.05,4,0.1,0.45,0.3,0.3,0.06]
[{"$f":"TRANSPOSE(B6:K6)","v":"Copper px"},{"$f":"B8","v":2},{"$f":"C$7","v":1},1,0.05,1,0.1,0.45,0.3,0.3,0.06]
["Copper Volumes",{"$f":"B$7","v":1},{"$f":"C8","v":2},1,0.05,1,0.1,0.45,0.3,0.3,0.06]
["Operating Costs",1,1,{"$f":"D8","v":2},0.05,1,0.1,0.45,0.3,0.3,0.06]
["SG&A%",1,1,1,{"$f":"E8","v":0.06},1,0.1,0.45,0.3,0.3,0.06]
["Cap Exp",1,1,1,0.05,{"$f":"F8","v":2},0.1,0.45,0.3,0.3,0.06]
{"$rows_left_out":8}
{"sheet":"Working Model","index":2,"n_rows":668,"n_cols":17,"rows_kept":668,"cut":false,"hidden":false,"merged":[]}
[null,"Year",null,null,2010,2011,2012,2013,2014,2015,{"$f":"J1+1","v":2016},{"$f":"K1+1","v":2017},2018,2019,2020,2021,{"$f":"P1+1","v":2022}]
[null,"Historic Switch",null,null,{"$f":"E1<=$E$6","v":true},{"$f":"F1<=$E$6","v":true},true,false,false,false,false,false,false,false,false,false,false]
[null,"Explicit Period",null,null,{"$f":"AND(E1>$E$6,E1<=$E$8)","v":false},{"$f":"AND(F1>$E$6,F1<=$E$8)","v":false},false,true,true,true,true,true,false,false,false,false,false]
[null,"Terminal Period",null,null,{"$f":"E1=$E$8","v":false},{"$f":"F1=$E$8","v":false},false,false,false,false,false,true,false,false,false,false,false]
[]
[null,"Last Historic Year",null,null,2012]
[null,"Match column of last historic year",null,null,{"$f":"MATCH(E6,1:1)","v":7}]
[null,"Terminal Year",null,null,2017]
[]
["Historic Financials"]
[null,"Profit & Loss Statement"]
[null,null,"Total Revenue ",null,18982000,20880000,18010000]
[null,null,"Cost of Revenue",null,9371000,10920000,11561000]
[null,null,"Gross Profit ",null,{"$f":"E12-E13","v":9611000},{"$f":"F12-F13","v":9960000},{"$f":"G12-G13","v":6449000}]
[null,null,null,"Other Expenses",143000,271000,285000]
{"$rows_left_out":654}
{"sheet":"Credit Analysis Summary","index":3,"n_rows":9,"n_cols":7,"rows_kept":9,"cut":false,"hidden":false,"merged":[]}
[]
[]
[]
[null,"Business Profile",null,7]
[]
[null,"Debt to EBITDA",null,"AA","A","BBB","BB"]
[null,null,null,"1.5x","2.5x","4x","6x"]
[]
[null,"Model",null,"3.5x"]

{"sheet":"Copper Prices","index":4,"n_rows":643,"n_cols":10,"rows_kept":643,"cut":false,"hidden":false,"merged":[]}
[]
[null,"Copper",null,null,null,null,null,null,null,"Copper"]
[null,"($/mt)",null,null,null,null,null,null,null,"($/mt)"]
[null,"COPPER",null,null,null,null,null,"Year","month end","COPPER"]
[1960,678.75583333332997,null,"1960M01",{"$f":"LEFT(D5,4)","v":"1960"},{"$f":"VALUE(RIGHT(D5,2))","v":1},{"$f":"EOMONTH(DATE(E5,F5,1),0)","v":"1960-01-31"},{"$f":"YEAR(G5)","v":1960},{"$f":"EOMONTH(G5,0)","v":"1960-01-31"},715.4]
[1961,633.08416666666994,null,"1960M02",{"$f":"LEFT(D6,4)","v":"1960"},{"$f":"VALUE(RIGHT(D6,2))","v":2},{"$f":"EOMONTH(DATE(E6,F6,1),0)","v":"1960-02-29"},{"$f":"YEAR(G6)","v":1960},{"$f":"EOMONTH(G6,0)","v":"1960-02-29"},728.19]
[1962,645.14333333333002,null,"1960M03","1960",3,"1960-03-31",1960,"1960-03-31",684.94]
[1963,645.95083333333002,null,"1960M04","1960",4,"1960-04-30",1960,"1960-04-30",723.11]
[1964,969.75333333333003,null,"1960M05","1960",5,"1960-05-31",1960,"1960-05-31",684.75]
[1965,1292.8441666666699,null,"1960M06","1960",6,"1960-06-30",1960,"1960-06-30",691.59]
[1966,1531.5133333333299,null,"1960M07","1960",7,"1960-07-31",1960,"1960-07-31",702.39]
[1967,1134.7725,null,"1960M08","1960",8,"1960-08-31",1960,"1960-08-31",675.94]
[1968,1241.9525000000001,null,"1960M09","1960",9,"1960-09-30",1960,"1960-09-30",647.05999999999995]
[1969,1467.34,null,"1960M10","1960",10,"1960-10-31",1960,"1960-10-31",612.66]
[1970,1415.7,null,"1960M11","1960",11,"1960-11-30",1960,"1960-11-30",642.13]
{"$rows_left_out":629}
{"sheet":"Stock Prices","index":8,"n_rows":1369,"n_cols":41,"rows_kept":1369,"cut":false,"hidden":false,"merged":[]}
["S&P 500",null,null,null,null,"BHP",null,null,"FCX",null,null,null,null,null,null,null,null,null,null,null,null,null,null,null,null,null,null,null,null,null,null,null,null,{"$f":"SLOPE(AH157:AH214,AJ157:AJ214)","v":1.9817162258988548},"5yrs"]
[null,null,null,null,null,null,null,null,null,null,null,null,null,null,null,null,null,null,null,"beta","beta vs copper",null,null,null,null,null,null,null,null,null,null,null,null,{"$f":"SLOPE(AH8:AH214,AI8:AI214)","v":0.96040627142822499}]
[null,null,null,null,null,null,null,null,null,null,null,null,null,null,null,null,null,null,null,{"$f":"SLOPE(S8:S24,U8:U24)","v":2.8164535135934934E-2},{"$f":"SLOPE(S8:S24,T8:T24)","v":0.73443611843767975},null,null,null,null,null,null,null,null,null,null,null,null,{"$f":"SLOPE(AH8:AH214,AJ8:AJ214)","v":1.4040931719571204}]
["Date","Month end","Year","Adj Close",null,"Date","Adj Close",null,"Date","Year","MONTH END","Adj Close"]
["1987-01-05",{"$f":"EOMONTH(A5,0)","v":"1987-01-31"},{"$f":"YEAR(A5)","v":1987},258.73,null,"1987-05-29",2.12,null,"1995-07-10",{"$f":"YEAR(I5)","v":1995},{"$f":"EOMONTH(I5,0)","v":"1995-07-31"},8.91,null,null,null,null,null,null,"% change",null,null,null,null,null,"Index rebased"]
["1987-01-12",{"$f":"EOMONTH(A6,0)","v":"1987-01-31"},{"$f":"YEAR(A6)","v":1987},266.27999999999997,null,"1987-06-01",2.2000000000000002,null,"1995-07-17",{"$f":"YEAR(I6)","v":1995},{"$f":"EOMONTH(I6,0)","v":"1995-07-31"},8.26,null,null,"FCX","Copper  px","S&P index",null,"FCX","Copper  px","S&P index",null,null,"FCX","Copper  px","S&P index",null,null,"FCX","copper","S&P index",null,null,"FCX","copper","S&P index",null,null,"FCX","copper","S&P index"]
["1987-01-19","1987-01-31",1987,270.10000000000002,null,"1987-06-08",2.27,null,"1995-07-24",1995,"1995-07-31",9.3800000000000008,null,1995,{"$f":"AVERAGEIF(J:J,N7,L:L)","v":8.7899999999999991},{"$f":"AVERAGEIF('Copper Prices'!H:H,'Stock Prices'!N7,'Copper Prices'!J:J)","v":2935.6058333333331},{"$f":"AVERAGEIF(C:C,N7,D:D)","v":542.7815384615385},null,null,null,null,null,1995,1,1,1,null,{"$f":"K5","v":"1995-07-31"},{"$f":"AVERAGEIF(K:K,AB7,L:L)","v":8.81},{"$f":"AVERAGEIF('Copper Prices'!I:I,'Stock Prices'!AB7,'Copper Prices'!J:J)","v":3075.67},{"$f":"AVERAGEIF(B:B,AB7,D:D)","v":558.35},null,null,null,null,null,null,"1995-07-31",1,1,1]
["1987-01-26","1987-01-31",1987,274.08,null,"1987-06-15",2.29,null,"1995-07-31",1995,"1995-07-31",8.69,null,1996,10.926037735849057,{"$f":"AVERAGEIF('Copper Prices'!H:H,'Stock Prices'!N8,'Copper Prices'!J:J)","v":2294.856666666667},{"$f":"AVERAGEIF(C:C,N8,D:D)","v":672.7343396226413},null,{"$f":"LN(O8/O7)","v":0.21753401203663558},{"$f":"LN(P8/P7)","v":-0.24624346183700899},0.21464359547822048,null,1996,{"$f":"X7*(1+S8)","v":1.2175340120366356},{"$f":"Y7*(1+T8)","v":0.75375653816299104},{"$f":"Z7*(1+U8)","v":1.2146435954782204},null,{"$f":"EOMONTH(AB7,1)","v":"1995-08-31"},{"$f":"AVERAGEIF(K:K,AB8,L:L)","v":8.2750000000000004},{"$f":"AVERAGEIF('Copper Prices'!I:I,'Stock Prices'!AB8,'Copper Prices'!J:J)","v":3036.84},{"$f":"AVERAGEIF(B:B,AB8,D:D)","v":559.56500000000005},null,null,{"$f":"LN(AC8/AC7)","v":-6.2648518684961588E-2},{"$f":"LN(AD8/AD7)","v":-1.2705262597124966E-2},2.1736902687576388E-3,null,"1995-08-31",{"$f":"AM7*(1+AH8)","v":0.93735148131503843},{"$f":"AN7*(1+AI8)","v":0.98729473740287499},1.0021736902687577]
["1987-02-02","1987-02-28",1987,280.04000000000002,null,"1987-06-22",2.2200000000000002,null,"1995-08-07",1995,"1995-08-31",8.57,null,1997,9.9011538461538446,{"$f":"AVERAGEIF('Copper Prices'!H:H,'Stock Prices'!N9,'Copper Prices'!J:J)","v":2276.7666666666664},875.18403846153865,null,{"$f":"LN(O9/O8)","v":-9.8497423268063961E-2},{"$f":"LN(P9/P8)","v":-7.9140791353996646E-3},{"$f":"LN(Q9/Q8)","v":0.26308368272857835},null,1997,{"$f":"X8*(1+S9)","v":1.0976100491097989},{"$f":"Y8*(1+T9)","v":0.74779124927114426},{"$f":"Z8*(1+U9)","v":1.5341965057793121},null,{"$f":"EOMONTH(AB8,1)","v":"1995-09-30"},8.4175000000000004,{"$f":"AVERAGEIF('Copper Prices'!I:I,'Stock Prices'!AB9,'Copper Prices'!J:J)","v":2915.52},580.54250000000002,null,null,{"$f":"LN(AC9/AC8)","v":1.7073950789965989E-2},{"$f":"LN(AD9/AD8)","v":-4.0769309563115384E-2},{"$f":"LN(AE9/AE8)","v":3.6803315045096444E-2},null,"1995-09-30",{"$f":"AM8*(1+AH9)","v":0.95335577437991315},{"$f":"AN8*(1+AI9)","v":0.94704341262366243},{"$f":"AO8*(1+AJ9)","v":1.0390570043216256}]
["1987-02-09","1987-02-28",1987,279.7,null,"1987-06-29",2.2200000000000002,null,"1995-08-14",1995,"1995-08-31",8.39,null,1998,5.391346153846154,{"$f":"AVERAGEIF('Copper Prices'!H:H,'Stock Prices'!N10,'Copper Prices'!J:J)","v":1654.0583333333334},1088.4846153846152,null,-0.60785619647740285,-0.31952444379858552,0.21810755288676725,null,1998,0.43042097944254115,0.50885366627033246,1.8688163513022671,null,"1995-10-31",8.4480000000000004,{"$f":"AVERAGEIF('Copper Prices'!I:I,'Stock Prices'!AB10,'Copper Prices'!J:J)","v":2813.55},584.94400000000007,null,null,3.6168549108130574E-3,-3.5601160351033653E-2,7.5531049484015992E-3,null,"1995-10-31",0.95680392389423119,0.91332756823145733,1.0469051109226386]
["1987-02-17","1987-02-28",1987,285.48,null,"1987-07-06",2.2599999999999998,null,"1995-08-21",1995,"1995-08-31",8.09,null,1999,5.4576000000000002,{"$f":"AVERAGEIF('Copper Prices'!H:H,'Stock Prices'!N11,'Copper Prices'!J:J)","v":1572.8608333333332},1331.5026923076923,null,1.2214028693990117E-2,-5.0335715988354873E-2,0.20152168046444954,null,1999,0.43567815363594764,0.48324015264531589,2.2454233628961409,null,"1995-11-30",8.9675000000000011,{"$f":"AVERAGEIF('Copper Prices'!I:I,'Stock Prices'!AB11,'Copper Prices'!J:J)","v":2977.36},599.93499999999995,null,null,5.9677203460394956E-2,5.6589970638049839E-2,2.5305199860276871E-2,null,"1995-11-30",1.0139033063321714,0.96501274850059704,1.0733972539892813]
["1987-02-23","1987-02-28",1987,284.2,null,"1987-07-13",2.33,null,"1995-08-28",1995,"1995-08-31",8.0500000000000007,null,2000,3.9919230769230767,{"$f":"AVERAGEIF('Copper Prices'!H:H,'Stock Prices'!N12,'Copper Prices'!J:J)","v":1813.4691666666668},1424.2415384615383,null,-0.3127360437265288,0.14234552945418222,6.7331270031284515E-2,null,2000,0.29942589152976262,0.55202722802713322,2.3966105696778559,null,"1995-12-31",9.9075000000000006,{"$f":"AVERAGEIF('Copper Prices'!I:I,'Stock Prices'!AB12,'Copper Prices'!J:J)","v":2926.26},615.42500000000007,null,null,9.9685115658152454E-2,-1.7311844670212462E-2,2.5491770032876639E-2,null,"1995-12-31",1.1149743746900771,0.9483065976937799,1.1007600499418975]
["1987-03-02","1987-03-31",1987,290.66000000000003,null,"1987-07-20",2.36,null,"1995-09-05",1995,"1995-09-30",7.97,null,2001,4.6224999999999987,{"$f":"AVERAGEIF('Copper Prices'!H:H,'Stock Prices'!N13,'Copper Prices'!J:J)","v":1578.2883333333336},1193.4894230769228,null,0.14666259532342704,-0.1389007510066681,-0.17675811366028207,null,2001,0.34334046988854855,0.47535023147803518,1.9729902062033042,null,"1996-01-31",10.044,{"$f":"AVERAGEIF('Copper Prices'!I:I,'Stock Prices'!AB13,'Copper Prices'!J:J)","v":2616.41},617.56200000000001,null,null,1.3683395212885505E-2,-0.11192200801698486,3.4663822729911107E-3,null,"1996-01-31",1.1302310097112012,0.84217021906413703,1.1045757050658327]
["1987-03-09","1987-03-31",1987,289.89,null,"1987-07-27",2.34,null,"1995-09-11",1995,"1995-09-30",8.48,null,2002,5.8476923076923084,{"$f":"AVERAGEIF('Copper Prices'!H:H,'Stock Prices'!N14,'Copper Prices'!J:J)","v":1559.4775},990.57826923076937,null,0.23511142182042344,-1.1990097215383784E-2,-0.18634770069727385,null,2002,0.42406373593253743,0.46965073599125834,1.6053280177790783,null,"1996-02-29",11.0875,{"$f":"AVERAGEIF('Copper Prices'!I:I,'Stock Prices'!AB14,'Copper Prices'!J:J)","v":2537.71},651.94999999999993,null,null,9.8842906340359332E-2,-3.0541049578885732E-2,5.4188403549279771E-2,null,"1996-02-29",1.2419463275470553,0.81644945664983815,1.1644308991226702]
["1987-03-16","1987-03-31",1987,298.17,null,"1987-08-03",2.2999999999999998,null,"1995-09-18",1995,"1995-09-30",8.44,null,2003,10.079230769230769,{"$f":"AVERAGEIF('Copper Prices'!H:H,'Stock Prices'!N15,'Copper Prices'!J:J)","v":1779.1448333333331},967.7936538461538,null,0.54442984105539105,0.1317819888881179,-2.3269985897856504E-2,null,2003,0.65493668828364415,0.53154224406295481,1.5679720574439253,null,"1996-03-31",10.7675,{"$f":"AVERAGEIF('Copper Prices'!I:I,'Stock Prices'!AB15,'Copper Prices'!J:J)","v":2561.02},642.76249999999993,null,null,-2.9286009689569351E-2,9.1435170720387E-3,-1.4192578226860788E-2,null,"1996-03-31",1.2055746753645871,0.82391467619517267,1.1479046224970979]
{"$rows_left_out":1355}
{"sheet":"Back-up Data","index":9,"n_rows":0,"n_cols":0,"rows_kept":0,"cut":false,"hidden":false,"merged":[]}

{"sheet":"Stable Period","index":10,"n_rows":50,"n_cols":103,"rows_kept":50,"cut":false,"hidden":false,"merged":[]}
[]
[null,"Working Capital to EBITDA",{"$f":"'Working Model'!E295","v":0.40013036736107027}]
[null,"EBITDA Growth",0.02]
[]
[null,"EBITDA",100,{"$f":"C5*(1+C3)","v":102}]
[null,"Working Capital",{"$f":"C5*$C$2","v":40.013036736107026},{"$f":"D5*$C$2","v":40.81329747082917}]
[null,"Change in Working Capital",null,{"$f":"D6-C6","v":0.80026073472214421}]
[null,"Percent of EBITDA",null,{"$f":"D7/D5","v":7.8456934776680812E-3}]
[null,"Model",null,{"$f":"'Working Model'!E297","v":7.8456934776680812E-3}]
[]
[null,null,{"$f":"D8","v":7.8456934776680812E-3},0.25,{"$f":"D11+1%","v":0.26},{"$f":"E11+1%","v":0.27},0.28000000000000003,0.29000000000000004,0.30000000000000004,0.31000000000000005,0.32000000000000006,0.33000000000000007,0.34000000000000008,0.35000000000000009,0.3600000000000001,0.37000000000000011,0.38000000000000012,0.39000000000000012,0.40000000000000013,0.41000000000000014,0.42000000000000015,0.43000000000000016,0.44000000000000017,0.45000000000000018,0.46000000000000019,1]
[null,"Growth",-0.02,-5.1020408163265302E-3,-5.3061224489795878E-3,-5.5102040816326445E-3,-5.7142857142857377E-3,-5.9183673469387944E-3,-6.1224489795918147E-3,-6.3265306122449079E-3,-6.5306122448979646E-3,-6.7346938775510578E-3,-6.938775510204079E-3,-7.1428571428570993E-3,-7.3469387755101924E-3,-7.5510204081632856E-3,-7.7551020408163788E-3,-7.9591836734693999E-3,-8.1632653061224931E-3,-8.3673469387755134E-3,-8.5714285714285337E-3,-8.7755102040816269E-3,-8.9795918367346472E-3,-9.1836734693877403E-3,-9.3877551020408335E-3,-2.0408163265306121E-2]
[null,null,{"$f":"C12+0.5%","v":-1.4999999999999999E-2},-3.8071065989847717E-3,-3.9593908629441685E-3,-4.1116751269035289E-3,-4.2639593908629612E-3,-4.4162436548223216E-3,-4.5685279187817184E-3,-4.7208121827411516E-3,-4.873096446700512E-3,-5.0253807106598724E-3,-5.1776649746192692E-3,-5.329949238578666E-3,-5.4822335025380628E-3,-5.6345177664975316E-3,-5.7868020304568555E-3,-5.9390862944162523E-3,-6.0913705583756491E-3,-6.2436548223350459E-3,-6.3959390862944419E-3,-6.5482233502537667E-3,-6.7005076142131635E-3,-6.8527918781725603E-3,-7.0050761421320291E-3,-1.5228426395939087E-2]
[null,null,-9.9999999999999985E-3,-2.5252525252525255E-3,-2.6262626262626063E-3,-2.7272727272727232E-3,-2.8282828282828396E-3,-2.9292929292929208E-3,-3.0303030303030377E-3,-3.1313131313131541E-3,-3.2323232323232354E-3,-3.3333333333333162E-3,-3.434343434343397E-3,-3.5353535353535499E-3,-3.6363636363636307E-3,-3.7373737373737831E-3,-3.8383838383838644E-3,-3.9393939393939448E-3,-4.0404040404040257E-3,-4.1414141414141074E-3,-4.2424242424242593E-3,-4.3434343434343402E-3,-4.4444444444444219E-3,-4.5454545454545027E-3,-4.6464646464646547E-3,-1.0101010101010102E-2]
[null,null,-4.9999999999999984E-3,-1.2562814070351759E-3,-1.3065326633165729E-3,-1.3567839195979699E-3,-1.4070351758794027E-3,-1.4572864321607997E-3,-1.5075376884421967E-3,-1.5577889447236295E-3,-1.6080402010050265E-3,-1.6582914572864237E-3,-1.7085427135678562E-3,-1.7587939698492177E-3,-1.8090452261306505E-3,-1.8592964824120832E-3,-1.9095477386935158E-3,-1.9597989949748772E-3,-2.0100502512563098E-3,-2.0603015075376712E-3,-2.1105527638191042E-3,-2.1608040201004652E-3,-2.2110552763818982E-3,-2.2613065326632592E-3,-2.3115577889447638E-3,-5.0251256281407036E-3]
{"$rows_left_out":36}
{"sheet":"Sheet1","index":11,"n_rows":0,"n_cols":0,"rows_kept":0,"cut":false,"hidden":false,"merged":[]}

{"sheet":"FCX_BS","index":12,"n_rows":56,"n_cols":6,"rows_kept":56,"cut":false,"hidden":false,"merged":[]}
["View: Annual Data | Quarterly Data"]
["Period Ending",null,"2010-12-30","2011-12-30","2012-12-30"]
["Assets"]
["Current Assets"]
[null,"Cash And Cash Equivalents","3,738,000  ","4,822,000  ","3,705,000  ",{"$f":"E5","v":"3,705,000  "}]
[null,"Short Term Investments","-  ","-  ","-  "]
[null,"Net Receivables","2,425,000  ","1,142,000  ","1,629,000  "]
[null,"Inventory","3,434,000  ","3,869,000  ","4,576,000  "]
[null,"Other Current Assets","254,000  ","214,000  ","387,000  "]
["Total Current Assets ",null,"9,851,000   ","10,047,000   ","10,297,000   "]
["Long Term Investments",null,"200,000  ","675,000  ","769,000  "]
["Property Plant and Equipment",null,"18,210,000  ","20,135,000  ","22,954,000  "]
["Goodwill",null,"-  ","-  ","-  "]
["Intangible Assets",null,"328,000  ","-  ","-  "]
["Accumulated Amortization",null,"-  ","-  ","-  "]
{"$rows_left_out":42}
{"sheet":"FCX_IS","index":13,"n_rows":41,"n_cols":6,"rows_kept":41,"cut":false,"hidden":false,"merged":[]}
["View: Annual Data | Quarterly Data",null,null,null,null,"All numbers in thousands"]
["Period Ending",null,"2010-12-30","2011-12-30","2012-12-30"]
["Total Revenue ",null,"18,982,000   ","20,880,000   ","18,010,000   "]
["Cost of Revenue",null,"9,371,000  ","10,920,000  ","11,561,000  "]
["Gross Profit ",null,"9,611,000   ","9,960,000   ","6,449,000   "]
[null,"Operating Expenses"]
[null,"Research Development","143,000  ","271,000  ","285,000  "]
[null,"Selling General and Administrative","381,000  ","415,000  ","431,000  "]
[null,"Non Recurring","19,000  ","134,000  ",-22000]
[null,"Others","-  ","-  ","-  "]
[null,"Total Operating Expenses","-  ","-  ","-  "]
["Operating Income or Loss ",null,"9,068,000   ","9,140,000   ","5,814,000   "]
[null,"Income from Continuing Operations"]
[null,"Total Other Income/Expenses Net",-94000,-10000,-82000]
[null,"Earnings Before Interest And Taxes","9,055,000  ","9,198,000  ","5,900,000  "]
{"$rows_left_out":27}
{"sheet":"FCX_CF","index":14,"n_rows":12,"n_cols":5,"rows_kept":12,"cut":false,"hidden":false,"merged":[]}
["Depreciation",null,"1,036,000  ","1,022,000  ","1,179,000  "]
["Capital Expenditures",null,-1412000,-2534000,-3494000]
["Dividends Paid",null,-1796000,-1814000,-1242000]
[]
[]
["Copyright © 2013 Yahoo! Inc. All rights reserved. Privacy Policy - About Our Ads - Terms of Service - Copyright/IP Policy - Send Feedback - Yahoo! - ABC News Network"]
["Quotes are real-time for NASDAQ, NYSE, and NYSE MKT. See also delay times for other exchanges. All information provided \"as is\" for informational purposes only, not intended for trading purposes or advice. Neither Yahoo! nor any of independent providers is liable for any informational errors, incompleteness, or delays, or for any actions taken in reliance on information contained herein. By accessing the Yahoo! site, you agree not to redistribute the information found therein. Real-Time continuous streaming quotes are available through our premium service. You may turn streaming quotes on or off."]
[]
["US Financials data provided by Edgar Online and all other Financials provided by Capital IQ."]
[]
[]
[95941457]

{"sheet":"Sheet4","index":15,"n_rows":24,"n_cols":6,"rows_kept":24,"cut":false,"hidden":false,"merged":[]}
[null,null,"Industry Demand"]
[null,null,"Industry Growth"]
[null,null,null,"Base case"]
[null,null,null,"High Demand case"]
[null,null,null,"Low demand Case"]
[null,null,null,"Special Case (Sudden Decline)"]
[]
[null,null,null,"Industry Growth Scenario",2]
[null,null,null,{"$f":"INDEX(D3:D6,$E$8)","v":"High Demand case"}]
[]
[null,null,"Industry Supply"]
[null,null,null,"Supply base case"]
[null,null,null,"Oversupply case"]
[null,null,null,"Constrained case"]
[]
{"$rows_left_out":9}