{"text_format":"1","workbook":"xlsx","n_sheets":10,"sheets":["Steps in Analysis","Summary","Scenario Analysis","Assumptions","Financial Model","Depreciation","Airline Fleet","Sensitivity Diagram","Assumptions Graph","Output Graph"],"not_rendered":{"charts":11,"images":0,"macros":1,"external_links":0,"defined_names":12,"comments":0,"pivot_tables":0},"unopened":[{"sheet":"Sensitivity Diagram","index":7,"reason":"not_a_worksheet"},{"sheet":"Assumptions Graph","index":8,"reason":"not_a_worksheet"},{"sheet":"Output Graph","index":9,"reason":"not_a_worksheet"}],"bounds":{"document_bytes":16777216,"sheet_cells":100000,"rows_first":2000,"rows_last":500,"rows_between":2000,"halvings":0,"cell_chars":16384,"cell_head_chars":4096},"cells_cut":0,"cells_raw":0,"read":"whole","date_system":"1900"}

{"sheet":"Steps in Analysis","index":0,"n_rows":8,"n_cols":8,"rows_kept":8,"cut":false,"hidden":false,"merged":[]}
[]
[null,"1. Compile the financial statements",null,null,null,null,null,"Viedo"]
[null,"2. Define the capacity quantity",null,null,null,null,null,"How to copy and paste special with operations"]
[null,"3. Work through prices and quantity",null,null,null,null,null,"Graph key assumptions by using TRUE"]
[null,"4. Develop drivers of operating expense",null,null,null,null,null,"Forecasting Method"]
[null,null,null,null,null,null,null,"Conditional Formatting"]
[]
[null,null,null,null,null,null,null,"Working with existing depreciation"]

{"sheet":"Summary","index":1,"n_rows":17,"n_cols":4,"rows_kept":17,"cut":false,"hidden":false,"merged":[]}
[]
[]
[]
[]
["Custom Scenario Inputs"]
[{"$f":"'Scenario Analysis'!C41","v":"Planes Grounded"}]
[{"$f":"'Scenario Analysis'!C42","v":"Price Increase"}]
[{"$f":"'Scenario Analysis'!C43","v":"Other Revenues"},null,null,{"$f":"'Scenario Analysis'!$F$28","v":39000}]
[{"$f":"'Scenario Analysis'!C44","v":"Flight Expense per Hour"}]
[{"$f":"'Scenario Analysis'!C45","v":"Maint  per Hour"}]
[{"$f":"'Scenario Analysis'!C46","v":"Fuel Expense per Hour"}]
[{"$f":"'Scenario Analysis'!C47","v":"SG&A per Revenue"}]
[{"$f":"'Scenario Analysis'!C48","v":"Bad Debt Expense"},null,null,{"$f":"'Scenario Analysis'!K29","v":5.0000000000000001E-3}]
[{"$f":"'Scenario Analysis'!C49","v":"Cap Exp - Maintenance"}]
[{"$f":"'Scenario Analysis'!C50","v":"A/R to Revenues"},null,null,{"$f":"'Scenario Analysis'!M29","v":0.15}]
[{"$f":"'Scenario Analysis'!C51","v":"A/P to Expenses"},null,null,{"$f":"'Scenario Analysis'!N29","v":0.12}]
[{"$f":"'Scenario Analysis'!C52","v":"Interest Rate"},null,null,{"$f":"'Scenario Analysis'!O29","v":8.5000000000000006E-2}]

{"sheet":"Scenario Analysis","index":2,"n_rows":52,"n_cols":24,"rows_kept":52,"cut":false,"hidden":false,"merged":[]}
["Comparison",null,null,1,{"$f":"INDEX(C10:C13,D1)","v":"Company Case"},null,null,null,null,null,null,null,null,null,null,null,null,null,null,"col input",{"$f":"COLUMN(P12)","v":16}]
["Sensitivity",null,null,3,{"$f":"INDEX(C10:C13,D2)","v":"Low Case"},null,null,null,null,null,null,null,null,null,null,null,null,null,null,"Row input",{"$f":"ROW(Q9)","v":9}]
[null,null,null,null,null,null,null,null,null,null,null,null,null,null,null,null,null,null,null,"Start row",{"$f":"ROW(Q10)","v":10}]
[null,null,null,null,null,null,null,null,null,null,null,null,null,null,null,null,null,null,null,"End row",{"$f":"ROW(C25)","v":25}]
[null,null,null,null,"Code Number",null,18,null,null,null,null,null,null,null,null,null,null,null,null,"start col",{"$f":"COLUMN(Q10)","v":17}]
[null,null,null,null,null,null,null,null,null,null,null,null,null,null,null,null,null,null,null,"end col",{"$f":"COLUMN(X9)","v":24}]
[null,null,null,1,{"$f":"D7+1","v":2},{"$f":"E7+1","v":3},4,5,6,7,8,9,10,11,12,null,1998,{"$f":"Q7+1","v":1999},{"$f":"R7+1","v":2000},2001,2002,2003,2004,2005]
[null,null,null,"Planes Grounded","Price Increase","Other Revenues","Flight Expense per Hour","Maint  per Hour","Fuel Expense per Hour","SG&A per Revenue","Bad Debt Expense","Cap Exp - Maintenance","A/R to Revenues","A/P to Expenses","Interest Rate",null,{"$f":"'Financial Model'!$K$380 &\" \" &Q7","v":"Balance of New Debt 1998"},{"$f":"'Financial Model'!$K$380 &\" \" &R7","v":"Balance of New Debt 1999"},{"$f":"'Financial Model'!$K$380 &\" \" &S7","v":"Balance of New Debt 2000"},{"$f":"'Financial Model'!$K$380 &\" \" &T7","v":"Balance of New Debt 2001"},{"$f":"'Financial Model'!$K$380 &\" \" &U7","v":"Balance of New Debt 2002"},{"$f":"'Financial Model'!$K$380 &\" \" &V7","v":"Balance of New Debt 2003"},{"$f":"'Financial Model'!$K$380 &\" \" &W7","v":"Balance of New Debt 2004"},{"$f":"'Financial Model'!$K$380 &\" \" &X7","v":"Balance of New Debt 2005"}]
[null,null,null,null,null,null,null,null,null,null,null,null,null,null,null,null,{"$f":"IFERROR('Financial Model'!P382,FALSE)","v":61222.422051130263},{"$f":"IFERROR('Financial Model'!Q382,FALSE)","v":14273.386286597983},{"$f":"IFERROR('Financial Model'!R382,FALSE)","v":0},{"$f":"IFERROR('Financial Model'!S382,FALSE)","v":0},{"$f":"IFERROR('Financial Model'!T382,FALSE)","v":0},{"$f":"IFERROR('Financial Model'!U382,FALSE)","v":0},{"$f":"IFERROR('Financial Model'!V382,FALSE)","v":0},{"$f":"IFERROR('Financial Model'!W382,FALSE)","v":0}]
[null,null,"Company Case",1,1,50000,1,1,1,1,5.0000000000000001E-3,1,0.15,0.12,9.5000000000000001E-2,1,1.5904964654233242,2.429958828444656,3.1578330957196559,3.6089621077374345,3.9921974396584337,false,false,false]
[null,null,"Base Case",2,2,48000,2,2,2,2,5.4999999999999997E-3,2,0.16,0.11,9.5000000000000001E-2,{"$f":"P10+1","v":2},0.80319123073088605,1.1704738641265908,1.4762571828704758,1.6142477338093904,1.804644947399382,false,false,false]
[null,null,"Low Case",3,3,45000,3,3,3,3,6.0000000000000001E-3,3,0.17,0.1,0.1,{"$f":"P11+1","v":3},0.19799288450077079,0.26452651383770415,1.7722764059971752E-2,0.16614790603573698,5.0662428548443703E-2,0.39146668568701304,0.64745020695327382,0.66411750705281003]
[null,null,"Worst Case",4,3,40000,4,4,4,4,6.1999999999999998E-3,4,0.18,0.09,0.11,4,-0.1490029687288365,-0.30896676536509005,-0.4595633658299369,-0.27953618773892097,-0.32335816342899437,-0.27788506534252633,-7.3824180316650084E-2,-2.1809016007829893E-2]
[null,1,{"$f":"TRANSPOSE(D8:O8)&\" \"&$E$2&\" \"&\" vs \"&E1","v":"Planes Grounded Low Case  vs Company Case"},{"$f":"IF(D$7=$B14,OFFSET(D$10,$D$2-1,0),OFFSET(D$10,$D$1-1,0))","v":3},1,50000,1,1,1,1,5.0000000000000001E-3,1,0.15,0.12,9.5000000000000001E-2,5,1.497190725336186,2.2710101686065327,2.9620349068829777,3.3918369422847072,3.7528095368994552,false,false,false]
[null,{"$f":"B14+1","v":2},"Price Increase Low Case  vs Company Case",1,3,50000,1,1,1,1,5.0000000000000001E-3,1,0.15,0.12,9.5000000000000001E-2,6,1.347409026982793,1.660100214634155,1.7191855264775933,1.9619851068867096,2.0767040921995363,false,false,false]
[null,{"$f":"B15+1","v":3},"Other Revenues Low Case  vs Company Case",1,1,45000,1,1,1,1,5.0000000000000001E-3,1,0.15,0.12,9.5000000000000001E-2,7,1.5139678073710487,2.3245009397898504,3.0581696666607052,3.4991899594453622,3.8705157651407007,false,false,false]
[null,4,"Flight Expense per Hour Low Case  vs Company Case",1,1,50000,3,1,1,1,5.0000000000000001E-3,1,0.15,0.12,9.5000000000000001E-2,8,1.2720644112652437,1.9322448152503076,2.6387706993091822,3.1121881811322529,3.4834243065353392,false,false,false]
[null,5,"Maint  per Hour Low Case  vs Company Case",1,1,50000,1,3,1,1,5.0000000000000001E-3,1,0.15,0.12,9.5000000000000001E-2,9,1.1128483841862045,1.8204647065067989,2.2858075503751003,2.8141238251691445,3.1781604266614818,false,false,false]
[null,6,"Fuel Expense per Hour Low Case  vs Company Case",1,1,50000,1,1,3,1,5.0000000000000001E-3,1,0.15,0.12,9.5000000000000001E-2,10,1.5904964654233242,2.429958828444656,3.1578330957196559,3.6089621077374345,3.9921974396584337,false,false,false]
[null,7,"SG&A per Revenue Low Case  vs Company Case",1,1,50000,1,1,1,3,5.0000000000000001E-3,1,0.15,0.12,9.5000000000000001E-2,11,1.5552892415785193,2.3505845001137189,3.0323723517216483,3.477008939101748,3.8536785299033411,false,false,false]
{"$rows_left_out":33}
{"sheet":"Assumptions","index":3,"n_rows":274,"n_cols":27,"rows_kept":274,"cut":false,"hidden":false,"merged":[]}
[null,"Year",null,null,null,null,null,null,null,null,null,null,{"$f":"N1-1","v":1992},{"$f":"O1-1","v":1993},{"$f":"P1-1","v":1994},{"$f":"Q1-1","v":1995},{"$f":"R1-1","v":1996},1997,1997,{"$f":"S1+1","v":1998},{"$f":"T1+1","v":1999},2000,2001,2002,2003,2004,2005]
[null,"Fraction of Year",null,null,null,null,null,null,null,null,null,null,1,1,1,1,1,{"$f":"'Financial Model'!N4","v":0.7142857142857143},{"$f":"'Financial Model'!O4","v":0.2857142857142857},1,1,1,1,1,1,1,1]
[null,"Switch",null,null,null,null,null,null,null,null,null,null,false,false,false,false,false,true,false,false,false,false,false,false,false,false,false]
[null,null,null,null,"Method","Last Value","Average","Input","Value Applied","Graph","Graph No","Index Code",true,true,true,true,true,true,false,false,false,false,false,false,false,false,false]
[null,"Capacity ",null,null,null,null,null,null,null,null,0]
[null,null,"Base Capacity",null,null,null,null,null,null,null,{"$f":"K5+J6","v":0},null,null,null,null,null,null,{"$f":"'Airline Fleet'!$M$34","v":6138986.666666667},{"$f":"'Airline Fleet'!$M$34","v":6138986.666666667},{"$f":"S6","v":6138986.666666667},{"$f":"T6","v":6138986.666666667},6138986.666666667,6138986.666666667,6138986.666666667,6138986.666666667,6138986.666666667,6138986.666666667]
[null,null,"Capacity per 747",null,null,null,null,null,null,null,{"$f":"K6+J7","v":0},null,null,null,null,null,null,{"$f":"S7","v":229000},{"$f":"'Airline Fleet'!K9","v":229000},{"$f":"S7","v":229000},{"$f":"T7","v":229000},229000,229000,229000,229000,229000,229000]
[null,null,"Planes Grounded",null,null,null,null,null,null,null,0]
[null,null,null,"Company Base",null,null,null,null,null,null,0,null,null,null,null,null,null,4,4,1,0,0,0,0,0,0,0]
[null,null,null,"Base Case",null,null,null,null,null,null,0,null,null,null,null,null,null,4,4,2,1,1,1,1,1,1,1]
[null,null,null,"Downside Case",null,null,null,null,null,null,0,null,null,null,null,null,null,4,4,3,2,2,2,2,2,2,2]
[null,null,null,"Worst Case",null,null,null,null,null,null,0,null,null,null,null,null,null,6,6,6,6,6,6,6,6,6,6]
[null,null,null,{"$f":"INDEX(D9:D12,$L$13)","v":"Company Base"},null,null,null,null,null,null,0,{"$f":"'Scenario Analysis'!D29","v":1},null,null,null,null,null,{"$f":"INDEX(R9:R12,$L$13)","v":4},4,1,0,0,0,0,0,0,0]
[null,null,null,"Capacity Not Operable",null,null,null,null,null,null,0,null,null,null,null,null,null,{"$f":"R13*R7","v":916000},916000,229000,0,0,0,0,0,0,0]
[null,null,null,"Capacity Before Retirements",null,null,null,null,null,null,0,null,null,null,null,null,null,{"$f":"R6-R14","v":5222986.666666667},5222986.666666667,5909986.666666667,6138986.666666667,6138986.666666667,6138986.666666667,6138986.666666667,6138986.666666667,6138986.666666667,6138986.666666667]
[null,null,null,"Retirement Rate",null,null,null,null,null,null,0,null,null,null,null,null,null,null,null,{"$f":"Depreciation!F13","v":3.3311710750748923E-2},{"$f":"Depreciation!G13","v":3.6642881825823821E-2},{"$f":"Depreciation!H13","v":4.030717000840621E-2},{"$f":"Depreciation!I13","v":4.4337887009246832E-2},{"$f":"Depreciation!J13","v":4.8771675710171519E-2},{"$f":"Depreciation!K13","v":5.3648843281188678E-2},{"$f":"Depreciation!L13","v":5.9013727609307551E-2},{"$f":"Depreciation!M13","v":6.4915100370238316E-2}]
[null,null,null,"Retirements ",null,null,null,null,null,null,0,null,null,null,null,null,null,{"$f":"R8-R16","v":0},{"$f":"S15*S16","v":0},{"$f":"T15*T16+S17","v":196871.76638078279},{"$f":"U15*U16+T17","v":421821.92933775752},669267.10859042988,941456.80576836946,1240865.4726641029,1570215.0062494099,1932499.4931932474,2331012.4288314688]
[null,null,null,"Net Capacity",null,null,null,null,null,true,1,null,null,null,null,null,null,{"$f":"R15-R17","v":5222986.666666667},{"$f":"S15-S17","v":5222986.666666667},{"$f":"T15-T17","v":5713114.9002858838},5717164.7373289093,5469719.5580762373,5197529.8608982973,4898121.1940025641,4568771.6604172569,4206487.1734734196,3807974.2378351982]
[null,null,null,null,null,null,null,null,null,null,1]
[null,null,"Flight Hours",null,null,null,null,null,null,true,2,null,{"$f":"'Financial Model'!I106","v":39404},{"$f":"'Financial Model'!J106","v":55220},{"$f":"'Financial Model'!K106","v":76346},{"$f":"'Financial Model'!L106","v":84058},{"$f":"'Financial Model'!M106","v":91690},{"$f":"'Financial Model'!N106","v":70721},{"$f":"R20/R$2*S$2","v":28288.399999999998},{"$f":"(R20+S20)*T$18/S$18","v":108300.50208980656},{"$f":"T20*U18/T18","v":108377.27271192719},{"$f":"U20*V18/U18","v":103686.58512372104},98526.828776694267,92851.096794964833,86607.791615062451,79740.155917169832,72185.756649487957]
{"$rows_left_out":255}
{"sheet":"Financial Model","index":4,"n_rows":386,"n_cols":23,"rows_kept":386,"cut":false,"hidden":false,"merged":[]}
["Timing"]
[null,"Year",null,null,null,null,null,null,1992,1993,1994,1995,1996,1997,{"$f":"N2","v":1997},{"$f":"O2+1","v":1998},{"$f":"P2+1","v":1999},2000,2001,2002,2003,2004,2005]
[null,"Months",null,null,null,null,null,null,12,12,12,12,12,9,3,12,12,12,12,12,12,12,12]
[null,"Annualisation Factor",null,null,null,null,null,null,1,1,1,1,1,{"$f":"1/1.4","v":0.7142857142857143},{"$f":"1-N4","v":0.2857142857142857},1,1,1,1,1,1,1,1]
[null,"Historic Switch",null,null,"Debt ","IC Cap","IC Dir","Test",true,true,true,true,true,true,false,false,false,false,false,false,false,false,false]
["Historic Financial Statements"]
[null,"Balance Sheet"]
[null,null," CURRENT ASSETS:                                "]
[null,null,null,"  Cash                                ",null,null,null,null,1000,1000,1000,1091.96,2324.3530000000001,3282.1419999999998]
[null,null,null,"  Restricted cash                               ",null,null,null,null,null,null,null,0,795.03,14036.924000000001]
[null,null,null,"  Accounts receivable, net (Notes 1 and 3)                          ",null,null,null,null,5478,35827,44920,88273.823000000004,67081.125,64908.684000000001]
[null,null,null,"  Accounts receivable 0 related parties                            ",null,null,null,null,null,null,null,4390.2610000000004,2960.7779999999998,1254.798]
[null,null,null,"  Expendable parts and supplies                             ",null,null,null,null,null,null,null,12330.853999999999,20742.14,24624.353999999999]
[null,null,null,"  Aircraft held for resale (Note 4)                           ",null,null,null,null,null,null,null,6593.0690000000004,6117.2659999999996,5346.4530000000004]
[null,null,null,"  Deposits, prepaid expenses and other assets                           ",null,null,null,null,null,null,null,4914.0559999999996,8018.2730000000001,7326.0079999999998]
[null,null,null,"  Prepaid fuel                               ",null,null,null,null,null,null,null,4080.373,5828.0469999999996,6999.5649999999996]
[null,null,null,"  Notes receivable, current                              ",null,null,null,null,null,null,null,186.08500000000001,186.08500000000001,100.804]
[null,null,null,"  Total current assets                              ",null,null,null,null,null,null,null,121860.48100000003,114053.09700000002,127879.732]
[null,null,null," PROPERTY AND EQUIPMENT:                               ",null,null,null,null,null,null,null,0,0,0]
[null,null,null,"  Land and improvements                              ",null,null,null,null,null,null,null,228.678,228.678,228.678]
{"$rows_left_out":367}
{"sheet":"Depreciation","index":5,"n_rows":27,"n_cols":18,"rows_kept":27,"cut":false,"hidden":false,"merged":[]}
[]
[null,null,null,null,1997,{"$f":"E2+1","v":1998},{"$f":"F2+1","v":1999},{"$f":"G2+1","v":2000},2001,2002,2003,2004,2005,2006,2007,2008,2009,2010]
[]
[null,null,null,"Plane Life",13]
[null,null,null,"Historic Growth",0.1]
[null,null,null,"Units",1]
[]
[null,null,null,"Plant in Service",{"$f":"'Financial Model'!N25+'Financial Model'!N29+'Financial Model'!N28","v":385702.75199999998}]
[null,null,null,"Accum Depreciation",{"$f":"'Financial Model'!N26","v":113883.56}]
[null,null,null,"Net",{"$f":"E8-E9","v":271819.19199999998},{"$f":"E10/E8","v":0.70473749692094501}]
[]
[null,null,null,"Retirement",1]
[null,null,null,"Retirement Rate",null,3.3311710750748923E-2,{"$f":"F13*(1+$E$5)","v":3.6642881825823821E-2},{"$f":"G13*(1+$E$5)","v":4.030717000840621E-2},4.4337887009246832E-2,4.8771675710171519E-2,5.3648843281188678E-2,5.9013727609307551E-2,6.4915100370238316E-2,7.140661040726215E-2,7.854727144798837E-2,8.6401998592787216E-2,{"$f":"P13*(1+$E$5)","v":9.5042198452065949E-2},0.10454641829727256]
[]
[null,null,null,"Plant In Service"]
[null,null,null,"Opening Balance",null,{"$f":"E18","v":385702.75199999998},{"$f":"F18","v":372854.33348960814},358721.07312817709,343174.48673060292,326073.24169327138,307261.87215220666,286569.36565703549,263807.60851234721,238769.67565319009,211227.94950811725,180932.05074853712,{"$f":"P18","v":147606.56211299897},110948.52461390701]
[null,null,null,"Less: Retirements",null,{"$f":"$E$8*F13","v":12848.418510391844},{"$f":"$E$8*G13","v":14133.260361431032},15546.586397574138,17101.245037331551,18811.369541064709,20692.506495171183,22761.757144688301,25037.932859157136,27541.726145072851,30295.898759580137,33325.488635538153,36658.037499091974,40323.841249001176]
[null,null,null,"Closing Balance",{"$f":"E8","v":385702.75199999998},{"$f":"F16-F17","v":372854.33348960814},{"$f":"G16-G17","v":358721.07312817709},343174.48673060292,326073.24169327138,307261.87215220666,286569.36565703549,263807.60851234721,238769.67565319009,211227.94950811725,180932.05074853712,147606.56211299897,{"$f":"Q16-Q17","v":110948.52461390701},{"$f":"R16-R17","v":70624.683364905824}]
[null,null,null,"Depreciation",{"$f":"1/$E$4","v":7.6923076923076927E-2},{"$f":"$E$19*F16","v":29669.442461538463},{"$f":"$E$19*G16","v":28681.102576123703},27593.928702167468,26398.037440815609,25082.557053328568,23635.528627092823,22043.7973582335,20292.892962488248,18366.898127168468,16248.303808316712,13917.850057579779,{"$f":"$E$19*Q16","v":11354.350931769153},8534.5018933774627]
[]
{"$rows_left_out":8}
{"sheet":"Airline Fleet","index":6,"n_rows":34,"n_cols":14,"rows_kept":34,"cut":false,"hidden":false,"merged":[]}
[" NUMBER NUMBER OPERATED"]
[" OWNED BY LEASED BY IN"]
[" MANUFACTURER THE THE REVENUE MAXIMUM NUMBER STAGE III"]
[" AND MODEL SERIES(1) COMPANY COMPANY SERVICE CONFIGURATION PAYLOAD(2) COMPLIANT(3)"]
[]
[null,null,"Company",null,null,"In Revenue","Out of",null,null,null,null,null,"Noise","Not "]
[null,"Model","Owned","Leased","Total","Service","Service",null,"Min","Max","Average",null,"Complaint","Compliant"]
[]
["Boeing 747............",200,6,0,{"$f":"C9+D9","v":6},2,{"$f":"C9+D9-F9","v":4},"Freight",213000,245000,{"$f":"AVERAGE(I9:J9)","v":229000},null,6,{"$f":"C9+D9-M9","v":0}]
["Boeing 747............",100,3,0,{"$f":"C10+D10","v":3},2,{"$f":"C10+D10-F10","v":1},"Freight",218000,218000,{"$f":"AVERAGE(I10:J10)","v":218000},null,3,{"$f":"C10+D10-M10","v":0}]
["Boeing 747............",100,2,0,2,2,0,"Passenger",476,476,476,null,2,0]
["Lockheed L-1011.......",200,6,0,6,6,0,"Freight",125000,125000,125000,null,6,0]
["Lockheed L-1011.......",200,2,0,2,2,0,"Passenger",354,354,354,null,2,0]
["Douglas DC-8..........",60,11,0,11,11,0,"Freight",80000,112000,null,null,6,5]
["Douglas DC-8..........",50,9,0,9,8,1,"Freight",58500,97300,77900,null,0,9]
["Boeing 727............",200,24,4,28,28,0,"Freight",44000,63000,53500,null,10,18]
["Boeing 727............",200,4,0,4,0,4,"Passenger",160,160,160,null,1,3]
["Boeing 727............",100,1,1,2,2,0,"Freight",40000,54500,47250,null,0,2]
["Douglas DC-9..........",15,5,0,5,5,0,"Freight",22000,24000,23000,null,3,2]
[null,0,0,0,0,0,0]
{"$rows_left_out":14}