{"text_format":"1","workbook":"xlsx","n_sheets":21,"sheets":["Contents","Transaction Assumptions","Transaction Structure","Merger Assumptions","Merger Model","Acquiror Scenario","Acquiror Assumptions","Acquiror Model","Target Scenario","Target Assumptions","Target Model","Airline Fleet (2)","Debt 1998","Pro Forma BS","Airline Fleet","Fleet Before Merger","Aircraft Purchase","Pro Forma IS","Plant Balance","Purchase Price Allocation","Sources and Uses"],"not_rendered":{"charts":6,"images":0,"macros":1,"external_links":2,"defined_names":22,"comments":1,"pivot_tables":0},"unopened":[],"bounds":{"document_bytes":16777216,"sheet_cells":100000,"rows_first":2000,"rows_last":500,"rows_between":2000,"halvings":0,"cell_chars":16384,"cell_head_chars":4096},"cells_cut":0,"cells_raw":0,"read":"whole","date_system":"1900"}

{"sheet":"Contents","index":0,"n_rows":27,"n_cols":5,"rows_kept":27,"cut":false,"hidden":false,"merged":[]}
[null,null,"Go to Charts by Pressing Shift and Enter on Menu Item "]
[]
[null,null,"Sheet Tab","Description","Author"]
[null,1,"Contents"]
[null,2,"Transaction Assumptions"]
[null,3,"Transaction Structure"]
[null,4,"Merger Assumptions"]
[null,5,"Merger Model"]
{"$rows_left_out":20}
{"sheet":"Transaction Assumptions","index":1,"n_rows":150,"n_cols":20,"rows_kept":150,"cut":false,"hidden":false,"merged":[]}
["Transaction Period",null,null,"Period","Column",null,null,"KH Plane Strategy"]
[null,"Period in KH Model",null,6,{"$f":"MATCH(D2,'Acquiror Model'!1:1)","v":13},null,null,"KH Scenario"]
[null,"Period in Kalitta Model",null,6,{"$f":"MATCH(D3,'Target Model'!1:1)","v":14},null,null,"Kalitta Scenario"]
[]
["Consideration for Equity",null,null,null,null,null,"Accretion and Dilution"]
[null,"Total Consideration"]
[null,"Cash to Kalitta",null,20000]
[null,"Shares to Kalitta",null,4099,null,null,null,null,null,null,null,null,null,null,null,{"$f":"'Merger Model'!H208","v":1997},{"$f":"'Merger Model'!I208","v":1998},{"$f":"'Merger Model'!J208","v":1999},{"$f":"'Merger Model'!K208","v":2000},{"$f":"'Merger Model'!L208","v":2001}]
{"$rows_left_out":143}
{"sheet":"Transaction Structure","index":2,"n_rows":72,"n_cols":18,"rows_kept":72,"cut":false,"hidden":false,"merged":[]}
[null,null,null,null,null,null,null,null,null,null,null,null,null,null,null,"KH Planes"]
[null,null,null,null,null,null,null,null,null,null,null,null,null,null,null,"KH Assumptions"]
["Uses and Sources",null,null,null,null,null,"Valuation Multiples for Transaction",null,null,null,null,null,null,null,null,"Kalitta Assumptions"]
[null,"Uses of Funds",null,null,null,null,"Kalitta EBITDA",null,{"$f":"'Target Model'!P235","v":87588.495391438017}]
[null,null,"Consideration - Cash",null,{"$f":"'Transaction Assumptions'!D7","v":20000}]
[null,null,"Consideration - Shares",null,{"$f":"'Transaction Assumptions'!D10","v":77881},null,"Kalittal EV",null,{"$f":"SUM(E5:E10)","v":459015.71099999995}]
[null,null,"Consideration - Asset Purchase",null,{"$f":"'Transaction Assumptions'!D11","v":51000},null,"EV/EBITDA",null,{"$f":"I6/I4","v":5.2405936298897746}]
[null,null,"Transaction Fees",null,{"$f":"'Transaction Assumptions'!D18","v":16895}]
{"$rows_left_out":65}
{"sheet":"Merger Assumptions","index":3,"n_rows":13,"n_cols":15,"rows_kept":13,"cut":false,"hidden":false,"merged":[]}
[]
["Assumptions",null,null,null,null,null,1997,{"$f":"G2+1","v":1998},{"$f":"H2+1","v":1999},2000,2001,2002,2003,2004,2005]
[]
[null,"Cap Exp for 747"]
[null,"Depreciation Write-up",null,null,14,{"$f":"'Transaction Structure'!E34","v":46276},{"$f":"$F$5/$E$5","v":3305.4285714285716},{"$f":"$F$5/$E$5","v":3305.4285714285716},3305.4285714285716,3305.4285714285716,3305.4285714285716,3305.4285714285716,3305.4285714285716,3305.4285714285716,3305.4285714285716]
[]
[null,"Repayment Percent",null,null,null,null,{"$f":"H7/4","v":7.6581047423823429E-3},{"$f":"'Transaction Assumptions'!D50","v":3.0632418969529372E-2},{"$f":"'Transaction Assumptions'!E50","v":2.8045907377324226E-2},{"$f":"'Transaction Assumptions'!F50","v":2.5434863076744155E-2},{"$f":"'Transaction Assumptions'!G50","v":2.5603745084623385E-2},{"$f":"'Transaction Assumptions'!H50","v":4.9212590758293734E-2},{"$f":"'Transaction Assumptions'!I50","v":0.16821409494669703},{"$f":"'Transaction Assumptions'!J50","v":0.16821409494669703},{"$f":"'Transaction Assumptions'!K50","v":0.16821409494669703}]
[]
{"$rows_left_out":6}
{"sheet":"Merger Model","index":4,"n_rows":214,"n_cols":15,"rows_kept":214,"cut":false,"hidden":false,"merged":[]}
[null,null,null,null,"Planes",null,{"$f":"'Merger Assumptions'!G2","v":1997},{"$f":"'Merger Assumptions'!H2","v":1998},{"$f":"'Merger Assumptions'!I2","v":1999},{"$f":"'Merger Assumptions'!J2","v":2000},{"$f":"'Merger Assumptions'!K2","v":2001},{"$f":"'Merger Assumptions'!L2","v":2002},{"$f":"'Merger Assumptions'!M2","v":2003},{"$f":"'Merger Assumptions'!N2","v":2004},{"$f":"'Merger Assumptions'!O2","v":2005}]
["Period",null,null,null,"KH Case",null,{"$f":"'Acquiror Assumptions'!Q3","v":0.28000000000000003},{"$f":"'Acquiror Assumptions'!R3","v":1},{"$f":"'Acquiror Assumptions'!S3","v":1},{"$f":"'Acquiror Assumptions'!T3","v":1},{"$f":"'Acquiror Assumptions'!U3","v":1},{"$f":"'Acquiror Assumptions'!V3","v":1},{"$f":"'Acquiror Assumptions'!W3","v":1},{"$f":"'Acquiror Assumptions'!X3","v":1},{"$f":"'Acquiror Assumptions'!Y3","v":1}]
[null,"KH Model Period",null,null,"Kalitta Case",{"$f":"'Transaction Assumptions'!D2","v":6},{"$f":"F3+1","v":7},{"$f":"G3+1","v":8},9,10,11,12,13,14,15]
[null,"Kalittal Model Period",null,null,null,{"$f":"'Transaction Assumptions'!D3","v":6},{"$f":"F4+1","v":7},{"$f":"G4+1","v":8},9,10,11,12,13,14,15]
[null,"KH Model Column",null,null,null,{"$f":"MATCH(F3,'Acquiror Model'!1:1)","v":13},{"$f":"MATCH(G3,'Acquiror Model'!1:1)","v":14},{"$f":"MATCH(H3,'Acquiror Model'!1:1)","v":15},{"$f":"MATCH(I3,'Acquiror Model'!1:1)","v":16},{"$f":"MATCH(J3,'Acquiror Model'!1:1)","v":17},{"$f":"MATCH(K3,'Acquiror Model'!1:1)","v":18},{"$f":"MATCH(L3,'Acquiror Model'!1:1)","v":19},{"$f":"MATCH(M3,'Acquiror Model'!1:1)","v":20},{"$f":"MATCH(N3,'Acquiror Model'!1:1)","v":21},{"$f":"MATCH(O3,'Acquiror Model'!1:1)","v":22}]
[null,"Kalittal Model Column",null,null,null,{"$f":"MATCH(F4,'Target Model'!1:1)","v":14},{"$f":"MATCH(G4,'Target Model'!1:1)","v":15},{"$f":"MATCH(H4,'Target Model'!1:1)","v":16},{"$f":"MATCH(I4,'Target Model'!1:1)","v":17},{"$f":"MATCH(J4,'Target Model'!1:1)","v":18},{"$f":"MATCH(K4,'Target Model'!1:1)","v":19},{"$f":"MATCH(L4,'Target Model'!1:1)","v":20},{"$f":"MATCH(M4,'Target Model'!1:1)","v":21},{"$f":"MATCH(N4,'Target Model'!1:1)","v":22},{"$f":"MATCH(O4,'Target Model'!1:1)","v":23}]
[]
["Pro-Forma Balance Sheet"]
{"$rows_left_out":207}
{"sheet":"Acquiror Scenario","index":5,"n_rows":46,"n_cols":22,"rows_kept":46,"cut":false,"hidden":false,"merged":[]}
[null,null,null,null,null,null,null,null,null,null,null,null,null,null,null,null,null,null,null,"Start Row",{"$f":"ROW(M12)","v":12}]
[null,null,"Base for Comparison",null,null,1,{"$f":"INDEX($C$12:$C$15,F2)","v":"Base Case"},null,"Planes Added",null,null,null,null,null,null,null,null,null,null,"End Row",{"$f":"ROW(M24)","v":24}]
[null,null,"Sensitivity Case",null,null,2,{"$f":"INDEX($C$12:$C$15,F3)","v":"Low Case"},null,null,null,null,null,null,null,null,null,null,null,null,"Start Col",{"$f":"COLUMN(O11)","v":15}]
[null,null,null,null,null,null,null,null,null,null,null,null,null,null,null,null,null,null,null,"End Col",{"$f":"COLUMN(V11)","v":22}]
[null,null,null,null,null,null,null,null,null,null,null,null,null,null,null,null,null,null,null,"Outputs Row",{"$f":"ROW(O11)","v":11}]
[null,null,null,null,null,null,null,null,null,null,null,null,null,null,null,null,null,null,null,"Inputs Col",{"$f":"COLUMN(M12)","v":13}]
[null,null,"Scenario Num",1,null,null,null,null,null,null,null,null,null,null,{"$f":"'Acquiror Model'!C312","v":"EPS"}]
[]
{"$rows_left_out":39}
{"sheet":"Acquiror Assumptions","index":6,"n_rows":153,"n_cols":25,"rows_kept":153,"cut":false,"hidden":false,"merged":[]}
[null,null,null,null,null,null,null,null,null,null,null,null,null,null,null,"nine mos","three mos"]
[null,null,null,null,null,null,null,null,null,null,1992,1993,1994,1995,1996,1997,{"$f":"P2","v":1997},{"$f":"Q2+1","v":1998},{"$f":"R2+1","v":1999},2000,2001,2002,2003,2004,2005]
[null,null,null,null,null,null,null,null,null,null,1,1,1,1,1,0.72,{"$f":"1-P3","v":0.28000000000000003},1,1,1,1,1,1,1,1]
["Last Historic Period",null,null,null,null,null,null,null,null,null,false,false,false,false,false,true,false,false,false,false,false,false,false,false,false]
["History",null,null,null,"Driver","Average","Last","Input","Applied","Code",true,true,true,true,true,true,false,false,false,false,false,false,false,false,false]
[]
["Economics of Incremental Aircraft"]
[null,"Economics of Added Planes"]
{"$rows_left_out":146}
{"sheet":"Acquiror Model","index":7,"n_rows":315,"n_cols":22,"rows_kept":315,"cut":false,"hidden":false,"merged":[]}
[null,null,null,null,null,null,null,1,2,3,4,5,6,7,8,9,10,11,12,13,14,15]
[null,null,null,null,null,null,null,1992,1993,1994,1995,1996,1997,{"$f":"M2","v":1997},{"$f":"N2+1","v":1998},{"$f":"O2+1","v":1999},2000,2001,2002,2003,2004,2005]
[null,null,null,null,null,null,null,1,1,1,1,1,0.72,{"$f":"1-M3","v":0.28000000000000003},1,1,1,1,1,1,1,1]
[null,null,null,null,null,null,null,true,true,true,true,true,true,false,false,false,false,false,false,false,false,false]
["Balance Sheet"]
[null,"ASSETS"]
[null,null,"Current assets: "]
[null,null,null,"Cash and cash equivalents ",-1,null,null,null,null,null,3801.3780000000002,5763.9040000000005,7503.48]
{"$rows_left_out":308}
{"sheet":"Target Scenario","index":8,"n_rows":52,"n_cols":24,"rows_kept":52,"cut":false,"hidden":false,"merged":[]}
["Comparison",null,null,1,{"$f":"INDEX(C10:C13,D1)","v":"Company Case"},null,null,null,null,null,null,null,null,null,null,null,null,null,null,"col input",{"$f":"COLUMN(P12)","v":16}]
["Sensitivity",null,null,3,{"$f":"INDEX(C10:C13,D2)","v":"Low Case"},null,null,null,null,null,null,null,null,null,null,null,null,null,null,"Row input",{"$f":"ROW(Q9)","v":9}]
[null,null,null,null,null,null,null,null,null,null,null,null,null,null,null,null,null,null,null,"Start row",{"$f":"ROW(Q10)","v":10}]
[null,null,null,null,null,null,null,null,null,null,null,null,null,null,null,null,null,null,null,"End row",{"$f":"ROW(C25)","v":25}]
[null,null,null,null,"Code Number",null,2,null,null,null,null,null,null,null,null,null,null,null,null,"start col",{"$f":"COLUMN(Q10)","v":17}]
[null,null,null,null,null,null,null,null,null,null,null,null,null,null,null,null,null,null,null,"end col",{"$f":"COLUMN(X9)","v":24}]
[null,null,null,1,{"$f":"D7+1","v":2},{"$f":"E7+1","v":3},4,5,6,7,8,9,10,11,12,null,1998,{"$f":"Q7+1","v":1999},{"$f":"R7+1","v":2000},2001,2002,2003,2004,2005]
[null,null,null,"Planes Grounded","Price Increase","Other Revenues","Flight Expense per Hour","Maint  per Hour","Fuel Expense per Hour","SG&A per Revenue","Bad Debt Expense","Cap Exp - Maintenance","A/R to Revenues","A/P to Expenses","Interest Rate",null,{"$f":"'Target Model'!$K$380 &\" \" &Q7","v":"EBITDA 1998"},{"$f":"'Target Model'!$K$380 &\" \" &R7","v":"EBITDA 1999"},{"$f":"'Target Model'!$K$380 &\" \" &S7","v":"EBITDA 2000"},{"$f":"'Target Model'!$K$380 &\" \" &T7","v":"EBITDA 2001"},{"$f":"'Target Model'!$K$380 &\" \" &U7","v":"EBITDA 2002"},{"$f":"'Target Model'!$K$380 &\" \" &V7","v":"EBITDA 2003"},{"$f":"'Target Model'!$K$380 &\" \" &W7","v":"EBITDA 2004"},{"$f":"'Target Model'!$K$380 &\" \" &X7","v":"EBITDA 2005"}]
{"$rows_left_out":45}
{"sheet":"Target Assumptions","index":9,"n_rows":274,"n_cols":27,"rows_kept":274,"cut":false,"hidden":false,"merged":[]}
[null,"Year",null,null,null,null,null,null,null,null,null,null,{"$f":"N1-1","v":1992},{"$f":"O1-1","v":1993},{"$f":"P1-1","v":1994},{"$f":"Q1-1","v":1995},{"$f":"R1-1","v":1996},1997,1997,{"$f":"S1+1","v":1998},{"$f":"T1+1","v":1999},2000,2001,2002,2003,2004,2005]
[null,"Fraction of Year",null,null,null,null,null,null,null,null,null,null,1,1,1,1,1,{"$f":"'Target Model'!N4","v":0.7142857142857143},{"$f":"'Target Model'!O4","v":0.2857142857142857},1,1,1,1,1,1,1,1]
[null,"Switch",null,null,null,null,null,null,null,null,null,null,false,false,false,false,false,true,false,false,false,false,false,false,false,false,false]
[null,null,null,null,"Method","Last Value","Average","Input","Value Applied","Graph","Graph No","Index Code",true,true,true,true,true,true,false,false,false,false,false,false,false,false,false]
[null,"Capacity ",null,null,null,null,null,null,null,null,0]
[null,null,"Base Capacity",null,null,null,null,null,null,null,{"$f":"K5+J6","v":0},null,null,null,null,null,null,{"$f":"'[2]Airline Fleet'!$M$34","v":6138986.666666667},{"$f":"'[2]Airline Fleet'!$M$34","v":6138986.666666667},{"$f":"S6","v":6138986.666666667},{"$f":"T6","v":6138986.666666667},6138986.666666667,6138986.666666667,6138986.666666667,6138986.666666667,6138986.666666667,6138986.666666667]
[null,null,"Capacity per 747",null,null,null,null,null,null,null,{"$f":"K6+J7","v":0},null,null,null,null,null,null,{"$f":"S7","v":229000},{"$f":"'[2]Airline Fleet'!K9","v":229000},{"$f":"S7","v":229000},229000,229000,229000,229000,229000,229000,229000]
[null,null,"Planes Grounded",null,null,null,null,null,null,null,0]
{"$rows_left_out":267}
{"sheet":"Target Model","index":10,"n_rows":386,"n_cols":23,"rows_kept":386,"cut":false,"hidden":false,"merged":[]}
["Timing",null,null,null,null,null,null,null,1,2,3,4,5,6,7,8,9,10,11,12,13,14,15]
[null,"Year",null,null,null,null,null,null,1992,1993,1994,1995,1996,1997,{"$f":"N2","v":1997},{"$f":"O2+1","v":1998},{"$f":"P2+1","v":1999},2000,2001,2002,2003,2004,2005]
[null,"Months",null,null,null,null,null,null,12,12,12,12,12,9,3,12,12,12,12,12,12,12,12]
[null,"Annualisation Factor",null,null,null,null,null,null,1,1,1,1,1,{"$f":"1/1.4","v":0.7142857142857143},{"$f":"1-N4","v":0.2857142857142857},1,1,1,1,1,1,1,1]
[null,"Historic Switch",null,null,"Debt ","IC Cap","IC Dir","Test",true,true,true,true,true,true,false,false,false,false,false,false,false,false,false]
["Historic Financial Statements"]
[null,"Balance Sheet"]
[null,null," CURRENT ASSETS:                                "]
{"$rows_left_out":379}
{"sheet":"Airline Fleet (2)","index":11,"n_rows":34,"n_cols":14,"rows_kept":34,"cut":false,"hidden":false,"merged":[]}
[" NUMBER NUMBER OPERATED"]
[" OWNED BY LEASED BY IN"]
[" MANUFACTURER THE THE REVENUE MAXIMUM NUMBER STAGE III"]
[" AND MODEL SERIES(1) COMPANY COMPANY SERVICE CONFIGURATION PAYLOAD(2) COMPLIANT(3)"]
[]
[null,null,"Company",null,null,"In Revenue","Out of",null,null,null,null,null,"Noise","Not "]
[null,"Model","Owned","Leased","Total","Service","Service",null,"Min","Max","Average",null,"Complaint","Compliant"]
[]
{"$rows_left_out":27}
{"sheet":"Debt 1998","index":12,"n_rows":128,"n_cols":10,"rows_kept":128,"cut":false,"hidden":false,"merged":[]}
[]
["Debt Assumptions","Amount","Rate","Perent","Repayment"]
[null,null,null,null,1998,{"$f":"E3+1","v":1999},{"$f":"F3+1","v":2000},{"$f":"G3+1","v":2001},{"$f":"H3+1","v":2002},"After"]
["Notes",{"$f":"C53","v":340000000},9.9500000000000005E-2,{"$f":"B4/$B$8","v":0.84024587966898068},{"$f":"$D4*E$8","v":10415022.449639987},9535608.5082902368,8647853.4460930116,8705273.3287719507,16732280.857819868,285963961.40938497]
["Term Loan",{"$f":"C54","v":45900000},8.7999999999999995E-2,{"$f":"B5/$B$8","v":0.1134331937553124},{"$f":"$D5*E$8","v":1406028.0307013984},1287307.1486191819,1167460.2152225566,1175211.8993842136,2258857.9158056825,38605134.790266968]
["Revolving Credit",{"$f":"C55","v":10000000},{"$f":"C5","v":8.7999999999999995E-2},{"$f":"B6/$B$8","v":2.4713114107911195E-2},306324.18969529372,280459.07377324224,254348.63076744153,256037.45084623384,492125.90758293733,8410704.747334851]
["Other",{"$f":"C66","v":8743460},{"$f":"C6","v":8.7999999999999995E-2},{"$f":"B7/$B$8","v":2.1607812467795723E-2},267833.32996332127,245218.26931733926,222388.70791698943,223865.3209976012,430288.31879151094,7353866.0530132381]
["Total",{"$f":"SUM(B4:B7)","v":404643460},{"$f":"SUMPRODUCT(C4:C7,D4:D7)","v":9.7662827616193271E-2},null,{"$f":"TRANSPOSE(F51:F56)","v":12395208},11348593,10292051,10360388,19913553,340333667]
{"$rows_left_out":121}
{"sheet":"Pro Forma BS","index":13,"n_rows":49,"n_cols":13,"rows_kept":49,"cut":false,"hidden":false,"merged":[]}
["  HISTORICAL                                "]
["  KITTY KALITTA                               ",null,null,null,null,"EV Capital"]
["  HAWK COMPANIES ADJUSTMENTS COMBINED                             ","KittyHawk","Kalitta","Adjustment","Adjusted"]
[" Current Assets                                "]
["  Cash and cash equivalents..................                             ",2403,3282,5965,11650,-1,null,null,"Asset Increase - PP&E",null,null,{"$f":"D13","v":46276}]
["  Restricted cash............................                               ",0,14037,56000,70037,-1,null,null,"Asset Increase - Other",null,null,{"$f":"D14","v":10123}]
["  Trade accounts receivable..................                              ",21645,64909,0,86554,null,null,null,"Asset Increase - Current",null,null,{"$f":"D12-D6-D5","v":-101}]
["  Accounts receivable 0 related parties.....                            ",0,1255,0,1255]
{"$rows_left_out":42}
{"sheet":"Airline Fleet","index":14,"n_rows":33,"n_cols":14,"rows_kept":33,"cut":false,"hidden":false,"merged":[]}
[" NUMBER NUMBER OPERATED"]
[" OWNED BY LEASED BY IN"]
[" MANUFACTURER THE THE REVENUE MAXIMUM NUMBER STAGE III"]
[" AND MODEL SERIES(1) COMPANY COMPANY SERVICE CONFIGURATION PAYLOAD(2) COMPLIANT(3)"]
[]
[null,null,"Company",null,null,"In Revenue","Out of",null,null,null,null,null,"Noise","Not "]
[null,"Model","Owned","Leased","Total","Service","Service",null,"Min","Max","Average",null,"Complaint","Compliant"]
[]
{"$rows_left_out":26}
{"sheet":"Fleet Before Merger","index":15,"n_rows":29,"n_cols":15,"rows_kept":29,"cut":false,"hidden":false,"merged":[]}
["         Revenue Fleet"]
[]
["         The Company owns and operates 23 aircraft in revenue service. In",null,null,null,null,null,null,null,null,23,"Planes"]
["addition, the Company owns one additional aircraft that it expects to place into"]
["revenue service prior to January 1997.  These aircraft do not include (i) two",null,null,null,null,null,null,null,null,2,727,"Avaitaion Partners"]
["Boeing 727-200 aircraft the Company recently entered into an agreement to",null,null,null,null,null,null,null,null,1,727,"International Areo"]
["purchase from Intrepid Aviation Partners, LLC, (ii) one Boeing 727-200 aircraft",null,null,null,null,null,null,null,null,1,727,"International Technical Consultants"]
["the Company recently entered into an agreement to purchase from International"]
{"$rows_left_out":22}
{"sheet":"Aircraft Purchase","index":16,"n_rows":138,"n_cols":13,"rows_kept":138,"cut":false,"hidden":false,"merged":[]}
[]
["IPO"]
["     In October 1996, Kitty Hawk sold in an initial public offering 2,700,000",null,null,null,null,null,null,2700000,29300000,{"$f":"I3/H3","v":10.851851851851851}]
["shares of Common Stock, raising net proceeds of approximately $29.3 million"]
[null,null,null,null,null,null,null,null,null,"Cost/Plane"]
[" (iv) one Boeing 727-200 aircraft for $3.5 million",null,null,null,null,null,null,3500,2500,{"$f":"H6+I6","v":6000},4,{"$f":"J6+J14+J19+J21","v":24700},{"$f":"L6/K6","v":6175}]
["which was placed into revenue service as a leased passenger aircraft and which"]
["was modified to be in compliance with the Stage III noise control standards for"]
{"$rows_left_out":131}
{"sheet":"Pro Forma IS","index":17,"n_rows":73,"n_cols":7,"rows_kept":73,"cut":false,"hidden":false,"merged":[]}
["  HISTORICAL                                "]
["  KALITTA                                ",null,null,null,0]
["  KITTY HAWK COMPANIES ADJUSTMENTS COMBINED                            ","KittyHawk","Kalitta"]
[" REVENUES:                                 "]
[" Air freight carrier..........................                               ",55504,388193,-5432,438265]
[" Air logistics................................                                ",77168,0,0,77168]
[" Maintenance and other........................                               ",0,36348,0,36348]
["  Total revenues.....................                               ",132672,424541,-5432,551781]
{"$rows_left_out":66}
{"sheet":"Plant Balance","index":18,"n_rows":20,"n_cols":28,"rows_kept":20,"cut":false,"hidden":false,"merged":[]}
["                                  "]
[" <CAPTION>                                 ",null,null,null,null,null,"Ratio",{"$f":"S15","v":0.36886345870284531}]
["  DECEMBER 31, DECEMBER 31,                             "]
["                                  ",1997,1998,null,null,null,"Growth",0.2]
["  (IN THOUSANDS)                               ",null,null,null,null,null,"Life",10,{"$f":"1/$H$5","v":0.1}]
[" Aircraft and engines........................................                               ",498517,720981,{"$f":"C6-B6","v":222464}]
[" Aircraft work in process....................................                              ",31576,27639,null,null,null,"Year",0,1,2,3,4,5,6,7,8,9,10,11,12,13,14,15,16,17,18,19,20]
[" Machinery and equipment.....................................                               ",20619,23664,null,null,null,"Stable Period",null,{"$f":"I7>=$H$5","v":false},{"$f":"J7>=$H$5","v":false},false,false,false,false,false,false,false,true,true,true,true,true,true,true,true,true,true,true]
{"$rows_left_out":13}
{"sheet":"Purchase Price Allocation","index":19,"n_rows":26,"n_cols":8,"rows_kept":26,"cut":false,"hidden":false,"merged":[]}
[" PURCHASE PRICE DETERMINATION:                               "]
["  Cash......................................................                                ",20000]
["   shares of Kitty Hawk common stock at an assumed                       ",4099150]
["  value of 15 per share.................................                            ",61487]
["  Related expenses..........................................                               ",2178]
["  Plus fair value of liabilities assumed:                           "]
["  Accounts payable and accrued expenses (including                           "]
["   maintenance accrual to conform to Kitty Hawk                         ",14933]
{"$rows_left_out":19}
{"sheet":"Sources and Uses","index":20,"n_rows":123,"n_cols":9,"rows_kept":123,"cut":false,"hidden":false,"merged":[]}
["Merger Date",null,null,null,null,"1997-11-19"]
[]
[]
["Shares"]
[null,null,null,"Pre-Merger",null,null,8477]
[null,null,null,"Added",null,null,{"$f":"'Pro Forma IS'!C31","v":6299}]
[null,null,null,"Total",null,null,{"$f":"SUM(G5:G6)","v":14776}]
[]
{"$rows_left_out":115}