{"text_format":"1","workbook":"xlsx","n_sheets":10,"sheets":["RAROC Analysis","IRR Analysis","Loan Inputs","Weights and Defaults","Bond Rating Simulation","Rating and PD","Capital Allocation","Audits","RAROC Example","Notes"],"not_rendered":{"charts":4,"images":11,"macros":1,"external_links":0,"defined_names":6,"comments":0,"pivot_tables":0},"unopened":[],"bounds":{"document_bytes":16777216,"sheet_cells":100000,"rows_first":2000,"rows_last":500,"rows_between":2000,"halvings":0,"cell_chars":16384,"cell_head_chars":4096},"cells_cut":0,"cells_raw":0,"read":"whole","date_system":"1900"}

{"sheet":"RAROC Analysis","index":0,"n_rows":28,"n_cols":19,"rows_kept":28,"cut":false,"hidden":false,"merged":[[7,18,8,18],[13,18,14,18],[17,16,18,16],[17,17,18,17],[20,16,21,16],[20,17,21,17],[17,18,18,18],[20,18,21,18],[7,16,8,16],[7,17,8,17],[13,16,14,16],[13,17,14,17]]}
[null,null,null,null,null,null,null,null,null,null,"Loan Date","2018-01-01",null,"Currency",null,"USD","Periods",12]
[]
[null,"RAROC Outputs for Loan",null,null,null,null,null,null,null,null,"Business Risk Rating",{"$f":"SUMPRODUCT(R8:R22,S8:S22)","v":5.7549999999999999},null,"Simulated Credit Rating",null,null,{"$f":"S26","v":"BB"}]
[null,null,"Overall IRR on Loan without Risk Adjustment",null,null,{"$f":"'IRR Analysis'!E55","v":7.5447021976492223E-2}]
[null,null,"NPV of Risk Premium Earned Before Risk Adj",null,null,{"$f":"'IRR Analysis'!F66","v":2003.1824897039969},null,"Risk Input Data",null,null,null,"Input","Default","Rating","Weight",null,null,"Rating","Weight"]
[null,null,"Implied Max Cumulative Loss Probability",null,null,{"$f":"'IRR Analysis'!E111","v":0.32129315166315792},null,null,"Industry Assesment"]
[null,null,"Risk Rating from Analysis",null,null,{"$f":"IF(S28=\"\",R26,S28)","v":3.3170162059103907},null,null,null,"Industry Price Variation",null,null,{"$f":"IFERROR(INDEX('Weights and Defaults'!E:E,MATCH(J7,'Weights and Defaults'!C:C,0)),\"\")","v":6},{"$f":"IF(L7,L7,M7)","v":6},{"$f":"IFERROR(INDEX('Weights and Defaults'!$F:$F,MATCH(J7,'Weights and Defaults'!$C:$C,0)),\"\")","v":0.25}]
[null,null,"Probability of Defalut from Risk Assessment",null,null,{"$f":"'Rating and PD'!C81","v":7.1287168732125816E-2},null,null,null,"Industry Capital Intensity",null,null,{"$f":"IFERROR(INDEX('Weights and Defaults'!E:E,MATCH(J8,'Weights and Defaults'!C:C,0)),\"\")","v":7},{"$f":"IF(L8,L8,M8)","v":7},{"$f":"IFERROR(INDEX('Weights and Defaults'!$F:$F,MATCH(J8,'Weights and Defaults'!$C:$C,0)),\"\")","v":0.25},null,"Industry",{"$f":"SUMPRODUCT(N7:N11,O7:O11)","v":5.5},0.6]
[null,null,"Capital Allocation From Risk Rating",null,null,{"$f":"'Capital Allocation'!C3","v":9.2680648236415628E-2},null,null,null,"Oblosense Risk",null,null,{"$f":"IFERROR(INDEX('Weights and Defaults'!E:E,MATCH(J9,'Weights and Defaults'!C:C,0)),\"\")","v":5},5,{"$f":"IFERROR(INDEX('Weights and Defaults'!$F:$F,MATCH(J9,'Weights and Defaults'!$C:$C,0)),\"\")","v":0.25}]
[null,null,"New Capital Required for Loan",null,null,{"$f":"'IRR Analysis'!E171","v":953.63632030505323},null,null,null,"Operating Leverage",null,null,{"$f":"IFERROR(INDEX('Weights and Defaults'!E:E,MATCH(J10,'Weights and Defaults'!C:C,0)),\"\")","v":4},4,{"$f":"IFERROR(INDEX('Weights and Defaults'!$F:$F,MATCH(J10,'Weights and Defaults'!$C:$C,0)),\"\")","v":0.25}]
[null,null,"Final RAROC",null,null,{"$f":"'IRR Analysis'!E169","v":0.30016826987266532},null,null,null,"Contract Strength",null,null,{"$f":"IFERROR(INDEX('Weights and Defaults'!E:E,MATCH(J11,'Weights and Defaults'!C:C,0)),\"\")","v":0},0,{"$f":"IFERROR(INDEX('Weights and Defaults'!$F:$F,MATCH(J11,'Weights and Defaults'!$C:$C,0)),\"\")","v":0}]
[null,"Loan Terms Input",null,null,null,null,null,null,"Management Assessment",null,null,null,null,null,{"$f":"IFERROR(INDEX('Weights and Defaults'!$F:$F,MATCH(J12,'Weights and Defaults'!$C:$C,0)),\"\")","v":""}]
[null,null,"Credit Spread and Fees",null,null,null,null,null,null,"Company Size",null,null,{"$f":"IFERROR(INDEX('Weights and Defaults'!E:E,MATCH(J13,'Weights and Defaults'!C:C,0)),\"\")","v":5},5,{"$f":"IFERROR(INDEX('Weights and Defaults'!$F:$F,MATCH(J13,'Weights and Defaults'!$C:$C,0)),\"\")","v":0.15}]
[null,null,null,{"$f":"\"Loan Amount (\"&P1&\" 000's)\"","v":"Loan Amount (USD 000's)"},null,{"$f":"'Loan Inputs'!C5","v":10000},null,null,null,"Prior Projects",null,null,{"$f":"IFERROR(INDEX('Weights and Defaults'!E:E,MATCH(J14,'Weights and Defaults'!C:C,0)),\"\")","v":6},6,{"$f":"IFERROR(INDEX('Weights and Defaults'!$F:$F,MATCH(J14,'Weights and Defaults'!$C:$C,0)),\"\")","v":0.1},null,"Mgmt",{"$f":"SUMPRODUCT(O13:O16,N13:N16)","v":4.8499999999999996},0.3]
[null,null,null,{"$f":"\"Base Interest Rate (\"&P1&\" Percent)\"","v":"Base Interest Rate (USD Percent)"},null,{"$f":"'Loan Inputs'!C6","v":0.03},null,null,null,"Reputation Assessment",null,null,{"$f":"IFERROR(INDEX('Weights and Defaults'!E:E,MATCH(J15,'Weights and Defaults'!C:C,0)),\"\")","v":4},4,{"$f":"IFERROR(INDEX('Weights and Defaults'!$F:$F,MATCH(J15,'Weights and Defaults'!$C:$C,0)),\"\")","v":0.25}]
{"$rows_left_out":14}
{"sheet":"IRR Analysis","index":1,"n_rows":212,"n_cols":128,"rows_kept":212,"cut":false,"hidden":false,"merged":[]}
[null,null,null,null,null,{"$f":"E7","v":12}]
["Date",null,null,null,null,null,"2018-01-01",{"$f":"EDATE(G2,$E$7)","v":"2019-01-01"},{"$f":"EDATE(H2,$E$7)","v":"2020-01-01"},"2021-01-01","2022-01-01","2023-01-01","2024-01-01","2025-01-01","2026-01-01","2027-01-01","2028-01-01","2029-01-01","2030-01-01","2031-01-01","2032-01-01","2033-01-01","2034-01-01","2035-01-01","2036-01-01","2037-01-01","2038-01-01","2039-01-01","2040-01-01","2041-01-01","2042-01-01","2043-01-01","2044-01-01","2045-01-01","2046-01-01","2047-01-01","2048-01-01","2049-01-01","2050-01-01","2051-01-01",{"$f":"EDATE(AN2,$E$7)","v":"2052-01-01"},"2053-01-01","2054-01-01","2055-01-01","2056-01-01","2057-01-01","2058-01-01","2059-01-01","2060-01-01","2061-01-01","2062-01-01","2063-01-01","2064-01-01","2065-01-01","2066-01-01","2067-01-01","2068-01-01","2069-01-01","2070-01-01","2071-01-01","2072-01-01","2073-01-01","2074-01-01","2075-01-01","2076-01-01","2077-01-01","2078-01-01","2079-01-01","2080-01-01","2081-01-01","2082-01-01","2083-01-01","2084-01-01","2085-01-01","2086-01-01","2087-01-01","2088-01-01","2089-01-01","2090-01-01","2091-01-01","2092-01-01","2093-01-01","2094-01-01","2095-01-01","2096-01-01","2097-01-01","2098-01-01","2099-01-01","2100-01-01","2101-01-01","2102-01-01","2103-01-01","2104-01-01","2105-01-01","2106-01-01","2107-01-01","2108-01-01","2109-01-01","2110-01-01","2111-01-01","2112-01-01","2113-01-01","2114-01-01","2115-01-01",{"$f":"EDATE(CZ2,$E$7)","v":"2116-01-01"},"2117-01-01","2118-01-01","2119-01-01","2120-01-01","2121-01-01","2122-01-01","2123-01-01","2124-01-01","2125-01-01","2126-01-01","2127-01-01","2128-01-01","2129-01-01","2130-01-01","2131-01-01","2132-01-01","2133-01-01","2134-01-01","2135-01-01","2136-01-01","2137-01-01","2138-01-01","2139-01-01"]
["Grace Period",null,null,null,{"$f":"E27","v":"2019-01-01"},{"$f":"COUNTIF(G3:AN3,TRUE)","v":1},{"$f":"G2<$E$3","v":true},{"$f":"H2<$E$3","v":false},false,false,false,false,false,false,false,false,false,false,false,false,false,false,false,false,false,false,false,false,false,false,false,false,false,false,false,false,false,false,false,false,{"$f":"AO2<$E$3","v":false},{"$f":"AP2<$E$3","v":false},{"$f":"AQ2<$E$3","v":false},{"$f":"AR2<$E$3","v":false},{"$f":"AS2<$E$3","v":false},{"$f":"AT2<$E$3","v":false},{"$f":"AU2<$E$3","v":false},{"$f":"AV2<$E$3","v":false},{"$f":"AW2<$E$3","v":false},{"$f":"AX2<$E$3","v":false},{"$f":"AY2<$E$3","v":false},{"$f":"AZ2<$E$3","v":false},{"$f":"BA2<$E$3","v":false},{"$f":"BB2<$E$3","v":false},{"$f":"BC2<$E$3","v":false},{"$f":"BD2<$E$3","v":false},{"$f":"BE2<$E$3","v":false},{"$f":"BF2<$E$3","v":false},{"$f":"BG2<$E$3","v":false},{"$f":"BH2<$E$3","v":false},{"$f":"BI2<$E$3","v":false},{"$f":"BJ2<$E$3","v":false},{"$f":"BK2<$E$3","v":false},{"$f":"BL2<$E$3","v":false},{"$f":"BM2<$E$3","v":false},{"$f":"BN2<$E$3","v":false},{"$f":"BO2<$E$3","v":false},{"$f":"BP2<$E$3","v":false},{"$f":"BQ2<$E$3","v":false},{"$f":"BR2<$E$3","v":false},{"$f":"BS2<$E$3","v":false},{"$f":"BT2<$E$3","v":false},{"$f":"BU2<$E$3","v":false},{"$f":"BV2<$E$3","v":false},{"$f":"BW2<$E$3","v":false},{"$f":"BX2<$E$3","v":false},{"$f":"BY2<$E$3","v":false},{"$f":"BZ2<$E$3","v":false},{"$f":"CA2<$E$3","v":false},{"$f":"CB2<$E$3","v":false},{"$f":"CC2<$E$3","v":false},{"$f":"CD2<$E$3","v":false},{"$f":"CE2<$E$3","v":false},{"$f":"CF2<$E$3","v":false},{"$f":"CG2<$E$3","v":false},{"$f":"CH2<$E$3","v":false},{"$f":"CI2<$E$3","v":false},{"$f":"CJ2<$E$3","v":false},{"$f":"CK2<$E$3","v":false},{"$f":"CL2<$E$3","v":false},{"$f":"CM2<$E$3","v":false},{"$f":"CN2<$E$3","v":false},{"$f":"CO2<$E$3","v":false},{"$f":"CP2<$E$3","v":false},{"$f":"CQ2<$E$3","v":false},{"$f":"CR2<$E$3","v":false},{"$f":"CS2<$E$3","v":false},{"$f":"CT2<$E$3","v":false},{"$f":"CU2<$E$3","v":false},{"$f":"CV2<$E$3","v":false},{"$f":"CW2<$E$3","v":false},{"$f":"CX2<$E$3","v":false},{"$f":"CY2<$E$3","v":false},{"$f":"CZ2<$E$3","v":false},{"$f":"DA2<$E$3","v":false},{"$f":"DB2<$E$3","v":false},{"$f":"DC2<$E$3","v":false},{"$f":"DD2<$E$3","v":false},{"$f":"DE2<$E$3","v":false},{"$f":"DF2<$E$3","v":false},{"$f":"DG2<$E$3","v":false},{"$f":"DH2<$E$3","v":false},{"$f":"DI2<$E$3","v":false},{"$f":"DJ2<$E$3","v":false},{"$f":"DK2<$E$3","v":false},{"$f":"DL2<$E$3","v":false},{"$f":"DM2<$E$3","v":false},{"$f":"DN2<$E$3","v":false},{"$f":"DO2<$E$3","v":false},{"$f":"DP2<$E$3","v":false},{"$f":"DQ2<$E$3","v":false},{"$f":"DR2<$E$3","v":false},{"$f":"DS2<$E$3","v":false},{"$f":"DT2<$E$3","v":false},{"$f":"DU2<$E$3","v":false},{"$f":"DV2<$E$3","v":false},{"$f":"DW2<$E$3","v":false},{"$f":"DX2<$E$3","v":false}]
["Repayment Period",null,null,null,{"$f":"E28","v":"2028-01-01"},{"$f":"COUNTIF(G4:ZN4,TRUE)","v":9},{"$f":"AND(G2>=$E$3,G2<$E$4)","v":false},{"$f":"AND(H2>=$E$3,H2<$E$4)","v":true},true,true,true,true,true,true,true,true,false,false,false,false,false,false,false,false,false,false,false,false,false,false,false,false,false,false,false,false,false,false,false,false,false,false,false,false,false,false,false,false,false,false,false,false,false,false,false,false,false,false,false,false,false,false,false,false,false,false,false,false,false,false,false,{"$f":"AND(BT2>=$E$3,BT2<$E$4)","v":false},false,false,false,false,false,false,false,false,false,false,false,false,false,false,false,false,false,false,false,false,false,false,false,false,false,false,false,false,false,false,false,false,false,false,false,false,false,false,false,false,false,false,false,false,false,false,false,false,false,false,false,false,false,false,false,false]
[null,null,null,null,null,{"$f":"SUM(F3:F4)/E8","v":10}]
["General Inputs"]
[null,"Months in Period",null,null,{"$f":"'RAROC Analysis'!R1","v":12}]
[null,"Periods in Year",null,null,{"$f":"12/E7","v":1}]
[]
["Inputs"]
[null,"Loan Amount",null,null,{"$f":"'RAROC Analysis'!F14","v":10000}]
[null,"Credit Spread",null,null,{"$f":"'RAROC Analysis'!F16","v":3.9E-2}]
[null,"Base Rate",null,null,{"$f":"'RAROC Analysis'!F15","v":0.03}]
[null,"Total Rate Added",null,null,{"$f":"E12+E13","v":6.9000000000000006E-2}]
[]
{"$rows_left_out":198}
{"sheet":"Loan Inputs","index":2,"n_rows":28,"n_cols":24,"rows_kept":28,"cut":false,"hidden":false,"merged":[]}
[]
[null,null,null,{"$f":"C2+1","v":1},2,3,4,5,6,{"$f":"I2+1","v":7},8]
[null,null,{"$f":"INDEX(D3:N3,$S$17)","v":"Customised Loan"},"Senegal Rice Loan","Senegal Rice Loan Adj","Lurio Plantation Loan","Lurio Plantation Loan","Manufacturing Loan","Real Estate Loan","Hotel Loan","Customised Loan"," ",null,null,"Customised Cell Links",null,{"$f":"TRANSPOSE(D3:L3)","v":"Senegal Rice Loan"}]
[null,null,null,null,null,null,null,null,null,null,null,null,null,null,null,null,"Senegal Rice Loan Adj",null,null,null,null,"Loan 1"]
[null,"Loan Amount",{"$f":"INDEX(D5:N5,$S$17)","v":10000},{"$f":"V5","v":10000},{"$f":"D5","v":10000},30000,30000,10000,10000,null,{"$f":"O5*1000","v":10000},null,null,null,10,null,"Lurio Plantation Loan",null,null,null,"Senior lender 1 commitment",10000,"Loan amount",30000000]
[null,"Base Interest Rate",{"$f":"INDEX(D6:N6,$S$17)","v":0.03},0.03,{"$f":"D6","v":0.03},{"$f":"X7","v":0.03},{"$f":"F6","v":0.03},{"$f":"D6","v":0.03},{"$f":"F6","v":0.03},null,{"$f":"O6/1000","v":0.03},null,null,null,30,null,"Lurio Plantation Loan",null,null,null,"Tenor (Years)",10,"Disbursement start date","2012-07-01"]
[null,"Credit Spread",3.9E-2,{"$f":"V9","v":5.8299999999999998E-2},5.8299999999999998E-2,{"$f":"X8","v":4.4999999999999998E-2},{"$f":"F7","v":4.4999999999999998E-2},0.05,0.04,null,{"$f":"O7/1000","v":3.9E-2},null,null,null,39,null,"Manufacturing Loan",null,null,null,"Grace period",3,"Libor",0.03]
[null,"Up-front Fee",0.01,{"$f":"V12","v":1.4999999999999999E-2},1.4999999999999999E-2,{"$f":"X15","v":1.4999999999999999E-2},{"$f":"F8","v":1.4999999999999999E-2},0.02,0.02,null,{"$f":"O8/1000","v":0.01},null,null,null,10,null,"Real Estate Loan",null,null,null,"Base rate- 6 months Libor (euro)",6.7000000000000002E-3,"Margin",4.4999999999999998E-2]
[null,"Commitment Fee",1.4999999999999999E-2,{"$f":"V11","v":0.01},0.01,{"$f":"X16","v":0.01},{"$f":"F9","v":0.01},0.01,0.01,null,{"$f":"O9/1000","v":1.4999999999999999E-2},null,null,null,15,null,"Hotel Loan",null,null,null,"Applicable Margin",5.8299999999999998E-2,"Interest rate",7.4999999999999997E-2]
[null,"Other Fees",0,{"$f":"V13/1000","v":70},70,{"$f":"X17*F5","v":225},{"$f":"F10","v":225},80,80,null,{"$f":"O10","v":0},null,null,null,0,null,"Customised Loan",null,null,null,"Interest Rate",6.5000000000000002E-2,"Grace period (years)",5]
[null,null,null,null,null,null,null,null,null,null,null,null,null,null,null,null," ",null,null,null,"Commitment Fee",0.01,"Loan period (maturity) (years)",15]
[null,"Maturity",10,{"$f":"V6","v":10},10,{"$f":"X11","v":15},{"$f":"F12","v":15},4,10,null,{"$f":"O12","v":10},null,null,null,10,null,{"$error":"#N/A"},null,null,null,"Front-end-fee (%tage of loan)",1.4999999999999999E-2,"Loan repayment duration (years)",10]
[null,"Grace Period",0,0,3,0,5,1,3,null,{"$f":"O13/10","v":0},null,null,null,0,null,{"$error":"#N/A"},null,null,null,"Due Diligence Appraisal Fee",70000,"Principle repayment style",3]
[null,"Repayments",1,1,1,1,1,2,2,null,{"$f":"O14","v":1},null,null,null,1]
[null,null,null,null,null,null,null,null,null,null,null,null,null,null,null,null,null,null,null,null,null,null,"Upfront",1.4999999999999999E-2]
{"$rows_left_out":14}
{"sheet":"Weights and Defaults","index":3,"n_rows":62,"n_cols":23,"rows_kept":62,"cut":false,"hidden":false,"merged":[]}
[null,null,null,null,"Code","Column"]
[null,null,null,null,{"$f":"Notes!$R$20","v":3},{"$f":"MATCH(E2,4:4,0)","v":12}]
[]
[null,"Code Number for Industry",null,null,null,null,null,1,null,2,null,3,null,4,null,5,null,6,null,7,null,8]
[null,null,null,null,{"$f":"INDEX(5:5,$F$2)","v":"Industry "},{"$f":"INDEX(5:5,$F$2+1)","v":"Weight"},null,"Agriculture","Weight","Social Projects","Weight","Industry ","Weight","Electricity","Weight","Infrastructure","Weight","Real Estate-Housing","Weight","Real Estate-Commercial","Weight","Real Estate - Hotel","Weight"]
[null,"Industry Assesment"]
[null,null,"Industry Price Variation",null,{"$f":"INDEX(7:7,$F$2)","v":6},{"$f":"INDEX(7:7,$F$2+1)","v":0.25},null,7,0.25,4,0.25,6,0.25,5,0.1,7,0.2,7,0.2,7,0.1,7,0.2]
[null,null,"Industry Capital Intensity",null,{"$f":"INDEX(8:8,$F$2)","v":7},{"$f":"INDEX(8:8,$F$2+1)","v":0.25},null,5,0.25,4,0.25,7,0.25,5,0.1,4,0.3,6,0.2,6,0.2,6,0.2]
[null,null,"Oblosense Risk",null,{"$f":"INDEX(9:9,$F$2)","v":5},{"$f":"INDEX(9:9,$F$2+1)","v":0.25},null,3,0.25,3,0.25,5,0.25,5,0.1,4,0.1,4,0.1,4,0.1,4,0.2]
[null,null,"Operating Leverage",null,{"$f":"INDEX(10:10,$F$2)","v":4},{"$f":"INDEX(10:10,$F$2+1)","v":0.25},null,6,0.25,6,0.25,4,0.25,6,0.1,6,0.4,6,0.2,6,0.2,6,0.2]
[null,null,"Contract Strength",null,{"$f":"INDEX(11:11,$F$2)","v":0},{"$f":"INDEX(11:11,$F$2+1)","v":0},null,null,null,null,null,null,null,2,0.6,null,null,5,0.3,5,0.4,5,0.2]
[null,"Management Assessment"]
[null,null,"Company Size",null,{"$f":"INDEX(13:13,$F$2)","v":5},{"$f":"INDEX(13:13,$F$2+1)","v":0.15},null,4,0.1,4,0.1,5,0.15,4,0.05,4,0.05,5,0.05,5,0.05,5,0.05]
[null,null,"Reputation Assessment",null,{"$f":"INDEX(14:14,$F$2)","v":4},{"$f":"INDEX(14:14,$F$2+1)","v":0.25},null,4,0.3,4,0.3,4,0.25,5,0.15,5,0.05,5,0.05,5,0.05,5,0.05]
[null,null,"Prior Projects",null,{"$f":"INDEX(15:15,$F$2)","v":6},{"$f":"INDEX(15:15,$F$2+1)","v":0.1},null,5,0.1,5,0.1,6,0.1,6,0.1,6,0.2,5,0.2,5,0.2,5,0.2]
{"$rows_left_out":48}
{"sheet":"Bond Rating Simulation","index":4,"n_rows":167,"n_cols":37,"rows_kept":167,"cut":false,"hidden":false,"merged":[[151,31,151,36],[152,32,152,36]]}
["General Business",null,null,"Lowest FFO/Interest Acceptable",null,null,null,null,"Lowest FFO/Debt Acceptable",null,null,null,null,null,"Highest Debt to Capital Acceptable"]
[null,null,null,1,2,3,4,null,null,1,2,3,4,null,null,1,2,3,4]
[null,null,null,"AA","A","BBB","BB","B",null,"AA","A","BBB","BB",null,null,"AA","A","BBB","BB"]
[null,null,1,2.5,1.5,1,null,null,1,0.15,0.1,0.05,0.01,null,1,0.55000000000000004,0.6,0.7]
[null,null,2,3,2,1,null,null,2,0.2,0.12,0.08,0.01,null,2,0.52,0.57999999999999996,0.68]
[null,null,3,3.5,2.5,1.5,1,null,3,0.25,0.15,0.1,0.05,null,3,0.5,0.55000000000000004,0.65,0.7]
[null,null,4,4.2,3.5,2.5,1.5,null,4,0.28000000000000003,0.2,0.12,0.08,null,4,0.45,0.52,0.62,0.68]
[null,null,5,4.5,3.8,2.8,1.8,null,5,0.3,0.22,0.15,0.1,null,5,0.42,0.5,0.62,0.68]
[null,null,6,5.2,4.2,3,2,null,6,0.35,0.28000000000000003,0.18,0.12,null,6,0.4,0.48,0.57999999999999996,0.62]
[null,null,7,6.5,4.5,3.2,2.2000000000000002,null,7,0.45,0.3,0.2,0.15,null,7,0.38,0.45,0.55000000000000004,0.6]
[null,null,8,7.5,5.5,3.5,2.5,null,8,0.55000000000000004,0.4,0.25,0.15,null,8,0.35,0.42,0.52,0.57999999999999996]
[null,null,9,8.5,7,4,2.8,null,9,0.65,0.45,0.3,0.2,null,9,0.32,0.4,0.5,0.55000000000000004]
[null,null,10,9,8,4.5,3,null,10,0.7,0.55000000000000004,0.4,0.25,null,10,0.25,0.35,0.48,0.52]
[]
[null,null,"Ratio",{"$f":"'RAROC Analysis'!M25*0.8","v":1.512},null,null,null,null,"Debt/EBIT",{"$f":"'RAROC Analysis'!M27","v":4.5},null,null,null,null,"Debt/Cap",{"$f":"'RAROC Analysis'!M24","v":0.49}]
{"$rows_left_out":153}
{"sheet":"Rating and PD","index":5,"n_rows":211,"n_cols":20,"rows_kept":211,"cut":false,"hidden":false,"merged":[]}
[null,null,null,null,null,null,null,null,null,null,null,null,null,null,null,null,null,null,"Slope","Intercept"]
["Inputs for Default Probability",null,"Year",1,2,3,4,5,10,15,null,null,null,null,null,null,null,"Coeff",{"$f":"LINEST(D11:J11,D2:J2,,TRUE)","v":5.5858490566037733E-3},-3.4905660377358462E-3]
["Cumulative Probabilities",null,"AAA",0,0,1E-3,2E-3,3.0000000000000001E-3,6.9999999999999993E-3,8.0000000000000002E-3,null,null,null,null,null,null,null,"Std error",1.0832144324121483E-4,7.980998259282297E-4]
[null,null,"AA",0,1E-3,1E-3,2E-3,3.0000000000000001E-3,9.0000000000000011E-3,1.3000000000000001E-2,null,null,null,null,null,null,null,"R2",0.9981232576095771,1.3329637852658215E-3]
[null,null,"A",1E-3,2E-3,3.0000000000000001E-3,5.0000000000000001E-3,6.9999999999999993E-3,1.9E-2,2.7999999999999997E-2,null,null,null,null,null,null,null,null,2659.1909009542042,5]
[null,null,"BBB",2E-3,6.9999999999999993E-3,1.2E-2,1.9E-2,2.6000000000000002E-2,5.4000000000000006E-2,7.9000000000000001E-2]
[null,null,"BB",1.1000000000000001E-2,3.1E-2,5.5999999999999994E-2,0.08,0.10099999999999999,0.17499999999999999,0.20800000000000002,null,null,null,null,null,null,null,"T-stat",{"$f":"S2/S3","v":51.567343357537851},{"$f":"T2/T3","v":-4.3735957888177017}]
[null,null,"B",0.05,0.109,0.159,0.19800000000000001,0.22600000000000001,0.30399999999999999,0.35]
[null,null,"CCC/C",0.26300000000000001,0.34700000000000003,0.4,0.43200000000000005,0.46200000000000002,0.51800000000000002,0.54600000000000004,null,null,null,null,null,null,null,"Slope",{"$f":"SLOPE(D11:J11,D2:J2)","v":5.585849056603775E-3}]
[null,null,null,null,null,null,null,null,null,null,null,null,null,null,null,null,null,"Intercept",{"$f":"INTERCEPT(D11:J11,D2:J2)","v":-3.4905660377358531E-3}]
[null,null,{"$f":"INDEX(C3:C9,$D$12)","v":"BBB"},{"$f":"INDEX(D3:D9,$D$12)","v":2E-3},6.9999999999999993E-3,1.2E-2,1.9E-2,2.6000000000000002E-2,5.4000000000000006E-2,7.9000000000000001E-2]
[null,null,"Code",4]
[]
["Updated Default Study",null,null,1,{"$f":"D14+1","v":2},3,4,5,6,7,8,9,10,11,12,13,14,15]
[null,null,"AAA",{"$f":"D202/100","v":0},{"$f":"E202/100","v":2.9999999999999997E-4},1.4000000000000002E-3,2.3999999999999998E-3,3.5999999999999999E-3,4.6999999999999993E-3,5.3E-3,6.0999999999999995E-3,6.7000000000000002E-3,7.4000000000000003E-3,7.7000000000000002E-3,8.0000000000000002E-3,8.3999999999999995E-3,9.1000000000000004E-3,9.7999999999999997E-3]
{"$rows_left_out":197}
{"sheet":"Capital Allocation","index":6,"n_rows":45,"n_cols":9,"rows_kept":45,"cut":false,"hidden":false,"merged":[]}
[]
[null,"Risk Rating",{"$f":"'RAROC Analysis'!R26","v":3.3170162059103907}]
[null,"Capital %",{"$f":"interpolate_look_up_linear(C2,C8:C11,D8:D11)","v":9.2680648236415628E-2}]
[null,"Loan",{"$f":"'RAROC Analysis'!F14","v":10000}]
[null,"Capital Allocation",{"$f":"C3*'RAROC Analysis'!F14","v":926.8064823641563}]
[]
[null,null,"Rating","Capital"]
[null,"AAA/AA",1,{"$f":"F38","v":1.6E-2}]
[null,"A ",2,{"$f":"F39","v":0.04}]
[null,"BBB ",3,{"$f":"F40","v":0.08}]
[null,"BB- below",4,{"$f":"F41","v":0.12}]
[]
[]
[null,"Rating Scale",null,1,2,3,4,5]
[null,"Capital Assignment",null,0,0.03,0.06,0.09,0.12]
{"$rows_left_out":31}
{"sheet":"Audits","index":7,"n_rows":14,"n_cols":6,"rows_kept":14,"cut":false,"hidden":false,"merged":[]}
[]
[null,null,"Computed","Target","Test","Notes"]
[]
[null,"Industry Weight not 100%",{"$f":"SUM('RAROC Analysis'!O7:O11)","v":1},1,{"$f":"C4=D4","v":true},{"$f":"IF(E4,\"\",B4)","v":""}]
[null,"Management Weight not 100%",{"$f":"SUM('RAROC Analysis'!O13:O16)","v":1},1,{"$f":"C5=D5","v":true},{"$f":"IF(E5,\"\",B5)","v":""}]
[null,"Collateral Weight not 100%",{"$f":"SUM('RAROC Analysis'!O18:O19)","v":1},1,true,""]
[null,"Enhancement Weight not 100%",{"$f":"SUM('RAROC Analysis'!O21:O22)","v":1},1,true,""]
[null,"Ratio Weight not 100%",{"$f":"SUM('RAROC Analysis'!O24:O28)","v":1},1,true,""]
[null,"Total Business not 100%",{"$f":"SUM('RAROC Analysis'!S8:S22)","v":1.0999999999999999},1,false,"Total Business not 100%"]
[]
[null,"Garce Period Doesn’t Match",{"$f":"IF('IRR Analysis'!F3>1,'IRR Analysis'!F3,0)","v":0},{"$f":"'RAROC Analysis'!$F$22","v":0},{"$f":"C11=D11","v":true},""]
[null,"Level Maturity Doesn't Match",{"$f":"'IRR Analysis'!F34","v":1.0000000000000002},1,{"$f":"C12=D12","v":true},""]
[null,"Mtg Maturity Doesn't Match",{"$f":"SUM('IRR Analysis'!G35:AZ35)","v":1},1,true,""]
[null,"Maturity Doesn’t Match",{"$f":"'IRR Analysis'!F5","v":10},{"$f":"'RAROC Analysis'!$F$21","v":10},true,""]

{"sheet":"RAROC Example","index":8,"n_rows":25,"n_cols":7,"rows_kept":25,"cut":false,"hidden":false,"merged":[]}
[]
[null,null,"Loan Amount",1000,null,"Revenue",{"$f":"D4","v":90}]
[null,null,"All-in Rate Earned",0.09,null,"Expenses",{"$f":"-D18-D23","v":-75}]
[null,null,"Loan Revenue",{"$f":"D2*D3","v":90},null,"Return on Capital",{"$f":"D14","v":4.875}]
[null,null,null,null,null,"Expected Loss",{"$f":"-D21","v":-10}]
[null,null,"Economic Capital for Loan",null,null,"Numerator",{"$f":"SUM(G2:G5)","v":9.875}]
[null,null,"Risk Class of Loan",3]
[null,null,"Economic Capital Percent",7.4999999999999997E-2,null,"Economic Capital",{"$f":"D9","v":75}]
[null,null,"Economic Capital Allocated",{"$f":"D8*D2","v":75}]
[null,null,null,null,null,"RAROC",{"$f":"G6/G8","v":0.13166666666666665}]
[null,null,"Equity Capital Invested",{"$f":"D9","v":75}]
[null,null,"Class of Asset for Investment",1]
[null,null,"Earnings Rate",6.5000000000000002E-2]
[null,null,"Earnings ",{"$f":"D11*D13","v":4.875}]
[]
{"$rows_left_out":11}
{"sheet":"Notes","index":9,"n_rows":20,"n_cols":19,"rows_kept":20,"cut":false,"hidden":false,"merged":[]}
[]
[null,null,null,null,null,null,null,null,"Notes:"]
[null,"Idea of RAROC"]
[null,null,null,null,null,null,null,null,"Color when below 10",null,null,null,"Agricultural Project Finance",null,null,null,2]
[null,"Computes profit and used as management tool",null,null,null,null,null,null,"Make dropdown box",null,null,null,"Social Project Finance",null,null,null,2]
[null,null,null,null,null,null,null,null,"Audit page",null,null,null,"General Industry",null,null,null,1]
[null,"Can be highly complex",null,null,null,null,null,null,null,null,null,null,"Infrastructure Projects - Electricity",null,null,null,2]
[null,null,null,null,null,null,null,null,null,null,null,null,"Infrastructure Projects - Infrastructure",null,null,null,2]
[null,"Requires risk assessment of loans",null,null,null,null,null,null,null,null,null,null,"Real Estate - Housing",null,null,null,3]
[null,null,null,null,null,null,null,null,null,null,null,null,"Real Estate - Commercial",null,null,null,3]
[null,null,null,null,null,null,null,null,null,null,null,null,"Real Estate - Hotels",null,null,null,3]
[null,null,null,null,null,null,null,null,null,null,null,null,"Telecom Projects",null,null,null,1]
[null,null,null,null,null,null,null,null,null,null,null,null,"Resources Project Finance",null,null,null,2]
[]
[]
{"$rows_left_out":5}