{"text_format":"1","workbook":"xlsx","n_sheets":18,"sheets":["Contents","Colour Codes","Summary","Inputs","Actuals","Scenario","Project Finance Model","Annual FS","Actual and Forecast","Act vs Forecat Graph","Tornado Diagram","Backup -->","Net Capacity","Solar Example","ROI in PF and Econ Dep","Circular","Debt maths","DataTables"],"not_rendered":{"charts":8,"images":1,"macros":1,"external_links":2,"defined_names":20,"comments":0,"pivot_tables":0},"unopened":[{"sheet":"Act vs Forecat Graph","index":9,"reason":"not_a_worksheet"},{"sheet":"Tornado Diagram","index":10,"reason":"not_a_worksheet"}],"bounds":{"document_bytes":16777216,"sheet_cells":100000,"rows_first":2000,"rows_last":500,"rows_between":2000,"halvings":0,"cell_chars":16384,"cell_head_chars":4096},"cells_cut":0,"cells_raw":0,"read":"whole","date_system":"1900"}

{"sheet":"Contents","index":0,"n_rows":28,"n_cols":5,"rows_kept":28,"cut":false,"hidden":false,"merged":[]}
[null,null,"Go to Charts by Pressing Shift and Enter on Menu Item "]
[]
[null,null,"Sheet Tab","Description","Author"]
[null,1,"Contents"]
[null,2,"Colour Codes"]
[null,3,"Summary"]
{"$rows_left_out":23}
{"sheet":"Colour Codes","index":1,"n_rows":29,"n_cols":6,"rows_kept":29,"cut":false,"hidden":false,"merged":[]}
["Contents","Colour Codes"]
[]
[]
[]
[]
[]
{"$rows_left_out":24}
{"sheet":"Summary","index":2,"n_rows":16,"n_cols":22,"rows_kept":16,"cut":false,"hidden":false,"merged":[]}
["Contents","Summary"]
[null,null,null,null,null,null,null,null,null,"Capacity",null,{"$f":"Inputs!G19","v":94}]
[null,null,null,null,null,null,"P50 DSCR"]
[null,null,null,null,null,null,"P90 DSCR",null,null,"Cost/kW",null,{"$f":"H11/L2","v":1440},null,null,null,null,null,null,"Cost per kW",null,"$/KW",650]
[null,"Constrution period",null,{"$f":"Inputs!G5","v":16},null,null,"Debt to capital",{"$f":"Inputs!F91","v":0.8},null,"Capacity Factor",null,{"$f":"Inputs!G23","v":0.41326629748372684},null,null,null,null,null,null,"Capacity Factor",null,"%",0.25]
[null,"Inflate PPA",null,{"$f":"Inputs!F55","v":true},null,null,null,null,null,"O&M Cost",null,{"$f":"Inputs!F82","v":54.108948896376724},null,null,null,null,null,null,"OPEX",null,"$/KW",8]
{"$rows_left_out":11}
{"sheet":"Inputs","index":3,"n_rows":135,"n_cols":46,"rows_kept":135,"cut":false,"hidden":false,"merged":[]}
["Contents","Inputs"]
[null,null,null,null,null,"Unit"]
["Timing input"]
[null,"Start Date",null,null,null,"Date","2019-01-01"]
[null,"Development period",null,null,null,"Months",16,null,null,null,16,"dev per"]
[null,"Financial Close Date",null,null,null,"Date",{"$f":"EDATE(G4,G5)","v":"2020-05-01"}]
{"$rows_left_out":130}
{"sheet":"Actuals","index":4,"n_rows":34,"n_cols":16,"rows_kept":34,"cut":false,"hidden":false,"merged":[]}
["Contents","Actuals"]
[null,"Last Date for History",null,null,null,null,"2025-05-01"]
[null,"Months per Period for Reporting",null,null,null,null,6]
[]
[]
[null,"Actual Date",null,null,null,null,null,null,{"$f":"Inputs!G8","v":"2021-11-01"},{"$f":"EDATE(I6,$G$3)","v":"2022-05-01"},{"$f":"EDATE(J6,$G$3)","v":"2022-11-01"},"2023-05-01","2023-11-01","2024-05-01","2024-11-01","2025-05-01"]
{"$rows_left_out":29}
{"sheet":"Scenario","index":5,"n_rows":37,"n_cols":44,"rows_kept":37,"cut":false,"hidden":false,"merged":[]}
["Contents","Scenario"]
[null,null,null,"Scenario",1]
[null,null,null,null,null,null,null,null,null,null,null,null,"Project IRR","At-IRR","Equity IRR","DSCR","LLCR","PLCR"]
[null,null,null,"Cap Exp","Constr Period","Capacity","Production","Merchant Prices","Inflation Rate Price","Inflation Rate Cost",null,null,{"$f":"Summary!D9","v":8.5478267073631278E-2},{"$f":"Summary!D10","v":7.4857339262962341E-2},{"$f":"Equity_IRR","v":0.14456849694252014}]
[null,1,"Base Case",{"$f":"112800","v":112800},18,94,1,1,null,null,null,1,8.5478267073631278E-2,7.4857339262962341E-2,0.14456849694252014]
[null,2,"Low Case",{"$f":"D5*1.1","v":124080.00000000001},24,{"$f":"F5*80%","v":75.2},2,2,null,null,null,2,5.226227939128876E-2,4.5661506056785581E-2,6.9675853848457356E-2]
{"$rows_left_out":32}
{"sheet":"Project Finance Model","index":6,"n_rows":341,"n_cols":111,"rows_kept":341,"cut":false,"hidden":false,"merged":[]}
["Contents","Project Finance Model","Model period",null,null,null,null,"Equity IRR",{"$f":"Equity_IRR","v":0.14456849694252014},null,null,1,2,3,4,5,6,7,8,9,10,11,12,13,14,15,16,17,18,19,20,21,22,23,24,25,26,27,28,29,30,31,32,33,34,35,36,37,38,39,40,41,42,43,44,45,46,47,48,49,50,51,52,53,54,55,56,57,58,59,60,61,62,63,64,65,66,67,68,69,70,71,72,73,74,75,76,77,78,79,80,81,82,83,84,85,86,87,88,89,90,91,92,93,94,95,96,97,98,99,100]
[null,null,"Pre COD ",null,null,"Flag",null,{"$f":"Inputs!G16","v":34},null,null,null,{"$f":"(L1<=$H2)*1","v":1},{"$f":"(M1<=$H2)*1","v":1},1,1,1,1,1,1,1,1,1,1,1,1,1,1,1,1,1,1,1,1,1,1,1,1,1,1,1,1,1,1,1,1,0,0,0,0,0,0,0,0,0,0,0,0,0,0,0,0,0,0,0,0,0,0,0,0,0,0,0,0,0,0,0,{"$f":"(BY1<=$H2)*1","v":0},0,0,0,0,0,0,0,0,0,0,0,0,0,0,0,0,0,0,0,0,0,0,0,0,0,0,0,0,0,0,0,0,0,0]
[null,null,"Months in period",null,null,"Months",null,{"$f":"Inputs!G14","v":1},{"$f":"Inputs!G15","v":6},null,null,{"$f":"IF(L2,$H$3,$I$3)","v":1},{"$f":"IF(M2,$H$3,$I$3)","v":1},1,1,1,1,1,1,1,1,1,1,1,1,1,1,1,1,1,1,1,1,1,1,1,1,1,1,1,1,1,1,1,1,6,6,6,6,6,6,6,6,6,6,6,6,6,6,6,6,6,6,6,6,6,6,6,6,6,6,6,6,6,6,6,{"$f":"IF(BY2,$H$3,$I$3)","v":6},6,6,6,6,6,6,6,6,6,6,6,6,6,6,6,6,6,6,6,6,6,6,6,6,6,6,6,6,6,6,6,6,6,6]
[null,null,"Start of period",null,null,"Date",null,null,null,null,null,{"$f":"K5+1","v":"2019-01-01"},{"$f":"L5+1","v":"2019-02-01"},"2019-03-01","2019-04-01","2019-05-01","2019-06-01","2019-07-01","2019-08-01","2019-09-01","2019-10-01","2019-11-01","2019-12-01","2020-01-01","2020-02-01","2020-03-01","2020-04-01","2020-05-01","2020-06-01","2020-07-01","2020-08-01","2020-09-01","2020-10-01","2020-11-01","2020-12-01","2021-01-01","2021-02-01","2021-03-01","2021-04-01","2021-05-01","2021-06-01","2021-07-01","2021-08-01","2021-09-01","2021-10-01","2021-11-01","2022-05-01","2022-11-01","2023-05-01","2023-11-01","2024-05-01","2024-11-01","2025-05-01","2025-11-01","2026-05-01","2026-11-01","2027-05-01","2027-11-01","2028-05-01","2028-11-01","2029-05-01","2029-11-01","2030-05-01","2030-11-01","2031-05-01","2031-11-01","2032-05-01","2032-11-01","2033-05-01","2033-11-01","2034-05-01","2034-11-01","2035-05-01","2035-11-01","2036-05-01","2036-11-01",{"$f":"BX5+1","v":"2037-05-01"},"2037-11-01","2038-05-01","2038-11-01","2039-05-01","2039-11-01","2040-05-01","2040-11-01","2041-05-01","2041-11-01","2042-05-01","2042-11-01","2043-05-01","2043-11-01","2044-05-01","2044-11-01","2045-05-01","2045-11-01","2046-05-01","2046-11-01","2047-05-01","2047-11-01","2048-05-01","2048-11-01","2049-05-01","2049-11-01","2050-05-01","2050-11-01","2051-05-01","2051-11-01","2052-05-01","2052-11-01","2053-05-01","2053-11-01","2054-05-01"]
[null,null,"End of period",null,null,"Date",null,{"$f":"Inputs!G4","v":"2019-01-01"},null,null,{"$f":"H5-1","v":"2018-12-31"},{"$f":"EDATE(L4,L3)-1","v":"2019-01-31"},"2019-02-28","2019-03-31","2019-04-30","2019-05-31","2019-06-30","2019-07-31","2019-08-31","2019-09-30","2019-10-31","2019-11-30","2019-12-31","2020-01-31","2020-02-29","2020-03-31","2020-04-30","2020-05-31","2020-06-30","2020-07-31","2020-08-31","2020-09-30","2020-10-31","2020-11-30","2020-12-31","2021-01-31","2021-02-28","2021-03-31","2021-04-30","2021-05-31","2021-06-30","2021-07-31","2021-08-31",{"$f":"EDATE(AR4,AR3)-1","v":"2021-09-30"},"2021-10-31","2022-04-30","2022-10-31","2023-04-30","2023-10-31","2024-04-30","2024-10-31","2025-04-30","2025-10-31","2026-04-30","2026-10-31","2027-04-30","2027-10-31","2028-04-30","2028-10-31","2029-04-30","2029-10-31","2030-04-30","2030-10-31","2031-04-30","2031-10-31","2032-04-30","2032-10-31","2033-04-30","2033-10-31","2034-04-30","2034-10-31","2035-04-30","2035-10-31","2036-04-30","2036-10-31",{"$f":"EDATE(BX4,BX3)-1","v":"2037-04-30"},"2037-10-31","2038-04-30","2038-10-31","2039-04-30","2039-10-31","2040-04-30","2040-10-31","2041-04-30","2041-10-31","2042-04-30","2042-10-31","2043-04-30","2043-10-31","2044-04-30","2044-10-31","2045-04-30","2045-10-31","2046-04-30","2046-10-31","2047-04-30","2047-10-31","2048-04-30","2048-10-31","2049-04-30","2049-10-31","2050-04-30","2050-10-31","2051-04-30","2051-10-31","2052-04-30","2052-10-31",{"$f":"EDATE(DD4,DD3)-1","v":"2053-04-30"},"2053-10-31","2054-04-30","2054-10-31"]
[null,null,"Operations flag",null,null,"Flag",null,{"$f":"Inputs!G8","v":"2021-11-01"},{"$f":"Inputs!G10","v":"2051-11-01"},null,null,{"$f":"AND(L4>=$H$6,L4<$I$6)*1","v":0},0,0,0,0,0,0,0,0,0,0,0,0,0,0,0,0,0,0,0,0,0,0,0,0,0,0,0,0,0,0,0,{"$f":"AND(AR4>=$H$6,AR4<$I$6)*1","v":0},0,1,1,1,1,1,1,1,1,1,1,1,1,1,1,1,1,1,1,1,1,1,1,1,1,1,1,1,1,1,1,{"$f":"AND(BX4>=$H$6,BX4<$I$6)*1","v":1},1,1,1,1,1,1,1,1,1,1,1,1,1,1,1,1,1,1,1,1,1,1,1,1,1,1,1,1,1,0,0,0,0,0,0]
{"$rows_left_out":336}
{"sheet":"Annual FS","index":7,"n_rows":57,"n_cols":46,"rows_kept":57,"cut":false,"hidden":false,"merged":[]}
["Contents","Annual FS"]
[]
[null,null,null,null,null,null,null,null,null,null,{"$f":"YEAR(Inputs!G4)","v":2019},{"$f":"K3+1","v":2020},{"$f":"L3+1","v":2021},2022,2023,2024,2025,2026,2027,2028,2029,2030,2031,2032,2033,2034,2035,2036,2037,2038,2039,2040,2041,2042,2043,2044,2045,2046,2047,2048,2049,2050,2051,2052,2053,2054]
[]
[]
["Profit and Loss"]
{"$rows_left_out":52}
{"sheet":"Actual and Forecast","index":8,"n_rows":59,"n_cols":60,"rows_kept":59,"cut":false,"hidden":false,"merged":[]}
["Contents","Actual and Forecast"]
[null,"Start of Period",null,null,null,{"$f":"Inputs!G15","v":6},null,null,null,null,null,{"$f":"Inputs!G8","v":"2021-11-01"},{"$f":"EDATE(L2,$F$2)","v":"2022-05-01"},{"$f":"EDATE(M2,$F$2)","v":"2022-11-01"},"2023-05-01","2023-11-01","2024-05-01","2024-11-01","2025-05-01","2025-11-01","2026-05-01","2026-11-01","2027-05-01","2027-11-01","2028-05-01","2028-11-01","2029-05-01","2029-11-01","2030-05-01","2030-11-01","2031-05-01","2031-11-01","2032-05-01","2032-11-01","2033-05-01","2033-11-01","2034-05-01","2034-11-01","2035-05-01","2035-11-01","2036-05-01","2036-11-01","2037-05-01","2037-11-01","2038-05-01","2038-11-01","2039-05-01","2039-11-01","2040-05-01","2040-11-01","2041-05-01","2041-11-01","2042-05-01","2042-11-01","2043-05-01","2043-11-01","2044-05-01","2044-11-01","2045-05-01","2045-11-01"]
[null,"Actual flag",null,null,null,{"$f":"Actuals!$G$2","v":"2025-05-01"},null,null,"Average","Last","Forecast",{"$f":"L2<=$F$3","v":true},{"$f":"M2<=$F$3","v":true},true,true,true,true,true,true,false,false,false,false,false,false,false,false,false,false,false,false,false,false,false,false,false,false,false,false,false,false,false,false,false,false,false,false,false,false,false,false,false,false,false,false,false,false,false,false,false]
[]
["Financial model"]
[null,null,null,"Generation",null,null,"GWH p.p.",null,null,null,null,{"$f":"LOOKUP(L2,'Project Finance Model'!4:4,'Project Finance Model'!16:16)","v":170.15},{"$f":"LOOKUP(M2,'Project Finance Model'!4:4,'Project Finance Model'!16:16)","v":170.15},{"$f":"LOOKUP(N2,'Project Finance Model'!4:4,'Project Finance Model'!16:16)","v":170.15},{"$f":"LOOKUP(O2,'Project Finance Model'!4:4,'Project Finance Model'!16:16)","v":170.15},{"$f":"LOOKUP(P2,'Project Finance Model'!4:4,'Project Finance Model'!16:16)","v":170.15},{"$f":"LOOKUP(Q2,'Project Finance Model'!4:4,'Project Finance Model'!16:16)","v":170.15},{"$f":"LOOKUP(R2,'Project Finance Model'!4:4,'Project Finance Model'!16:16)","v":170.15},{"$f":"LOOKUP(S2,'Project Finance Model'!4:4,'Project Finance Model'!16:16)","v":170.15},{"$f":"LOOKUP(T2,'Project Finance Model'!4:4,'Project Finance Model'!16:16)","v":170.15},{"$f":"LOOKUP(U2,'Project Finance Model'!4:4,'Project Finance Model'!16:16)","v":170.15},{"$f":"LOOKUP(V2,'Project Finance Model'!4:4,'Project Finance Model'!16:16)","v":170.15},{"$f":"LOOKUP(W2,'Project Finance Model'!4:4,'Project Finance Model'!16:16)","v":170.15},{"$f":"LOOKUP(X2,'Project Finance Model'!4:4,'Project Finance Model'!16:16)","v":170.15},{"$f":"LOOKUP(Y2,'Project Finance Model'!4:4,'Project Finance Model'!16:16)","v":170.15},{"$f":"LOOKUP(Z2,'Project Finance Model'!4:4,'Project Finance Model'!16:16)","v":170.15},{"$f":"LOOKUP(AA2,'Project Finance Model'!4:4,'Project Finance Model'!16:16)","v":170.15},{"$f":"LOOKUP(AB2,'Project Finance Model'!4:4,'Project Finance Model'!16:16)","v":170.15},{"$f":"LOOKUP(AC2,'Project Finance Model'!4:4,'Project Finance Model'!16:16)","v":170.15},{"$f":"LOOKUP(AD2,'Project Finance Model'!4:4,'Project Finance Model'!16:16)","v":170.15},{"$f":"LOOKUP(AE2,'Project Finance Model'!4:4,'Project Finance Model'!16:16)","v":170.15},{"$f":"LOOKUP(AF2,'Project Finance Model'!4:4,'Project Finance Model'!16:16)","v":170.15},{"$f":"LOOKUP(AG2,'Project Finance Model'!4:4,'Project Finance Model'!16:16)","v":170.15},{"$f":"LOOKUP(AH2,'Project Finance Model'!4:4,'Project Finance Model'!16:16)","v":170.15},{"$f":"LOOKUP(AI2,'Project Finance Model'!4:4,'Project Finance Model'!16:16)","v":170.15},{"$f":"LOOKUP(AJ2,'Project Finance Model'!4:4,'Project Finance Model'!16:16)","v":170.15},{"$f":"LOOKUP(AK2,'Project Finance Model'!4:4,'Project Finance Model'!16:16)","v":170.15},{"$f":"LOOKUP(AL2,'Project Finance Model'!4:4,'Project Finance Model'!16:16)","v":170.15},{"$f":"LOOKUP(AM2,'Project Finance Model'!4:4,'Project Finance Model'!16:16)","v":170.15},{"$f":"LOOKUP(AN2,'Project Finance Model'!4:4,'Project Finance Model'!16:16)","v":170.15},{"$f":"LOOKUP(AO2,'Project Finance Model'!4:4,'Project Finance Model'!16:16)","v":170.15},{"$f":"LOOKUP(AP2,'Project Finance Model'!4:4,'Project Finance Model'!16:16)","v":170.15},{"$f":"LOOKUP(AQ2,'Project Finance Model'!4:4,'Project Finance Model'!16:16)","v":170.15},{"$f":"LOOKUP(AR2,'Project Finance Model'!4:4,'Project Finance Model'!16:16)","v":170.15},{"$f":"LOOKUP(AS2,'Project Finance Model'!4:4,'Project Finance Model'!16:16)","v":170.15},{"$f":"LOOKUP(AT2,'Project Finance Model'!4:4,'Project Finance Model'!16:16)","v":170.15},{"$f":"LOOKUP(AU2,'Project Finance Model'!4:4,'Project Finance Model'!16:16)","v":170.15},{"$f":"LOOKUP(AV2,'Project Finance Model'!4:4,'Project Finance Model'!16:16)","v":170.15},{"$f":"LOOKUP(AW2,'Project Finance Model'!4:4,'Project Finance Model'!16:16)","v":170.15},{"$f":"LOOKUP(AX2,'Project Finance Model'!4:4,'Project Finance Model'!16:16)","v":170.15},{"$f":"LOOKUP(AY2,'Project Finance Model'!4:4,'Project Finance Model'!16:16)","v":170.15},{"$f":"LOOKUP(AZ2,'Project Finance Model'!4:4,'Project Finance Model'!16:16)","v":170.15},{"$f":"LOOKUP(BA2,'Project Finance Model'!4:4,'Project Finance Model'!16:16)","v":170.15},{"$f":"LOOKUP(BB2,'Project Finance Model'!4:4,'Project Finance Model'!16:16)","v":170.15},{"$f":"LOOKUP(BC2,'Project Finance Model'!4:4,'Project Finance Model'!16:16)","v":170.15},{"$f":"LOOKUP(BD2,'Project Finance Model'!4:4,'Project Finance Model'!16:16)","v":170.15},{"$f":"LOOKUP(BE2,'Project Finance Model'!4:4,'Project Finance Model'!16:16)","v":170.15},{"$f":"LOOKUP(BF2,'Project Finance Model'!4:4,'Project Finance Model'!16:16)","v":170.15},{"$f":"LOOKUP(BG2,'Project Finance Model'!4:4,'Project Finance Model'!16:16)","v":170.15},{"$f":"LOOKUP(BH2,'Project Finance Model'!4:4,'Project Finance Model'!16:16)","v":170.15}]
{"$rows_left_out":54}
{"sheet":"Backup -->","index":11,"n_rows":1,"n_cols":2,"rows_kept":1,"cut":false,"hidden":false,"merged":[]}
["Contents","Backup -->"]

{"sheet":"Net Capacity","index":12,"n_rows":80,"n_cols":5,"rows_kept":80,"cut":false,"hidden":false,"merged":[]}
["Contents","Net Capacity"]
["Gross and Net Capacity"]
[null," Wind Farm Rated Power1  MW                            ",94]
[null," Gross Energy Output  GWh/annum                             ",416.5]
[null," Wake effect                                ",0.94799999999999995,null,0.01]
[null," Availability                                 ",0.95299999999999996]
{"$rows_left_out":75}
{"sheet":"Solar Example","index":13,"n_rows":20,"n_cols":15,"rows_kept":20,"cut":false,"hidden":false,"merged":[]}
["Contents","Solar Example"]
[]
[]
[]
[]
[null,"January","February","March","April","May","June","July","August","September","October","November","December"]
{"$rows_left_out":15}
{"sheet":"ROI in PF and Econ Dep","index":14,"n_rows":83,"n_cols":38,"rows_kept":83,"cut":false,"hidden":false,"merged":[]}
["Contents","IRR Examples"]
["Simple Examples"]
[null,null,null,null,null,null,null,"Outlflow","Inflow",null,null,"IRR","Growth"]
[null,"One Period",null,null,null,null,null,-100,120,null,null,{"$f":"IRR(H4:I4)","v":0.20000000000000018},{"$f":"(I4/-H4)^1-1","v":0.19999999999999996}]
[]
[null,"Two Periods",null,null,null,null,null,-100,0,120,null,{"$f":"IRR(H6:J6)","v":9.5445115010502901E-2},{"$f":"(J6/-H6)^0.5-1","v":9.5445115010332149E-2}]
{"$rows_left_out":78}
{"sheet":"Circular","index":15,"n_rows":26,"n_cols":22,"rows_kept":26,"cut":false,"hidden":false,"merged":[]}
["Contents"]
[null,null,null,"Debt %",null,0.74468085205268619]
[null,null,null,"Fee %",null,0.2]
[]
[null,null,null,"Cap Exp",null,null,{"$f":"'Debt maths'!D12","v":100},{"$f":"'Debt maths'!E12","v":102},{"$f":"'Debt maths'!F12","v":104.04},{"$f":"'Debt maths'!G12","v":106.1208},{"$f":"'Debt maths'!H12","v":108.243216}]
[null,null,null,"Target debt",null,700]
{"$rows_left_out":21}
{"sheet":"Debt maths","index":16,"n_rows":20,"n_cols":18,"rows_kept":20,"cut":false,"hidden":false,"merged":[]}
["Contents","Debt maths",0.05]
[null,"DSCR",1.35]
[null,"Maturity",15]
[null,"CFADS",100]
[null,"Maximum debt/capital",0.8]
[null,"Growth rate",0.02]
{"$rows_left_out":15}
{"sheet":"DataTables","index":17,"n_rows":19,"n_cols":7,"rows_kept":19,"cut":false,"hidden":false,"merged":[]}
["Contents","DataTables"]
[]
[null,null,null,null,null,null,{"$f":"Summary!D13","v":0.14456849694252014}]
[]
[]
[]
{"$rows_left_out":13}