{"text_format":"1","workbook":"xlsx","n_sheets":9,"sheets":["Contents","Company Case","Assumptions and Working","Forecast","Analysis","Tornado","Scenarios","Financial Statements","Simple Example"],"not_rendered":{"charts":4,"images":1,"macros":1,"external_links":1,"defined_names":24,"comments":0,"pivot_tables":0},"unopened":[{"sheet":"Tornado","index":5,"reason":"not_a_worksheet"}],"bounds":{"document_bytes":16777216,"sheet_cells":100000,"rows_first":2000,"rows_last":500,"rows_between":2000,"halvings":0,"cell_chars":16384,"cell_head_chars":4096},"cells_cut":0,"cells_raw":0,"read":"whole","date_system":"1900"}

{"sheet":"Contents","index":0,"n_rows":37,"n_cols":13,"rows_kept":37,"cut":false,"hidden":false,"merged":[]}
[]
[null,null,"Contents"]
[null,null,null,null,null," Colour Codes ",null,null,null,null," File Name: ",null,{"$f":"IFERROR(File_name(),\"\")","v":"C:\\Users\\stormy daniels\\Documents\\Corporate Model for Credit3.xlsm"}]
[null,null,"Company Case",null,null,null," Inputs ",null,"1234567890"]
[null,null,null,"HISTORIC BALANCE SHEET",null,null," Section Titles ",null,"TITLE ROW",null," Last Save Date ",null,{"$f":"IFERROR(lastsaved(),\"\")","v":"1/18/2020 10:25:20 AM"}]
[null,null,null,"INCOME STATEMENT",null,null," Sum Column ",null,"1000000000"]
[null,null,null,"CASH FLOW STATEMENT - DIRECT",null,null," True or 1 ",null,{"$f":"1=1","v":true},null," Last Save By",null,{"$f":"IFERROR(last_save_by(),\"\")","v":"Nelson Mandela"}]
[null,null,null,"Balance Sheet Items",null,null," False or 0 ",null,{"$f":"1=2","v":false}]
[null,null,null,null,null,null," Other Sheet Links ",null,"|||||||||||||||||||"]
[null,null,"Assumptions and Working"]
[null,null,null,"Revenues"]
[null,null,null,"Home Power Systems - Cap Exp and Depreciation"]
[null,null,null,"Cooking Systems - Cap Exp and Depreciation"]
[null,null,null,"Non-Depreciation Cost of Goods Sold"]
[null,null,null,"SG&A and Overheads"]
[null,null,null,"Working Capital"]
[null,null,null,"Financing Assumptions"]
[]
[null,null,"Forecast"]
[null,null,null,"HISTORIC BALANCE SHEET"]
[null,null,null,"INCOME STATEMENT"]
[null,null,null,"CASH FLOW STATEMENT - DIRECT"]
[null,null,null,"FINANCING"]
[null,null,null,"Balance Sheet"]
[null,null,null,"Financial Ratios for Re-Financing"]
[]
[null,null,"Analysis"]
[]
[null,null,"Scenarios"]
[]
{"$rows_left_out":8}
{"sheet":"Company Case","index":1,"n_rows":167,"n_cols":15,"rows_kept":167,"cut":false,"hidden":false,"merged":[]}
["          ",null,"Months"]
[null,null,"Year",null,null,null,2015,2016,2017,2018,2019,2020,2021,2022,2023]
[null,null,"History",null,null,null,true,true,true,true,true,false,false,false,false]
[]
[null,"HISTORIC BALANCE SHEET"]
[null,null,"Intangible fixed assets"]
[null,null,"Fixtures and Fittings",null,null,null,65740,70255,120650,240432,260023]
[null,null,"Accumulated Depreciation F&F",null,null,null,-33527.4,-36532.6,-62738,-125024.64,-143201]
[null,null,"Capitalised Solar Power Costs",null,null,null,1023121,1533234,5320431,8785039.6999999993,8172272.75]
[null,null,"Accumulated Depreciation Solar Power",null,null,null,-153468.15,-229985.1,-798064.65,-1317755.9549999998,-1225840.9124999999]
[null,null,"Capitalised Appliances (TV, Fans etc)",null,null,null,122774.51999999999,183988.08,638451.72,1054204.764,980672.73]
[null,null,"Accumulated Depreciation on Appliances",null,null,null,-15960.687599999999,-23918.450399999998,-82998.723599999998,-137046.61932,-127487.4549]
[null,null,"Other Assets",null,null,null,607,514,424418.86306745559,500000,450000]
[null,null,"Total Fixed Assets",null,null,null,{"$f":"SUM(G7:G13)","v":1009286.2824000001},{"$f":"SUM(H7:H13)","v":1497554.9295999999},5560150.2094674548,8999849.2496799994,8366439.1126000006]
[]
[null,null,"Current Assets:"]
[null,null,"Cash at Bank",null,null,null,40321,250321,810913,1234121,650342]
[null,null,"Inventory and Work in Progress solar",null,null,null,325634,3845321,2765333,1235653,3042321]
[null,null,"Trade Receivables",null,null,null,1142515,431317,372006,500678.01,431947.52000000002]
[null,null,"Other Current Assets",null,null,null,55438,96026,158884.69704142027,153267.51999999979,805893.57999999961]
[null,null,"Total Current Assets",null,null,null,{"$f":"SUM(G17:G20)","v":1563908},{"$f":"SUM(H17:H20)","v":4622985},{"$f":"SUM(I17:I20)","v":4107136.6970414203},{"$f":"SUM(J17:J20)","v":3123719.5299999993},{"$f":"SUM(K17:K20)","v":4930504.0999999996}]
[null,null,"Total Assets",null,null,null,{"$f":"G21+G14","v":2573194.2823999999},{"$f":"H21+H14","v":6120539.9296000004},{"$f":"I21+I14","v":9667286.9065088741},{"$f":"J21+J14","v":12123568.779679999},{"$f":"K21+K14","v":13296943.2126}]
[]
[null,null,"Total Current Liabilities",null,null,null,58756,70899,162789.13254437869,2672584.5799999996,3733016.3299999991]
[null,null,"Intercompany Company Loans",null,null,null,2000000,2000000,2000000,2000000,2000000]
[null,null,"Loans",null,null,null,0,0,4522177.6366863903,3100000,6400000]
[null,null,"Total Equity",null,null,null,{"$f":"G22-G24-G25-G26","v":514438.28239999991},{"$f":"H22-H24-H25-H26","v":4049640.9296000004},2982320.1372781061,4350984.1996799987,1163926.882600002]
[null,null,"Total Liabilities and Capital",null,null,null,{"$f":"SUM(G24:G27)","v":2573194.2823999999},{"$f":"SUM(H24:H27)","v":6120539.9296000004},9667286.9065088741,12123568.779679999,13296943.2126]
[]
[]
{"$rows_left_out":138}
{"sheet":"Assumptions and Working","index":2,"n_rows":217,"n_cols":19,"rows_kept":217,"cut":false,"hidden":false,"merged":[]}
["          "]
[null,null,null,"Year",null,null,null,2015,2016,2017,2018,2019,2020,2021,2022,2023]
[null,null,null,"History",null,null,null,{"$f":"'Company Case'!G3*1","v":1},{"$f":"'Company Case'!H3*1","v":1},{"$f":"'Company Case'!I3*1","v":1},{"$f":"'Company Case'!J3*1","v":1},{"$f":"'Company Case'!K3*1","v":1},{"$f":"'Company Case'!L3*1","v":0},{"$f":"'Company Case'!M3*1","v":0},{"$f":"'Company Case'!N3*1","v":0},{"$f":"'Company Case'!O3*1","v":0}]
[]
[null,"Revenues"]
[null,null,null,"Solar Revenue Code",{"$f":"Scenarios!AA5","v":1}]
[null,null,null,"Solar Revenue - Company",null,null,null,{"$f":"'Company Case'!G40-'Company Case'!G39","v":490000},{"$f":"'Company Case'!H40-'Company Case'!H39","v":1160000},{"$f":"'Company Case'!I40-'Company Case'!I39","v":2340000},{"$f":"'Company Case'!J40-'Company Case'!J39","v":3250000},{"$f":"'Company Case'!K40-'Company Case'!K39","v":3480000},{"$f":"'Company Case'!L40-'Company Case'!L39","v":4900000},{"$f":"'Company Case'!M40-'Company Case'!M39","v":6900000},{"$f":"'Company Case'!N40-'Company Case'!N39","v":10900000},{"$f":"'Company Case'!O40-'Company Case'!O39","v":15300000}]
[null,null,null,"Company Solar RevenueCase",null,null,null,null,{"$f":"I7/H7-1","v":1.3673469387755102},{"$f":"J7/I7-1","v":1.0172413793103448},0.38888888888888884,7.0769230769230695E-2,0.40804597701149414,0.40816326530612246,0.57971014492753614,0.40366972477064222]
[null,null,null,"Bank Solar Revenue Base Case",null,null,null,null,null,null,null,null,0.2,0.3,0.25,0.2]
[null,null,null,"Bank Solar Revenue Low Case",null,null,null,null,null,null,null,null,0.1,0.15,0.17,0.15]
[null,null,null,"Bank Solar Revenue Sensivitiy Case",null,null,null,null,null,null,null,null,0.15,{"$f":"M11","v":0.15},{"$f":"N11","v":0.15},{"$f":"O11","v":0.15}]
[]
[null,null,null,{"$f":"INDEX(D8:D11,Scenarios!$AA$5)","v":"Company Solar RevenueCase"},null,null,null,{"$f":"MIN(IF(H3,H8,INDEX(H8:H11,Scenarios!$AA$5)),75%)","v":0.75},{"$f":"MIN(IF(I3,I8,INDEX(I8:I11,Scenarios!$AA$5)),75%)","v":0.75},{"$f":"MIN(IF(J3,J8,INDEX(J8:J11,Scenarios!$AA$5)),75%)","v":0.75},{"$f":"MIN(IF(K3,K8,INDEX(K8:K11,Scenarios!$AA$5)),75%)","v":0.38888888888888884},{"$f":"MIN(IF(L3,L8,INDEX(L8:L11,Scenarios!$AA$5)),75%)","v":7.0769230769230695E-2},{"$f":"MIN(IF(M3,M8,INDEX(M8:M11,Scenarios!$AA$5)),75%)","v":0.40804597701149414},{"$f":"MIN(IF(N3,N8,INDEX(N8:N11,Scenarios!$AA$5)),75%)","v":0.40816326530612246},{"$f":"MIN(IF(O3,O8,INDEX(O8:O11,Scenarios!$AA$5)),75%)","v":0.57971014492753614},{"$f":"MIN(IF(P3,P8,INDEX(P8:P11,Scenarios!$AA$5)),75%)","v":0.40366972477064222},null,true,{"$f":"R13+S12","v":1}]
[null,null,null,"Solar Revenue Projection",null,null,null,{"$f":"IF(H3,H7,G14*(1+H13))","v":490000},1160000,2340000,3250000,3480000,4900000,6900000,10900000,15300000,null,true,{"$f":"IF(R14,S13+1,S13)","v":2}]
[null,null,null,null,null,null,null,{"$f":"H3","v":1},{"$f":"I3","v":1},1,1,1,0,0,0,0,null,null,{"$f":"IF(R15,S14+1,S14)","v":2}]
[null,null,null,"appliances Revenue Code",{"$f":"Scenarios!AA12","v":1},null,null,null,null,null,null,null,null,null,null,null,null,null,{"$f":"IF(R16,S15+1,S15)","v":2}]
[null,null,null,"Revenue from appliances - Company Forecast",null,null,null,{"$f":"'Company Case'!G39","v":0},{"$f":"'Company Case'!H39","v":0},{"$f":"'Company Case'!I39","v":0},{"$f":"'Company Case'!J39","v":0},{"$f":"'Company Case'!K39","v":0},{"$f":"'Company Case'!L39","v":0},{"$f":"'Company Case'!M39","v":1600300},{"$f":"'Company Case'!N39","v":5200000},{"$f":"'Company Case'!O39","v":10192368.305084746},null,null,2]
[null,null,null,"Company Case appliances Revenue",null,null,null,null,null,null,null,null,null,{"$f":"N17","v":1600300},{"$f":"O17","v":5200000},{"$f":"P17","v":10192368.305084746},null,null,2]
[null,null,null,"Bank Base Case appliances Revenue",null,null,null,null,null,null,null,null,null,{"$f":"N17/2","v":800150},{"$f":"O17/2","v":2600000},{"$f":"P17/2","v":5096184.1525423732},null,null,2]
[null,null,null,"Bank Low Case appliances Revenue",null,null,null,null,null,null,null,null,null,null,{"$f":"N19","v":800150},{"$f":"O19","v":2600000},null,null,2]
[null,null,null,"No appliances Case Revenue",null,null,null,null,null,null,null,null,null,0,0,0,null,null,2]
[null,null,null,null,null,null,null,null,null,null,null,null,null,null,null,null,null,null,2]
[null,null,null,{"$f":"INDEX(D18:D21,Scenarios!$AA$12)","v":"Company Case appliances Revenue"},null,null,null,{"$f":"IF(H3,H17,INDEX(H18:H21,Scenarios!$AA$12))","v":0},{"$f":"IF(I3,I17,INDEX(I18:I21,Scenarios!$AA$12))","v":0},{"$f":"IF(J3,J17,INDEX(J18:J21,Scenarios!$AA$12))","v":0},{"$f":"IF(K3,K17,INDEX(K18:K21,Scenarios!$AA$12))","v":0},{"$f":"IF(L3,L17,INDEX(L18:L21,Scenarios!$AA$12))","v":0},{"$f":"IF(M3,M17,INDEX(M18:M21,Scenarios!$AA$12))","v":0},{"$f":"IF(N3,N17,INDEX(N18:N21,Scenarios!$AA$12))","v":1600300},{"$f":"IF(O3,O17,INDEX(O18:O21,Scenarios!$AA$12))","v":5200000},{"$f":"IF(P3,P17,INDEX(P18:P21,Scenarios!$AA$12))","v":10192368.305084746},null,true,3]
[null,null,null,null,null,null,null,null,null,null,null,null,null,null,null,null,null,null,3]
[null,"Home Power Systems - Cap Exp and Depreciation",null,null,null,null,null,null,null,null,null,null,null,null,null,null,null,null,3]
[null,null,null,"Solar Cap Exp Code",1,null,null,null,null,null,null,null,null,null,null,null,null,null,3]
[null,null,null,"Stock purchases solar",null,null,null,{"$f":"'Company Case'!G132","v":0},{"$f":"'Company Case'!H132","v":0},{"$f":"'Company Case'!I132","v":0},{"$f":"'Company Case'!J132","v":0},{"$f":"'Company Case'!K132","v":0},{"$f":"'Company Case'!L132","v":2000000},{"$f":"'Company Case'!M132","v":7000000},{"$f":"'Company Case'!N132","v":11000000},6068204.1869000001,null,null,3]
[null,null,null,"Maintenance solar",null,null,null,{"$f":"'Company Case'!G133","v":0},{"$f":"'Company Case'!H133","v":0},{"$f":"'Company Case'!I133","v":0},{"$f":"'Company Case'!J133","v":0},{"$f":"'Company Case'!K133","v":0},{"$f":"'Company Case'!L133","v":477414.83999999997},{"$f":"'Company Case'!M133","v":515524.09875},{"$f":"'Company Case'!N133","v":681038.46250000002},937075.50749999995,null,null,3]
[null,null,null,"Total Cap Exp Home Solar",null,null,null,{"$f":"SUM(H27:H28)","v":0},{"$f":"SUM(I27:I28)","v":0},{"$f":"-'Financial Statements'!E40","v":5000623},{"$f":"-'Financial Statements'!F40","v":2634493},5266084.1880125701,2477414.84,7515524.0987499999,11681038.4625,7005279.6944000004,null,null,3]
[null,null,null,null,null,null,null,null,null,null,null,null,null,null,null,null,null,null,3]
{"$rows_left_out":188}
{"sheet":"Forecast","index":3,"n_rows":210,"n_cols":18,"rows_kept":210,"cut":false,"hidden":false,"merged":[]}
["          ",null,"Months"]
[null,null,"Year",null,null,null,2015,2016,2017,2018,2019,2020,2021,2022,2023]
[null,null,"History",null,null,null,true,true,true,true,true,false,false,false,false]
[]
[null,"HISTORIC BALANCE SHEET"]
[null,null,"Fixed Assets:"]
[null,null,"Fixtures and Fittings",null,null,null,65740,61095,119788.60473372781,238363.86,271181.94]
[null,null,"Accumulated Depreciation F&F",null,null,null,0,0,0,-155852.74,-136214.48000000001]
[null,null,"HPA assets solar",null,null,null,0,1521823,5440117.6863905322,8785039.6999999993,8172272.75]
[null,null,"HPA assets accumulated depreciation solar",null,null,null,0,0,0,-807448.04,-1261794.3400000001]
[null,null,"HPA assets appliances",null,null,null,0,0,0,513328.97,999413.72]
[null,null,"HPA assets accumulated depreciation appliances",null,null,null,0,0,0,-935783.33,-1152506.8400000001]
[null,null,"Other Assets",null,null,null,{"$f":"'Company Case'!G13","v":607},{"$f":"'Company Case'!H13","v":514},{"$f":"'Company Case'!I13","v":424418.86306745559},{"$f":"'Company Case'!J13","v":500000},{"$f":"'Company Case'!K13","v":450000}]
[null,null,"Total Fixed Assets",null,null,null,{"$f":"SUM(G7:G13)","v":66347},{"$f":"SUM(H7:H13)","v":1583432},{"$f":"SUM(I7:I13)","v":5984325.1541917156},{"$f":"SUM(J7:J13)","v":8137648.4199999981},{"$f":"SUM(K7:K13)","v":7342352.75}]
[]
[null,null,"Current Assets:"]
[null,null,"Cash at Bank",null,null,null,{"$f":"'Company Case'!G17","v":40321},246913,808794,1293875.8,670780.36]
[null,null,"Inventory and Work in Progress solar",null,null,null,{"$f":"'Company Case'!G18","v":325634},3879248,2744031,1224016.8400000001,3656766.04]
[null,null,"Trade Receivables",null,null,null,{"$f":"'Company Case'!G19","v":1142515},431317,372006,500678.01,431947.52000000002]
[null,null,"Other Current Assets",null,null,null,{"$f":"'Company Case'!G20","v":55438},96026,158884.69704142027,153267.51999999979,805893.57999999961]
[null,null,"Total Current Assets",null,null,null,{"$f":"SUM(G17:G20)","v":1563908},{"$f":"SUM(H17:H20)","v":4653504},{"$f":"SUM(I17:I20)","v":4083715.6970414203},{"$f":"SUM(J17:J20)","v":3171838.17},{"$f":"SUM(K17:K20)","v":5565387.5}]
[null,null,"Total Assets",null,null,null,{"$f":"G21+G14","v":1630255},{"$f":"H21+H14","v":6236936},{"$f":"I21+I14","v":10068040.851233136},{"$f":"J21+J14","v":11309486.589999998},{"$f":"K21+K14","v":12907740.25}]
[]
[null,null,"Total Current Liabilities",null,null,null,58756,70899,162789.13254437869,2672584.5799999996,3733016.3299999991]
[null,null,"Intercompany Creditor Balances",null,null,null,2244298,7305778,5359545,7548455.6600000001,7006235.0199999986]
[null,null,"Loans",null,null,null,0,0,4522177.6366863903,910967.71,4268121.42]
[null,null,"Total Borrowings",null,null,null,0,0,0,2441646.77,7449789.75]
[null,null,"Shareholders' funds",null,null,null,-676006,-1139741,-400645.45078487648,-7836389.0599999996,-11777050.310000001]
[null,null,"AIMM Equity",null,null,null,0,0,0,5072220.95,1777628.05]
[null,null,"Total Liabilities and Capital",null,null,null,{"$f":"G24+G25+G27+G28+G26+G29","v":1627048},{"$f":"H24+H25+H27+H28+H26+H29","v":6236936},{"$f":"I24+I25+I27+I28+I26+I29","v":9643866.318445893},{"$f":"J24+J25+J27+J28+J26+J29","v":10809486.609999999},{"$f":"K24+K25+K27+K28+K26+K29","v":12457740.259999998}]
{"$rows_left_out":181}
{"sheet":"Analysis","index":4,"n_rows":2,"n_cols":9,"rows_kept":2,"cut":false,"hidden":false,"merged":[]}
["          "]
[null,null,null,null,null,null,null,null,{"$f":"'Assumptions and Working'!$F$208","v":13}]

{"sheet":"Scenarios","index":6,"n_rows":63,"n_cols":27,"rows_kept":63,"cut":false,"hidden":false,"merged":[]}
["          "]
[]
[null,null,null,"Code Number",null,1,null,null,null,null,null,null,null,null,null,null,null,null,null,null,null,null,null,null,"INDEX",null,"Reset or Combo"]
[null,null,null,null,null,"Company Case","Bank Base Case"," Bank Downside Case","Sensitivity Case",{"$f":"TRANSPOSE(D5:D11)&\" Company Case\"","v":"Solar Growth Company Case"},"Capital Expenditure Company Case","Solar COGS Company Case","SG&A Company Case","Overheads Company Case","Inventory Company Case","CL as % of Expense Company Case",{"$f":"TRANSPOSE(D5:D11)&H4","v":"Solar Growth Bank Downside Case"},"Capital Expenditure Bank Downside Case","Solar COGS Bank Downside Case","SG&A Bank Downside Case","Overheads Bank Downside Case","Inventory Bank Downside Case","CL as % of Expense Bank Downside Case",null,{"$f":"INDEX(F4:W4,$F$3)","v":"Company Case"},null,"Applied Case"]
[null,null,null,"Solar Growth",null,1,2,3,4,{"$f":"F5","v":1},2,2,2,2,2,2,{"$f":"H5","v":3},2,2,2,2,2,2,{"$f":"D5&\" Scenario\"","v":"Solar Growth Scenario"},{"$f":"INDEX(F5:W5,$F$3)","v":1},{"$f":"D5&\" Applied\"","v":"Solar Growth Applied"},1]
[null,null,null,"Capital Expenditure",null,1,2,3,4,2,{"$f":"F6","v":1},2,2,2,2,2,2,{"$f":"H6","v":3},2,2,2,2,2,{"$f":"D6&\" Scenario\"","v":"Capital Expenditure Scenario"},{"$f":"INDEX(F6:W6,$F$3)","v":1},{"$f":"D6&\" Applied\"","v":"Capital Expenditure Applied"},1]
[null,null,null,"Solar COGS",null,1,2,3,4,2,2,{"$f":"F7","v":1},2,2,2,2,2,2,{"$f":"H7","v":3},2,2,2,2,"Solar COGS Scenario",{"$f":"INDEX(F7:W7,$F$3)","v":1},"Solar COGS Applied",1]
[null,null,null,"SG&A",null,1,2,3,4,2,2,2,{"$f":"F8","v":1},2,2,2,2,2,2,{"$f":"H8","v":3},2,2,2,"SG&A Scenario",{"$f":"INDEX(F8:W8,$F$3)","v":1},"SG&A Applied",1]
[null,null,null,"Overheads",null,1,2,3,4,2,2,2,2,{"$f":"F9","v":1},2,2,2,2,2,2,{"$f":"H9","v":3},2,2,"Overheads Scenario",{"$f":"INDEX(F9:W9,$F$3)","v":1},"Overheads Applied",1]
[null,null,null,"Inventory",null,1,2,3,4,2,2,2,2,2,{"$f":"F10","v":1},2,2,2,2,2,2,{"$f":"H10","v":3},2,"Inventory Scenario",{"$f":"INDEX(F10:W10,$F$3)","v":1},"Inventory Applied",1]
[null,null,null,"CL as % of Expense",null,1,2,3,4,2,2,2,2,2,2,{"$f":"F11","v":1},2,2,2,2,2,2,{"$f":"H11","v":3},"CL as % of Expense Scenario",{"$f":"INDEX(F11:W11,$F$3)","v":1},"CL as % of Expense Applied",1]
[null,null,null,"Cooking Revenue",null,1,2,3,4,2,2,2,2,2,2,2,2,2,2,2,2,2,2,"Cooking Revenue Scenario",{"$f":"INDEX(F12:W12,$F$3)","v":1},"Cooking Revenue Applied",1]
[null,null,null,"Cooking Cap Exp",null,1,2,3,4,2,2,2,2,2,2,2,2,2,2,2,2,2,2,"Cooking Cap Exp Scenario",{"$f":"INDEX(F13:W13,$F$3)","v":1},"Cooking Cap Exp Applied",1]
[null,null,null,"Cooking COGS",null,1,2,3,4,2,2,2,2,2,2,2,2,2,2,2,2,2,2,"Cooking COGS Scenario",{"$f":"INDEX(F14:W14,$F$3)","v":1},"Cooking COGS Applied",1]
[null,null,null,null,null,1,2,3,4,5,6,7,8,9,10,11,12,13,14,15,16,17,18]
[null,null,null,"Debt to EBITDA",{"$f":"Forecast!O174","v":4.7005364173018451},4.9332605313452085,11.563820294008051,15,15,8.5060040127714451,10.606509308777294,10.77563939033122,9.6243488043198031,9.8323587299823103,10.767137950106322,12.862242962213706,13.379929304788009,12.374668703872334,14.220533250792673,15,14.925848832409885,12.004058036219968,11.745752534815916]
[null,null,null,"Debt to Capital",{"$f":"Forecast!O167","v":1.5472927363506148},1.6200792585669441,1.9193480169283341,2.6568439100745347,2.8874008906557651,1.5441038850133828,2.1010563823885944,1.8995721435306083,1.8777789304666432,1.883809360775214,2.0486413180526752,1.8430649846305887,2.1656273849327046,1.9538961918408326,1.9687470095149877,1.9896900651822542,1.996743510902613,1.8794300535467956,1.9067137795778382]
[null,null,null,"New Loan Balance",{"$f":"Forecast!O156","v":29375909.421516255},31542502.080803335,28075165.113057066,23598472.891201258,22715651.246010508,39358410.047445379,24780894.87248309,27653542.053986978,27232243.61159604,27359289.173542608,25333645.40086703,32543258.785381824,23631274.022138573,30865432.672337972,29111321.896017067,29513715.8804821,29764025.929893382,29590098.207235035,28701224.957705989]
[]
[null,null,null,"Code Number",1]
[null,null,null,{"$f":"INDEX(D16:D18,$E$20)","v":"Debt to EBITDA"},{"$f":"INDEX(E16:E18,$E$20)","v":4.7005364173018451},{"$f":"INDEX(F16:F18,$E$20)","v":4.9332605313452085},{"$f":"INDEX(G16:G18,$E$20)","v":11.563820294008051},{"$f":"INDEX(H16:H18,$E$20)","v":15},{"$f":"INDEX(I16:I18,$E$20)","v":15},{"$f":"INDEX(J16:J18,$E$20)","v":8.5060040127714451},{"$f":"INDEX(K16:K18,$E$20)","v":10.606509308777294},{"$f":"INDEX(L16:L18,$E$20)","v":10.77563939033122},{"$f":"INDEX(M16:M18,$E$20)","v":9.6243488043198031},{"$f":"INDEX(N16:N18,$E$20)","v":9.8323587299823103},{"$f":"INDEX(O16:O18,$E$20)","v":10.767137950106322},{"$f":"INDEX(P16:P18,$E$20)","v":12.862242962213706},{"$f":"INDEX(Q16:Q18,$E$20)","v":13.379929304788009},{"$f":"INDEX(R16:R18,$E$20)","v":12.374668703872334},{"$f":"INDEX(S16:S18,$E$20)","v":14.220533250792673},{"$f":"INDEX(T16:T18,$E$20)","v":15},{"$f":"INDEX(U16:U18,$E$20)","v":14.925848832409885},{"$f":"INDEX(V16:V18,$E$20)","v":12.004058036219968},{"$f":"INDEX(W16:W18,$E$20)","v":11.745752534815916}]
[]
[null,null,null,null,{"$f":"TRANSPOSE(D5:D10)","v":"Solar Growth"},"Capital Expenditure","Solar COGS","SG&A","Overheads","Inventory",{"$error":"#N/A"}]
[null,null,null,"Company vs Base",{"$f":"J21-$G$21","v":-3.0578162812366063},{"$f":"K21-$G$21","v":-0.95731098523075708},-0.78818090367683169,-1.9394714896882483,-1.7314615640257411,-0.79668234390172898]
[null,null,null,"Downside vs Base",{"$f":"Q21-$G$21","v":1.8161090107799573},{"$f":"R21-$G$21","v":0.81084840986428297},2.6567129567846219,3.4361797059919486,3.3620285384018338,0.44023774221191658]
[null,null,null,"Absolute Value",{"$f":"ABS(E24)+ABS(E25)","v":4.8739252920165637},{"$f":"ABS(F24)+ABS(F25)","v":1.7681593950950401},3.4448938604614536,5.3756511956801969,5.0934901024275749,1.2369200861136456]
[]
[null,null,null,null,1,2,3,4,5,6]
[null,null,null,{"$f":"D26","v":"Absolute Value"},{"$f":"SMALL($E$26:$J$26,E28)","v":1.2369200861136456},{"$f":"SMALL($E$26:$J$26,F28)","v":1.7681593950950401},3.4448938604614536,4.8739252920165637,5.0934901024275749,5.3756511956801969]
[]
{"$rows_left_out":34}
{"sheet":"Financial Statements","index":7,"n_rows":316,"n_cols":10,"rows_kept":316,"cut":false,"hidden":false,"merged":[]}
["          ","          "]
[null,null,null,null,2017,2018,null,{"$f":"E2","v":2017},{"$f":"F2","v":2018}]
[null,null,null,"FRW’ FRW’"]
[null,null,null,"Revenue",2010420,3791188,null,{"$f":"H68*H57/1000","v":1663019.3067753518},{"$f":"I68*I57/1000","v":2799031.7612447678}]
[null,null,null,"Cost of sales",-1172423,-3195429,null,{"$f":"H57*H81/1000","v":-1195697.3910713992},{"$f":"I57*I81/1000","v":-3010631.1163539235}]
[null,null,null,"Gross profit",837997,595759,null,{"$f":"H4+H5","v":467321.91570395255},{"$f":"I4+I5","v":-211599.35510915564}]
[null,null,null,"Other income",512589,32477]
[null,null,null,"Personnel expenses",-974499,-908574]
[null,null,null,"Depreciation expenses",-53865,-53181]
[null,null,null,"Administrative expenses",-1381638,-2546319]
[null,null,null,"Operating expenses",-192660,-211123,null,{"$f":"H57*H123/1000","v":-1354561.0403322605},{"$f":"I57*I123/1000","v":-2504424.5109365741}]
[null,null,null,"Results from operating activities",-1252076,-3090961,null,{"$f":"H6+H11","v":-887239.124628308},{"$f":"I6+I11","v":-2716023.8660457297}]
[null,null,null,"Net finance costs",-352574,-875160]
[null,null,null,"Loss before income tax",-1604650,-3966121]
[null,null,null,"Income tax charge",-751414,-667023]
[null,null,null,"Loss for the year",-2356064,-4633144]
[null,null,null,"Other comprehensive income",0,0]
[null,null,null,"Total comprehensive loss",-2356064,-4633144,null,{"$f":"H137*H57/1000","v":-311104.61133767245},{"$f":"I137*I57/1000","v":-4581812.434522165}]
[]
[null,null,null,"EBITDA",{"$f":"E12+E27+E28+E29+E30","v":-657053},{"$f":"F12+F27+F28+F29+F30","v":-2141296},null,{"$f":"H114*H57/1000","v":-431396.18680202571},{"$f":"I114*I57/1000","v":-1883412.1506516035}]
[]
[]
[null,null,null,"FRW' FRW'"]
[null,null,null,"Operating activities"]
[null,null,null,"Loss for the year before tax",-1604650,-3966121]
[null,null,null,"Adjustments for:"]
[null,null,null,"Depreciation",51886,53181]
[null,null,null,"Amortisation",1979,86]
[null,null,null,"Depreciation for operating lease assets",536932,896398,null,{"$f":"H118*H57/1000","v":-439901.04171903199},{"$f":"I118*I57/1000","v":-779399.52549229155}]
[null,null,null,"PPE write offs",4226,0]
{"$rows_left_out":287}
{"sheet":"Simple Example","index":8,"n_rows":23,"n_cols":17,"rows_kept":23,"cut":false,"hidden":false,"merged":[]}
["          "]
[]
[]
[null,null,null,null,1,2,3,4,5,6,7,8,9,10]
[null,null,"EBIDTA",null,100,120,130,220,{"$f":"H5","v":220},220,220,220,220,220]
[null,null,"CAPEX",null,300,200,200,100,100,100,100,100,100,100]
[null,null,"Interest",null,{"$f":"E15","v":0},{"$f":"F15","v":20},30,40,32,23.200000000000003,13.52,2.8719999999999986,0,0]
[null,null,"Net Cashflow",null,{"$f":"E5-E6-E7","v":-200},{"$f":"F5-F6-F7","v":-100},-100,80,88,96.8,106.48,117.128,120,120]
[]
[null,null,"Loan balance"]
[null,null,"Opening Balance",null,{"$f":"D14","v":0},{"$f":"E14","v":200},300,400,320,232,135.19999999999999,28.719999999999985,0,0]
[null,null,"Add borrowings",null,{"$f":"MAX(-E8,0)","v":200},{"$f":"MAX(-F8,0)","v":100},100,0,0,0,0,0,0,0]
[null,null,"Less repayments",null,{"$f":"MIN(E11,MAX(E8,0))","v":0},{"$f":"MIN(F11,MAX(F8,0))","v":0},0,80,88,96.8,106.48,28.719999999999985,0,0]
[null,null,"Closing balance",null,{"$f":"E11+E12-E13","v":200},{"$f":"F11+F12-F13","v":300},400,320,232,135.19999999999999,28.719999999999985,0,0,0]
[null,null,"Interest",0.1,{"$f":"$D$15*E11","v":0},{"$f":"$D$15*F11","v":20},30,40,32,23.200000000000003,13.52,2.8719999999999986,0,0]
[]
[null,null,"Debt to EBIDTA"]
[null,null,"EBIDTA to interest"]
[null,null,null,null,null,null,null,null,null,null,{"$f":"E20","v":8},220,250,300,350,400,450]
[null,null,"Repayment Year",null,{"$f":"MATCH(0,E14:N14,0)","v":8},null,null,null,null,null,120,9,7,6,6,5,5]
[null,null,null,null,null,null,null,null,null,null,100,8,7,6,5,5,5]
[null,null,null,null,null,null,null,null,null,null,80,7,6,6,5,5,5]
[null,null,null,null,null,null,null,null,null,null,60,7,6,5,5,5,5]