{"text_format":"1","workbook":"xlsx","n_sheets":27,"sheets":["Football Field Diagram","Synergy Value and Premium","Accretion and Dilution","Simple PE Formula","PE Ratio Changing Drivers","EV to EBITDA","Simple Industrial","Simple Bank","Graph of Assumptions and ROE","MB Regression","Amazon Assumptions","Amazon Model","Amazon Summary","Amazon DCF","Sensitivity and Presentation","Tornado Diagram","Forecast and Actual","L&G","AMZN","S&P 500","Inflation and PE","Simple Circular Reference","Aflac Financials","Reserve Example Zero NPV","Reserve Example Pos NPV","Simple Insurance","Aflac DCF"],"not_rendered":{"charts":18,"images":6,"macros":1,"external_links":1,"defined_names":77,"comments":13,"pivot_tables":0},"unopened":[{"sheet":"Tornado Diagram","index":15,"reason":"not_a_worksheet"}],"bounds":{"document_bytes":16777216,"sheet_cells":100000,"rows_first":2000,"rows_last":500,"rows_between":2000,"halvings":0,"cell_chars":16384,"cell_head_chars":4096},"cells_cut":0,"cells_raw":0,"read":"whole","date_system":"1900"}

{"sheet":"Football Field Diagram","index":0,"n_rows":119,"n_cols":19,"rows_kept":119,"cut":false,"hidden":false,"merged":[]}
[]
[null,"Current Stock Price",null,null,111.19]
[]
[null,null,null,null,null,null,null,null,null,"Shares",null,1510000]
[null,null,null,null,"Low","High","Offer"]
[null,"P/E Multiple - Public",null,null,{"$f":"L6*R6","v":108.97},{"$f":"S6*L6","v":134.61000000000001},137,null,null,"Current EPS",null,6.41,null,null,null,null,"PE Range",17,21]
[null,"EV/EBITDA Multiple - Public",null,null,{"$f":"(R7*$L$7-$N$7)/$L$4","v":96.466821192052976},{"$f":"(S7*$L$7-$N$7)/$L$4","v":129.78470198675495},137,null,null,"EBITDA",null,16770000,"Net Debt",22035100,null,null,"EV/EBITDA",10,13]
[null,"P/B Multiple - Public",null,null,{"$f":"L8*R8","v":81.72},{"$f":"L8*S8","v":136.19999999999999},137,null,null,"Book Value/Share",null,27.24,null,null,null,null,"M/B Range",3,5]
{"$rows_left_out":112}
{"sheet":"Synergy Value and Premium","index":1,"n_rows":60,"n_cols":11,"rows_kept":60,"cut":false,"hidden":false,"merged":[]}
[]
[]
[]
["Assumptions from Presentation"]
[]
[null,null,null,"Operation and Maintenance",4289]
[null,null,null,"Maintenance and Other",950]
[null,null,null,"General and Administrative",309]
{"$rows_left_out":53}
{"sheet":"Accretion and Dilution","index":2,"n_rows":51,"n_cols":10,"rows_kept":51,"cut":false,"hidden":false,"merged":[]}
[null,null,null,null,null,null,false]
["Google buys Apple"]
[null,null,null,null,"Target","Acquiror"]
[null,null,null,null,"Apple","Google"]
[null,"Price per Share"]
[null,"Shares"]
[]
[]
{"$rows_left_out":44}
{"sheet":"Simple PE Formula","index":3,"n_rows":48,"n_cols":319,"rows_kept":48,"cut":false,"hidden":false,"merged":[]}
[]
["Drivers",null,null,null,null,null,null,"If no net debt, ROIC and ROE are the same"]
[null,"Rate of Return",null,null,0.15,"ROE",null,"If no net debt, k and WACC are the same",null,null,null,null,"value = cf1/(k-g)",null,null,null,null,"g = ROE * (1-dpo)"]
[null,"Cost of Capital",null,null,0.08,"K",null,null,null,null,null,null,"value = cf0 * (1+g)/(k-g)",null,null,null,null,"g/roe = 1- dpo"]
[null,"Growth",null,null,0.05,"G",null,"Value Formula",null,null,null,null,"Compute P/E",null,null,null,null,"dpo = 1- g/roe"]
[null,"Payout",null,null,{"$f":"1-G/ROE","v":0.66666666666666663},"Payout",null,"Earnings Multiple (P/E or EV/NOPAT)",null,null,null,null,null,null,null,null,"Value = E x (1-g/ROE)/(k-g)"]
[null,"Investment Balance (Book Value)",null,null,27.24,null,null,"Value to Investment (P/B or EV/Invested Capital)",null,null,null,null,null,"Value = Div1/(k-g)",null,"or","P/E = (1-g/ROE)/(k-g)"]
[]
{"$rows_left_out":41}
{"sheet":"PE Ratio Changing Drivers","index":4,"n_rows":55,"n_cols":89,"rows_kept":55,"cut":false,"hidden":false,"merged":[]}
[]
[null,null,null,null,"Use INDEX and LOOKUP"]
[null,null,null,null,"Copy INTERPOLATE"]
[]
["Drivers",null,null,null,null,null,"Earnings Multiple",null,{"$f":"F42","v":0}]
[null,"Rate of Return",null,null,null,2018,2019,2020,2025,2030]
[null,null,"Base",null,null,0.22,0.24,0.25,0.23,0.2]
[null,null,"High",null,null,0.15,0.18,0.24,0.25,0.27]
{"$rows_left_out":48}
{"sheet":"EV to EBITDA","index":5,"n_rows":59,"n_cols":207,"rows_kept":59,"cut":false,"hidden":false,"merged":[]}
[]
["EV/EBITDA Ratio Drivers"]
[null,"ROIC",null,null,0.11]
[null,"Growth",null,null,0.03,null,"EV/EBITDA",{"$f":"G37","v":0}]
[null,"WACC",null,null,7.0000000000000007E-2,null,"EV/EBIT",{"$f":"G38","v":0}]
[null,"Plant Life",null,null,10,null,"EV/NOPAT",{"$f":"G39","v":0}]
[null,"Gross Depreciation Rate",null,null,{"$f":"1/E6","v":0.1}]
[null,"Net Depreciation Rate",null,null,{"$f":"LOOKUP(E6+1,41:41,58:58)","v":0},null,"For same investment, need more cap exp"]
{"$rows_left_out":52}
{"sheet":"Simple Industrial","index":6,"n_rows":87,"n_cols":15,"rows_kept":87,"cut":false,"hidden":false,"merged":[]}
[]
[null,null,null,null,null,2012,2013,2014,2015,2016,2017,2018,2019,2020,2021]
[null,"Last Historic Year",null,null,2017,{"$f":"F2<=$E$3","v":true},{"$f":"G2<=$E$3","v":true},true,true,true,true,false,false,false,false]
[]
["Balance Sheet"]
[null,"Cash",null,null,null,20,60,40,80,90,100]
[null,"PP&E",null,null,null,1000,1100,1300,1320,1370,1400]
[]
{"$rows_left_out":80}
{"sheet":"Simple Bank","index":7,"n_rows":94,"n_cols":18,"rows_kept":94,"cut":false,"hidden":false,"merged":[]}
[]
[null,null,null,null,null,2012,2013,2014,2015,2016,2017,2018,2019,2020,2021]
[null,"Last Historic Year",null,null,2017,{"$f":"F2<=$E$3","v":true},{"$f":"G2<=$E$3","v":true},true,true,true,true,false,false,false,false]
[]
["Historic Financial"]
[null,"Balance Sheet"]
[null,null,"Other Cash Investments",null,null,20,40,30,40,40,40]
[null,null,"Loans",null,null,900,1000,1050,1100,1150,1200]
{"$rows_left_out":87}
{"sheet":"Graph of Assumptions and ROE","index":8,"n_rows":7,"n_cols":18,"rows_kept":7,"cut":false,"hidden":false,"merged":[]}
[]
[null,null,"Start",{"$f":"ROW('Aflac Financials'!111:111)","v":111}]
[null,null,"End",{"$f":"ROW('Aflac Financials'!R141)","v":141}]
[]
[null,null,"Row",111]
[]
[null,null,null,null,null,null,{"$f":"'Aflac Financials'!H7","v":2012},{"$f":"'Aflac Financials'!I7","v":2013},{"$f":"'Aflac Financials'!J7","v":2014},{"$f":"'Aflac Financials'!K7","v":2015},{"$f":"'Aflac Financials'!L7","v":2016},{"$f":"'Aflac Financials'!M7","v":2017},{"$f":"'Aflac Financials'!N7","v":2018},{"$f":"'Aflac Financials'!O7","v":2019},{"$f":"'Aflac Financials'!P7","v":2020},{"$f":"'Aflac Financials'!Q7","v":2021},{"$f":"'Aflac Financials'!R7","v":2022},{"$f":"'Aflac Financials'!S7","v":2023}]

{"sheet":"MB Regression","index":9,"n_rows":17,"n_cols":7,"rows_kept":17,"cut":false,"hidden":false,"merged":[]}
[null,null,null,"P/B Ratio"]
[null,null,null,null,"ROE"]
[null,"L&G",null,2.12,0.20106557377049183,null,"B"]
[null,"Met Life",null,0.88,9.1094999070459204E-2,null,"A"]
[null,"AIG",null,0.85,6.9957826841974685E-2]
[null,"Prudential",null,0.97,0.10227655986509276]
[null,"Genworth",null,0.15,3.8182512409316534E-2]
[null,"Greatwest Lifeco",null,1.78,0.1536144578313253]
{"$rows_left_out":10}
{"sheet":"Amazon Assumptions","index":10,"n_rows":97,"n_cols":29,"rows_kept":97,"cut":false,"hidden":false,"merged":[]}
[null,null,null,null,{"$f":"'Amazon DCF'!E72","v":{"$error":"#VALUE!"}}]
[null,"Year",null,null,null,null,null,null,{"$f":"'Amazon Model'!H13","v":2012},{"$f":"'Amazon Model'!I13","v":2013},{"$f":"'Amazon Model'!J13","v":2014},{"$f":"'Amazon Model'!K13","v":2015},{"$f":"'Amazon Model'!L13","v":2016},{"$f":"'Amazon Model'!M13","v":2017},{"$f":"N2+1","v":2018},{"$f":"O2+1","v":2019},2020,2021,2022,2023,2024,2025,2026,2027,2028,2029,2030,2031,2032]
[null,"History with Current Year",null,null,2017,null,null,null,{"$f":"I2<=$E$3","v":true},{"$f":"J2<=$E$3","v":true},true,true,true,true,false,false,false,false,false,false,false,false,false,false,false,false,false,false,false]
[null,"History without Current Year",null,null,{"$f":"'Amazon Model'!F5","v":2016},null,null,null,{"$f":"I2<=$E$4","v":true},{"$f":"J2<=$E$4","v":true},true,true,true,false,false,false,false,false,false,false,false,false,false,false,false,false,false,false,false]
[]
[]
["Analysis",null,null,null,"Time Series","Code"]
[null,"Operations and EBITDA"]
{"$rows_left_out":90}
{"sheet":"Amazon Model","index":11,"n_rows":341,"n_cols":28,"rows_kept":341,"cut":false,"hidden":false,"merged":[]}
[null,null,null,2,"Jan Start",{"$f":"F2=1","v":true}]
[null,{"$f":"INDEX(INDIRECT(#REF!&\"A:A\"),MATCH(C10,INDIRECT(#REF!&\"A:A\"),0)+1)","v":{"$error":"#REF!"}},null,null,"First Month",1,null,{"$f":"DATE(F3,$F$2,1)","v":"2012-01-01"},{"$f":"H3+1","v":"2013-01-01"},{"$f":"I3+1","v":"2014-01-01"},{"$f":"J3+1","v":"2015-01-01"},{"$f":"K3+1","v":"2016-01-01"},{"$f":"L3+1","v":"2017-01-01"},{"$f":"M3+1","v":"2018-01-01"},"2019-01-01","2020-01-01","2021-01-01","2022-01-01","2023-01-01","2024-01-01","2025-01-01","2026-01-01","2027-01-01","2028-01-01","2029-01-01","2030-01-01","2031-01-01","2032-01-01"]
[null,"Last Annual Date",null,null,"First Year",{"$f":"IF(F1,H13,H13-1)","v":2012},null,{"$f":"EOMONTH(H2,11)","v":"2012-12-31"},"2013-12-31","2014-12-31","2015-12-31","2016-12-31","2017-12-31","2018-12-31","2019-12-31","2020-12-31","2021-12-31","2022-12-31","2023-12-31","2024-12-31","2025-12-31","2026-12-31","2027-12-31","2028-12-31","2029-12-31","2030-12-31","2031-12-31","2032-12-31"]
[null,null,null,null,null,null,null,{"$f":"YEAR(H3)","v":2012},{"$f":"YEAR(I3)","v":2013},2014,2015,2016,2017,2018,2019,2020,2021,2022,2023,2024,2025,2026,2027,2028,2029,2030,2031,2032]
[null,null,"Histoic Year",null,"Last Year",{"$f":"IF(F1,L13,L13-1)","v":2016},null,{"$f":"H3<=$F$6","v":true},true,true,true,true,false,false,false,false,false,false,false,false,false,false,false,false,false,false,false,false]
[null,null,"Partial Historic Year",null,null,{"$f":"DATE(F5+1,F2,1)-1","v":"2016-12-31"},null,{"$f":"YEAR(H3)=$F$7","v":false},false,false,false,false,true,false,false,false,false,false,false,false,false,false,false,false,false,false,false,false]
[null,null,"Assumption Year",null,"Annual Row",{"$f":"F5+1","v":2017},null,{"$f":"OR(H5:H6)","v":true},true,true,true,true,true,false,false,false,false,false,false,false,false,false,false,false,false,false,false,false]
[]
{"$rows_left_out":334}
{"sheet":"Amazon Summary","index":12,"n_rows":4,"n_cols":3,"rows_kept":4,"cut":false,"hidden":false,"merged":[]}
[]
[null,null,"WACC"]
[null,null,"Terminal Growth"]
[null,null,"Terminal EV/EBITDA"]

{"sheet":"Amazon DCF","index":13,"n_rows":121,"n_cols":16384,"rows_kept":121,"cut":false,"hidden":false,"merged":[]}
["Timing"]
[null,"Period",null,null,{"$f":"E72","v":{"$error":"#VALUE!"}},null,null,1,2,3,4,5,6,7,8,9,10,11,12,13,14,15,16,17,18,19,20]
[null,"Year",null,null,null,null,null,{"$f":"E9","v":2018},{"$f":"H3+1","v":2019},{"$f":"I3+1","v":2020},2021,2022,2023,2024,2025,2026,2027,2028,2029,2030,2031,2032,2033,2034,2035,2036,2037]
[null,"Holding Period",null,null,null,{"$f":"E9","v":2018},{"$f":"E10","v":2030}]
[null,"Exit Period",null,null,null,null,{"$f":"E10","v":2030}]
[null,null,null,null,null,null,"Growth Method",null,{"$f":"E2","v":{"$error":"#VALUE!"}}]
[null,null,null,null,null,null,"EV/EBITDA Method",null,{"$f":"E82","v":{"$error":"#VALUE!"}}]
["Value Assumptions"]
{"$rows_left_out":114}
{"sheet":"Sensitivity and Presentation","index":14,"n_rows":39,"n_cols":22,"rows_kept":39,"cut":false,"hidden":false,"merged":[]}
[null,null,null,"Scenario Number",null,1]
[null,null,null,null,null,null,null,{"$f":"'Amazon DCF'!E82","v":{"$error":"#VALUE!"}}]
[]
[null,null,null,"WACC"]
[null,null,null,"Terminal Growth"]
[null,null,null,"Explicit Period"]
[null,null,null,"Terminal EV/EBITDA"]
[null,null,null,null,null,null,null,null,null,null,null,null,null,null,null,null,null,null,null,null,null,"Value Driver"]
{"$rows_left_out":32}
{"sheet":"Forecast and Actual","index":16,"n_rows":13,"n_cols":16,"rows_kept":13,"cut":false,"hidden":false,"merged":[]}
[]
[]
[null,"Row Number",null,null,null,10]
[]
[]
[null,"Year",null,null,null,{"$f":"'Amazon Assumptions'!I2","v":2012},{"$f":"'Amazon Assumptions'!J2","v":2013},{"$f":"'Amazon Assumptions'!K2","v":2014},{"$f":"'Amazon Assumptions'!L2","v":2015},{"$f":"'Amazon Assumptions'!M2","v":2016},{"$f":"'Amazon Assumptions'!N2","v":2017},{"$f":"'Amazon Assumptions'!O2","v":2018},{"$f":"'Amazon Assumptions'!P2","v":2019},{"$f":"'Amazon Assumptions'!Q2","v":2020},{"$f":"'Amazon Assumptions'!R2","v":2021},{"$f":"'Amazon Assumptions'!S2","v":2022}]
[null,"Historic Year",null,null,null,{"$f":"'Amazon Assumptions'!I4","v":true},{"$f":"'Amazon Assumptions'!J4","v":true},{"$f":"'Amazon Assumptions'!K4","v":true},{"$f":"'Amazon Assumptions'!L4","v":true},{"$f":"'Amazon Assumptions'!M4","v":true},{"$f":"'Amazon Assumptions'!N4","v":false},{"$f":"'Amazon Assumptions'!O4","v":false},{"$f":"'Amazon Assumptions'!P4","v":false},{"$f":"'Amazon Assumptions'!Q4","v":false},{"$f":"'Amazon Assumptions'!R4","v":false},{"$f":"'Amazon Assumptions'!S4","v":false}]
[null,null,null,null,null,{"$f":"F6","v":2012},{"$f":"G6","v":2013},2014,2015,2016,2017,2018,2019,2020,2021,2022]
{"$rows_left_out":6}
{"sheet":"L&G","index":17,"n_rows":0,"n_cols":0,"rows_kept":0,"cut":false,"hidden":false,"merged":[]}

{"sheet":"AMZN","index":18,"n_rows":250,"n_cols":7,"rows_kept":250,"cut":false,"hidden":false,"merged":[]}
["Date","Open","High","Low","Close","Adj Close","Volume"]
["1997-05-01",2.4375,2.5,1.3125,1.5,1.5,256516800]
["1997-06-01",1.5104169999999999,1.7083330000000001,1.375,1.5416669999999999,1.5416669999999999,53163600]
["1997-07-01",1.5416669999999999,2.5729169999999999,1.5104169999999999,2.3958330000000001,2.3958330000000001,108614400]
["1997-08-01",2.34375,2.4166669999999999,1.9375,2.3385419999999999,2.3385419999999999,31906800]
["1997-09-01",2.34375,4.8125,2.3125,4.3385420000000003,4.3385420000000003,107862000]
["1997-10-01",4.4375,5.5,3.5208330000000001,5.0833329999999997,5.0833329999999997,105187200]
["1997-11-01",5.21875,5.21875,3.6666669999999999,4.125,4.125,67797600]
{"$rows_left_out":243}
{"sheet":"S&P 500","index":19,"n_rows":818,"n_cols":7,"rows_kept":818,"cut":false,"hidden":false,"merged":[]}
["Date","Open","High","Low","Close","Adj Close","Volume"]
["1950-01-01",16.66,17.09,16.649999999999999,17.049999,17.049999,42570000]
["1950-02-01",17.049999,17.350000000000001,16.989999999999998,17.219999000000001,17.219999000000001,33430000]
["1950-03-01",17.239999999999998,17.610001,17.07,17.290001,17.290001,40410000]
["1950-04-01",17.34,18.07,17.34,18.07,18.07,48250000]
["1950-05-01",18.219999000000001,18.780000999999999,18.110001,18.780000999999999,18.780000999999999,45080000]
["1950-06-01",18.77,19.399999999999999,17.440000999999999,17.690000999999999,17.690000999999999,45660000]
["1950-07-01",17.639999,17.91,16.68,17.84,17.84,44570000]
{"$rows_left_out":811}
{"sheet":"Inflation and PE","index":20,"n_rows":125,"n_cols":206,"rows_kept":125,"cut":false,"hidden":false,"merged":[]}
[null,null,null,null,null,null,null,null,null,null,null,null,null,null,null,null,null,null,null,null,3]
["Drivers",null,null,null,"Nominal","Real",null,"Begin with Nominal P/E",null,null,32.47,null,null,null,null,null,null,null,null,null,"http://www.wsj.com/mdc/public/page/2_3021-peyield.html?mod=topnav_2_3002"]
[null,"Inflation Rate",null,null,0.03,0,null,"Assumed ROE",null,null,{"$f":"E4","v":0.15},null,null,null,null,null,null,null,null,null,"https://ycharts.com/indicators/sp_500_pe_ratio"]
[null,"Rate of Return",null,null,0.15,{"$f":"(1+E4)/(1+E3)-1","v":0.11650485436893199},null,"Assumed BV",null,null,200,null,null,null,null,null,null,null,null,null,"https://ycharts.com/indicators/pe10"]
[null,"Cost of Capital",null,null,6.6211594473151628E-2,{"$f":"(1+E5)/(1+$E$3)-1","v":3.5156887838011297E-2},null,"Earnings",null,null,{"$f":"K3*K4","v":30},null,null,null,null,null,null,null,null,null,"http://www.multpl.com/shiller-pe/table"]
[null,"Growth",null,null,4.4999999999999998E-2,{"$f":"(1+E6)/(1+$E$3)-1","v":1.4563106796116498E-2},null,"Price",null,null,{"$f":"K5*K2","v":974.09999999999991}]
[null,"Payout",null,null,{"$f":"(1-E6/E4)","v":0.7},{"$f":"(1-F6/F4)","v":0.875},null,null,null,null,null,null,null,null,null,null,null,null,null,null,{"$f":"INDEX(U2:U5,U1)","v":"https://ycharts.com/indicators/pe10"}]
[null,"Investment Balance (Book Value)",null,null,27.24,{"$f":"E8","v":27.24},null,"Real Earnings",null,null,{"$f":"K5/(1+E3)","v":29.126213592233007}]
{"$rows_left_out":118}
{"sheet":"Simple Circular Reference","index":21,"n_rows":19,"n_cols":9,"rows_kept":19,"cut":false,"hidden":false,"merged":[]}
[]
[null,null,"Time",null,0,1,2,3,4]
[]
[null,null,"Net Debt"]
[null,null,null,"Opening Balance",null,{"$f":"E7","v":1000},{"$f":"F7","v":989.74358974358972},{"$f":"G7","v":958.44838921761993},{"$f":"H7","v":971.7021527672415}]
[null,null,null,"Less: Cash Flow",null,{"$f":"F19","v":10.256410256410255},{"$f":"G19","v":31.295200525969761},{"$f":"H19","v":-13.253763549621539},{"$f":"I19","v":52.733222935013259}]
[null,null,null,"Closing Balance",1000,{"$f":"F5-F6","v":989.74358974358972},{"$f":"G5-G6","v":958.44838921761993},{"$f":"H5-H6","v":971.7021527672415},{"$f":"I5-I6","v":918.96892983222824}]
[null,null,null,"Interest Rate",null,0.05,0.05,0.05,0.05]
{"$rows_left_out":12}
{"sheet":"Aflac Financials","index":22,"n_rows":279,"n_cols":23,"rows_kept":279,"cut":false,"hidden":false,"merged":[]}
[null,null,null,null,"Jan Start",true]
[null,{"$error":"#REF!"},null,null,"First Month",1,null,"2012-01-01","2013-01-01","2014-01-01","2015-01-01","2016-01-01","2017-01-01",{"$f":"M3+1","v":"2018-01-01"},{"$f":"N3+1","v":"2019-01-01"},"2020-01-01","2021-01-01","2022-01-01","2023-01-01","2024-01-01","2025-01-01","2026-01-01","2027-01-01"]
[null,"Last Annual Date",null,null,"First Year",2012,null,"2012-12-31","2013-12-31","2014-12-31","2015-12-31","2016-12-31","2017-12-31",{"$f":"EDATE(N2,12)-1","v":"2018-12-31"},{"$f":"EDATE(O2,12)-1","v":"2019-12-31"},"2020-12-31","2021-12-31","2022-12-31","2023-12-31","2024-12-31","2025-12-31","2026-12-31","2027-12-31"]
[null,null,"Histoic Year",null,"Last Year",2016,null,true,true,true,true,true,false]
[null,null,"Partial Historic Year",null,null,"2016-12-31",null,false,false,false,false,false,true]
[null,null,"Assumption Year",null,"Annual Row",2017,null,true,true,true,true,true,true]
["Profit and Loss",null,null,null,null,null,null,{"$f":"YEAR(H3)","v":2012},{"$f":"YEAR(I3)","v":2013},2014,2015,2016,2017,2018,2019,2020,2021,2022,2023,2024,2025,2026,2027]
[null,null,"View Ratios"]
{"$rows_left_out":272}
{"sheet":"Reserve Example Zero NPV","index":23,"n_rows":91,"n_cols":16,"rows_kept":91,"cut":false,"hidden":false,"merged":[]}
[]
["Inputs"]
[null,"Discount Rate",null,null,null,0.05]
[null,"Year of Claim (Middle)",null,null,null,0,9,{"$f":"G4+1","v":10}]
[null,"Cash Outflow for Claim",null,null,null,0,5000,0]
[]
[null,"Interest Rate",null,null,null,{"$f":"F3","v":0.05},null,null,null,null,null,null,{"$f":"F20","v":0}]
[null,"Premiums",null,null,null,null,null,null,null,null,null,null,{"$f":"F18","v":3223.0445810889855},{"$f":"M7-M8","v":-3223.0445810889855}]
{"$rows_left_out":84}
{"sheet":"Reserve Example Pos NPV","index":24,"n_rows":85,"n_cols":16,"rows_kept":85,"cut":false,"hidden":false,"merged":[]}
[]
["Inputs"]
[null,"Discount Rate",null,null,null,0.05]
[null,"Year of Claim (Middle)",null,null,null,0,9,{"$f":"G4+1","v":10}]
[null,"Cash Outflow for Claim",null,null,null,0,5000,0]
[]
[null,"Interest Rate",null,null,null,{"$f":"F3","v":0.05},null,{"$f":"F19","v":3255.2750268998752},null,null,null,null,1]
[null,"Premiums",null,null,null,453.45039987893898,null,{"$f":"F17","v":3223.0445810889855},{"$f":"H7-H8","v":32.230445810889705}]
{"$rows_left_out":78}
{"sheet":"Simple Insurance","index":25,"n_rows":101,"n_cols":18,"rows_kept":101,"cut":false,"hidden":false,"merged":[]}
[null,null,null,"Premium Increase",{"$f":"E27","v":65}]
[null,null,null,null,null,2012,2013,2014,2015,2016,2017,2018,2019,2020,2021]
[null,"Last Historic Year",null,null,2017,{"$f":"F2<=$E$3","v":true},{"$f":"G2<=$E$3","v":true},true,true,true,true,false,false,false,false]
[]
["Historic Financial"]
[null,"Balance Sheet"]
[null,null,"Other Cash Investments",null,null,20,40,30,40,40,40]
[null,null,"Investments",null,null,900,1000,1050,1100,1150,1200]
{"$rows_left_out":94}
{"sheet":"Aflac DCF","index":26,"n_rows":96,"n_cols":27,"rows_kept":96,"cut":false,"hidden":false,"merged":[]}
["Timing"]
[null,"Period",null,null,null,null,null,1,2,3,4,5,6,7,8,9,10,11,12,13,14,15,16,17,18,19,20]
[null,"Year",null,null,null,null,null,{"$f":"E9","v":2018},{"$f":"H3+1","v":2019},{"$f":"I3+1","v":2020},2021,2022,2023,2024,2025,2026,2027,2028,2029,2030,2031,2032,2033,2034,2035,2036,2037]
[null,"Holding Period",null,null,null,{"$f":"E9","v":2018},{"$f":"E10","v":2022},{"$f":"H3<=$G$4","v":true},{"$f":"I3<=$G$4","v":true},true,true,true,false,false,false,false,false,false,false,false,false,false,false,false,false,false,false]
[null,"Exit Period",null,null,null,null,{"$f":"E10","v":2022},{"$f":"H3=$G$5","v":false},{"$f":"I3=$G$5","v":false},false,false,true,false,false,false,false,false,false,false,false,false,false,false,false,false,false,false]
[]
[]
["Value Assumptions"]
{"$rows_left_out":88}