{"text_format":"1","workbook":"xlsx","n_sheets":5,"sheets":["Exercise with Delay","Exercise","Theory","Chart1","Tables"],"not_rendered":{"charts":2,"images":0,"macros":1,"external_links":0,"defined_names":10,"comments":1,"pivot_tables":0},"unopened":[{"sheet":"Chart1","index":3,"reason":"not_a_worksheet"}],"bounds":{"document_bytes":16777216,"sheet_cells":100000,"rows_first":2000,"rows_last":500,"rows_between":2000,"halvings":0,"cell_chars":16384,"cell_head_chars":4096},"cells_cut":0,"cells_raw":0,"read":"whole","date_system":"1900"}

{"sheet":"Exercise with Delay","index":0,"n_rows":85,"n_cols":45,"rows_kept":85,"cut":false,"hidden":false,"merged":[[5,13,15,13],[3,15,3,20]]}
[]
["Inputs",null,null,null,null,null,null,null,null,null,null,null,null,null,null,null,null,null,null,null,null,null,null,null,null,null,null,null,null,null,null,null,null,null,null,null,false]
[]
[null,"Operating Inputs",null,null,null,null,null,null,null,null,null,null,null,null,null,"Construction Period"]
[null,null,"EPC Cost",null,1000,null,"Equity IRR",null,{"$f":"IRR(E75:AS75,-0.4)","v":0.11006376511860472},null,null,null,null,null,{"$f":"I8","v":5.9999999999982068E-2},1,2,3,4,5,6]
[null,null,"Initital Cash Flow",null,130,null,"Project IRR",null,{"$f":"IRR(E76:AS76,-0.4)","v":8.2705552445692332E-2},null,"EPC",{"$f":"SUM(33:33)","v":1000},null,"Operating Sensitivty",1.1000000000000001,6.0000000000000053E-2,5.9999999999999387E-2,5.9999999999996279E-2,5.9999999999982068E-2,5.9999999999928111E-2,5.9999999999747811E-2]
[null,null,"Sensitivity Factor",null,1,82,null,null,null,null,"IDC",{"$f":"SUM(34:34)","v":65.557799999999986},null,null,{"$f":"O6-0.1","v":1},6.0000000000000053E-2,5.9999999999999387E-2,5.9999999999996279E-2,5.9999999999982068E-2,5.9999999999928111E-2,5.9999999999747811E-2]
[null,null,"Construction Period (Years)",null,4,null,"Debt IRR",null,{"$f":"IRR(E83:AS83,-0.5)","v":5.9999999999982068E-2},null,"Total",{"$f":"SUM(35:35)","v":1065.5578},null,null,0.9,6.0000000000000053E-2,5.9999999999999387E-2,5.9999999999996279E-2,5.9999999999982068E-2,5.9999999999928111E-2,5.9999999999747811E-2]
[null,null,"Concession Period (Years",null,20,null,null,null,null,null,null,null,null,null,0.8,6.0000000000000053E-2,5.9999999999999387E-2,5.9956474301647411E-2,5.9807550897648998E-2,5.950258432215505E-2,5.9068047441839466E-2]
[null,null,"Operating Life",null,{"$f":"E9-E8","v":16},null,null,null,null,null,"Sources",null,null,null,0.70000000000000007,5.9031914140776243E-2,5.840522739781151E-2,5.7648577092050735E-2,5.6812803117571864E-2,5.5912027086665983E-2,5.5030929219976432E-2]
[null,null,null,null,null,null,null,null,null,null,"Debt Draws",{"$f":"SUM(38:38)","v":700},null,null,0.60000000000000009,5.2676057529722042E-2,5.1923054490228271E-2,5.1238652921720584E-2,5.0639232388156818E-2,5.0138227460736706E-2,4.6933417137849709E-2]
[null,"Financial Inputs",null,null,null,null,null,null,null,null,"Cap Int",{"$f":"SUM(39:39)","v":65.557799999999986},null,null,0.50000000000000011,4.4382652594837424E-2,4.4212230278484643E-2,4.4089426842510049E-2,4.2151887888136397E-2,3.4690685270174271E-2,2.7071387362980204E-2]
[null,null,"Debt Commitment (Cash)",null,700,null,null,null,null,null,"Equity",{"$f":"SUM(40:40)","v":300},null,null,0.40000000000000013,3.5850597003267648E-2,3.0735221758892983E-2,2.4299771665558412E-2,1.7739710357900451E-2,1.0980567577488554E-2,3.9401220309709384E-3]
[null,null,"Interest Rate",null,0.06,null,null,null,null,null,"Total",{"$f":"SUM(41:41)","v":1065.5578},null,null,0.30000000000000016,5.7579846733244455E-3,2.8545624911879841E-4,-5.3820249966907152E-3,-1.1299571131081043E-2,-1.7530860685970651E-2,-2.4151687087880402E-2]
[null,null,"Debt Term",null,12,null,null,null,null,null,null,null,null,null,0.20000000000000015,-3.2660725058889062E-2,-3.7587306913055674E-2,-4.2810681040326259E-2,-4.8383880938733692E-2,-5.4371600594660507E-2,-6.0854158911387346E-2]
[null,null,"Captialise Interest",null,true,null,null,null,null,null,null,null,null,null,0.10000000000000014,-8.7737714378790077E-2,-9.2690369696296626E-2,-9.8038689887927521E-2,-0.1038474973094391,-0.11019750365035974,-0.11719071796547387]
[]
["Periods"]
[null,"Period",null,null,{"$f":"1-E8","v":-3},{"$f":"E19+1","v":-2},{"$f":"F19+1","v":-1},0,1,2,3,4,5,6,7,8,9,10,11,12,13,14,15,16,17,18,19,20,21,22,23,24,25,26,27,28,29,30,31,32,33,34,35,36,37]
[null,"Construction Switch",null,null,{"$f":"E19<1","v":true},{"$f":"F19<1","v":true},true,true,false,false,false,false,false,false,false,false,false,false,false,false,false,false,false,false,false,false,false,false,false,false,false,false,false,false,false,false,false,false,false,false,false,false,false,false,false]
[null,"Operating Switch",null,null,{"$f":"AND(E19>0,E19<=$E$10)","v":false},{"$f":"AND(F19>0,F19<=$E$10)","v":false},false,false,true,true,true,true,true,true,true,true,true,true,true,true,true,true,true,true,false,false,false,false,false,false,false,false,false,false,false,false,false,false,false,false,false,false,false,false,false]
[null,"Debt Repayment Switch",null,null,{"$f":"AND(E19>0,E19<=$E$15)","v":false},{"$f":"AND(F19>0,F19<=$E$15)","v":false},false,false,true,true,true,true,true,true,true,true,true,true,true,true,false,false,false,false,false,false,false,false,false,false,false,false,false,false,false,false,false,false,false,false,false,false,false,false,false]
[]
["Working"]
[null,"Cash Flow Before Sensitvity",null,null,{"$f":"$E$6*E21","v":0},{"$f":"$E$6*F21","v":0},0,0,130,130,130,130,130,130,130,130,130,130,130,130,130,130,130,130,0,0,0,0,0,0,0,0,0,0,0,0,0,0,0,0,0,0,0,0,0]
[null,"Sensitivity Factor",null,null,{"$f":"$E$7","v":1},{"$f":"$E$7","v":1},1,1,1,1,1,1,1,1,1,1,1,1,1,1,1,1,1,1,1,1,1,1,1,1,1,1,1,1,1,1,1,1,1,1,1,1,1,1,1]
[null,"Cash Flow After Sensitivity",null,null,{"$f":"E25*E26","v":0},{"$f":"F25*F26","v":0},0,0,130,130,130,130,130,130,130,130,130,130,130,130,130,130,130,130,0,0,0,0,0,0,0,0,0,0,0,0,0,0,0,0,0,0,0,0,0]
[null,"Construction Expenditures",null,null,{"$f":"$E$5/$E$8*E20","v":250},{"$f":"$E$5/$E$8*F20","v":250},250,250,0,0,0,0,0,0,0,0,0,0,0,0,0,0,0,0,0,0,0,0,0,0,0,0,0,0,0,0,0,0,0,0,0,0,0,0,0]
[null,"Drawdown Percent",null,null,{"$f":"E28/SUM(28:28)","v":0.25},{"$f":"F28/SUM(28:28)","v":0.25},0.25,0.25,0,0,0,0,0,0,0,0,0,0,0,0,0,0,0,0,0,0,0,0,0,0,0,0,0,0,0,0,0,0,0,0,0,0,0,0,0]
[]
["Uses and Sources"]
[null,"Uses"]
[null,null,"EPC Cost",null,{"$f":"E28","v":250},{"$f":"F28","v":250},250,250,0,0,0,0,0,0,0,0,0,0,0,0,0,0,0,0,0,0,0,0,0,0,0,0,0,0,0,0,0,0,0,0,0,0,0,0,0]
[null,null,"Interest During Construction",null,{"$f":"E53","v":0},{"$f":"F53","v":10.5},21.63,33.427799999999998,0,0,0,0,0,0,0,0,0,0,0,0,0,0,0,0,0,0,0,0,0,0,0,0,0,0,0,0,0,0,0,0,0,0,0,0,0]
[null,null,null,"Total",{"$f":"SUM(E33:E34)","v":250},{"$f":"SUM(F33:F34)","v":260.5},271.63,283.42779999999999,0,0,0,0,0,0,0,0,0,0,0,0,0,0,0,0,0,0,0,0,0,0,0,0,0,0,0,0,0,0,0,0,0,0,0,0,0]
[]
[null,"Sources"]
[null,null,"Debt Draws",null,{"$f":"E29*$E$13*E20","v":175},{"$f":"F29*$E$13*F20","v":175},175,175,0,0,0,0,0,0,0,0,0,0,0,0,0,0,0,0,0,0,0,0,0,0,0,0,0,0,0,0,0,0,0,0,0,0,0,0,0]
[null,null,"Capitalised Interest",null,{"$f":"E47","v":0},{"$f":"F47","v":10.5},21.63,33.427799999999998,0,0,0,0,0,0,0,0,0,0,0,0,0,0,0,0,0,0,0,0,0,0,0,0,0,0,0,0,0,0,0,0,0,0,0,0,0]
[null,null,"Equity",null,{"$f":"E35-E38-E39","v":75},{"$f":"F35-F38-F39","v":75},75,75,0,0,0,0,0,0,0,0,0,0,0,0,0,0,0,0,0,0,0,0,0,0,0,0,0,0,0,0,0,0,0,0,0,0,0,0,0]
{"$rows_left_out":46}
{"sheet":"Exercise","index":1,"n_rows":80,"n_cols":45,"rows_kept":80,"cut":false,"hidden":false,"merged":[]}
["Periods"]
[null,"Period",null,null,0,{"$f":"E2+1","v":1},{"$f":"F2+1","v":2},3,4,5,6,7,8,9,10,11,12,13,14,15,16,17,18,19,20,21,22,23,24,25,26,27,28,29,30,31,32,33,34,35,36,37,38,39,40]
[null,"Construction Switch",null,null,{"$f":"E2<1","v":true},{"$f":"F2<1","v":false},false,false,false,false,false,false,false,false,false,false,false,false,false,false,false,false,false,false,false,false,false,false,false,false,false,false,false,false,false,false,false,false,false,false,false,false,false,false,false]
[null,"Operating Switch",null,null,{"$f":"AND(E2>0,E2<=Life)","v":false},true,true,true,true,true,true,true,true,true,true,true,true,true,true,true,true,true,true,true,true,false,false,false,false,false,false,false,false,false,false,false,false,false,false,false,false,false,false,false,false]
[null,"Sensitivity Switch",null,null,{"$f":"E2>=Sensitivity_Year","v":false},false,false,true,true,true,true,true,true,true,true,true,true,true,true,true,true,true,true,true,true,true,true,true,true,true,true,true,true,true,true,true,true,true,true,true,true,true,true,true,true]
[null,"Debt Retired Switch",null,null,{"$f":"E2>Debt_Term","v":false},false,false,false,false,false,false,false,false,false,false,false,false,true,true,true,true,true,true,true,true,true,true,true,true,true,true,true,true,true,true,true,true,true,true,true,true,true,true,true,true]
[]
["Inputs"]
[]
[null,"Operating Inputs"]
[null,null,"EPC Cost",null,1000,null,null,null,"Equity IRR",null,{"$f":"IRR(E67:AS67)","v":0.17345337784018078},null,null,"Amount","Percent Reduction","Sensitivity"]
[null,null,"Initital Cash Flow",null,125,null,null,null,"Project IRR",null,{"$f":"IRR(E68:AS68)","v":0.10929848210336313},null,"DSCR"]
[null,null,"Sensitivity Factor",null,{"$f":"F13/100","v":1},100,null,null,null,null,null,null,"LLCR"]
[null,null,"Sensitivity Year",null,3,null,null,null,"Debt IRR",null,{"$f":"IRR(E73:AS73)","v":6.0000000000437037E-2},null,"PLCR"]
[null,null,"Life",null,20]
[null,null,null,null,null,null,null,null,"Cash Flow Test",null,{"$f":"AND(E75:AS75)","v":true}]
[null,"Financial Inputs"]
[null,null,"Debt Commitment",null,800,null,null,null,"Final Debt",null,{"$f":"AS51","v":0}]
[null,null,"Interest Rate",null,0.06,null,null,null,"Debt at Maturity"]
[null,null,"Debt Term",null,12]
[null,null,"Cash Sweep Percent",null,1]
[]
[]
["Working"]
[null,"Cash Flow Before Sensitvity",null,null,{"$f":"E4*Initital_Cash_Flow","v":0},{"$f":"F4*Initital_Cash_Flow","v":125},{"$f":"G4*Initital_Cash_Flow","v":125},{"$f":"H4*Initital_Cash_Flow","v":125},{"$f":"I4*Initital_Cash_Flow","v":125},{"$f":"J4*Initital_Cash_Flow","v":125},{"$f":"K4*Initital_Cash_Flow","v":125},{"$f":"L4*Initital_Cash_Flow","v":125},{"$f":"M4*Initital_Cash_Flow","v":125},{"$f":"N4*Initital_Cash_Flow","v":125},{"$f":"O4*Initital_Cash_Flow","v":125},{"$f":"P4*Initital_Cash_Flow","v":125},{"$f":"Q4*Initital_Cash_Flow","v":125},{"$f":"R4*Initital_Cash_Flow","v":125},{"$f":"S4*Initital_Cash_Flow","v":125},{"$f":"T4*Initital_Cash_Flow","v":125},{"$f":"U4*Initital_Cash_Flow","v":125},{"$f":"V4*Initital_Cash_Flow","v":125},{"$f":"W4*Initital_Cash_Flow","v":125},{"$f":"X4*Initital_Cash_Flow","v":125},{"$f":"Y4*Initital_Cash_Flow","v":125},{"$f":"Z4*Initital_Cash_Flow","v":0},{"$f":"AA4*Initital_Cash_Flow","v":0},{"$f":"AB4*Initital_Cash_Flow","v":0},{"$f":"AC4*Initital_Cash_Flow","v":0},{"$f":"AD4*Initital_Cash_Flow","v":0},{"$f":"AE4*Initital_Cash_Flow","v":0},{"$f":"AF4*Initital_Cash_Flow","v":0},{"$f":"AG4*Initital_Cash_Flow","v":0},{"$f":"AH4*Initital_Cash_Flow","v":0},{"$f":"AI4*Initital_Cash_Flow","v":0},{"$f":"AJ4*Initital_Cash_Flow","v":0},{"$f":"AK4*Initital_Cash_Flow","v":0},{"$f":"AL4*Initital_Cash_Flow","v":0},{"$f":"AM4*Initital_Cash_Flow","v":0},{"$f":"AN4*Initital_Cash_Flow","v":0},{"$f":"AO4*Initital_Cash_Flow","v":0},{"$f":"AP4*Initital_Cash_Flow","v":0},{"$f":"AQ4*Initital_Cash_Flow","v":0},{"$f":"AR4*Initital_Cash_Flow","v":0},{"$f":"AS4*Initital_Cash_Flow","v":0}]
[null,"Sensitivity Factor",null,null,{"$f":"IF(E5,Sensitivity_Factor,1)","v":1},{"$f":"IF(F5,Sensitivity_Factor,1)","v":1},{"$f":"IF(G5,Sensitivity_Factor,1)","v":1},{"$f":"IF(H5,Sensitivity_Factor,1)","v":1},{"$f":"IF(I5,Sensitivity_Factor,1)","v":1},{"$f":"IF(J5,Sensitivity_Factor,1)","v":1},{"$f":"IF(K5,Sensitivity_Factor,1)","v":1},{"$f":"IF(L5,Sensitivity_Factor,1)","v":1},{"$f":"IF(M5,Sensitivity_Factor,1)","v":1},{"$f":"IF(N5,Sensitivity_Factor,1)","v":1},{"$f":"IF(O5,Sensitivity_Factor,1)","v":1},{"$f":"IF(P5,Sensitivity_Factor,1)","v":1},{"$f":"IF(Q5,Sensitivity_Factor,1)","v":1},{"$f":"IF(R5,Sensitivity_Factor,1)","v":1},{"$f":"IF(S5,Sensitivity_Factor,1)","v":1},{"$f":"IF(T5,Sensitivity_Factor,1)","v":1},{"$f":"IF(U5,Sensitivity_Factor,1)","v":1},{"$f":"IF(V5,Sensitivity_Factor,1)","v":1},{"$f":"IF(W5,Sensitivity_Factor,1)","v":1},{"$f":"IF(X5,Sensitivity_Factor,1)","v":1},{"$f":"IF(Y5,Sensitivity_Factor,1)","v":1},{"$f":"IF(Z5,Sensitivity_Factor,1)","v":1},{"$f":"IF(AA5,Sensitivity_Factor,1)","v":1},{"$f":"IF(AB5,Sensitivity_Factor,1)","v":1},{"$f":"IF(AC5,Sensitivity_Factor,1)","v":1},{"$f":"IF(AD5,Sensitivity_Factor,1)","v":1},{"$f":"IF(AE5,Sensitivity_Factor,1)","v":1},{"$f":"IF(AF5,Sensitivity_Factor,1)","v":1},{"$f":"IF(AG5,Sensitivity_Factor,1)","v":1},{"$f":"IF(AH5,Sensitivity_Factor,1)","v":1},{"$f":"IF(AI5,Sensitivity_Factor,1)","v":1},{"$f":"IF(AJ5,Sensitivity_Factor,1)","v":1},{"$f":"IF(AK5,Sensitivity_Factor,1)","v":1},{"$f":"IF(AL5,Sensitivity_Factor,1)","v":1},{"$f":"IF(AM5,Sensitivity_Factor,1)","v":1},{"$f":"IF(AN5,Sensitivity_Factor,1)","v":1},{"$f":"IF(AO5,Sensitivity_Factor,1)","v":1},{"$f":"IF(AP5,Sensitivity_Factor,1)","v":1},{"$f":"IF(AQ5,Sensitivity_Factor,1)","v":1},{"$f":"IF(AR5,Sensitivity_Factor,1)","v":1},{"$f":"IF(AS5,Sensitivity_Factor,1)","v":1}]
[null,"Cash Flow After Sensitivity",null,null,{"$f":"E26*E25","v":0},{"$f":"F26*F25","v":125},125,125,125,125,125,125,125,125,125,125,125,125,125,125,125,125,125,125,125,0,0,0,0,0,0,0,0,0,0,0,0,0,0,0,0,0,0,0,0]
[]
["Uses and Sources"]
[null,"Uses"]
[null,null,"EPC Cost",null,{"$f":"EPC_Cost","v":1000}]
[null,"Sources"]
[null,null,"Debt",null,{"$f":"Debt_Commitment","v":800}]
[null,null,"Equity",null,{"$f":"E31-E33","v":200}]
[null,null,null,"Total",{"$f":"E33+E34","v":1000}]
[]
["Debt Schedule"]
[null,"Debt Balance"]
[null,null,"Opening Balance",null,{"$f":"D42","v":0},{"$f":"E42","v":800},733.33333333333337,666.66666666666674,600.00000000000011,533.33333333333348,466.6666666666668,400.00000000000011,333.33333333333343,266.66666666666674,200.00000000000006,133.33333333333337,66.6666666666667,0,0,0,0,0,0,0,0,0,0,0,0,0,0,0,0,0,0,0,0,0,0,0,0,0,0,0,0]
[null,null,"Add: Draws",null,{"$f":"E33","v":800},{"$f":"F33","v":0},0,0,0,0,0,0,0,0,0,0,0,0,0,0,0,0,0,0,0,0,0,0,0,0,0,0,0,0,0,0,0,0,0,0,0,0,0,0,0]
{"$rows_left_out":41}
{"sheet":"Theory","index":2,"n_rows":5,"n_cols":2,"rows_kept":5,"cut":false,"hidden":false,"merged":[]}
[]
[]
[null,"Adding default allows you to more precisely measure the risk associated with debt terms"]
[]
[null,"You can test cash flow sweeps etc."]

{"sheet":"Tables","index":4,"n_rows":5003,"n_cols":255,"rows_kept":5003,"cut":false,"hidden":false,"merged":[]}
[]
[]
[]
[]
[]
[]
[]
[null,null,null,null,null,null,null,null,null,null,null,2,null,null,"Project IRR","Debt IRR","Equity IRR"]
[null,null,null,null,null,"Project IRR","Debt IRR","Equity IRR",null,null,null,{"$f":"L8-1%","v":1.99},null,2,0.24697455763816833,5.9999998658895493E-2,0.70549052953720093]
[null,null,null,null,null,{"$f":"Exercise!K12","v":0.10929848210336313},{"$f":"Exercise!K14","v":6.0000000000437037E-2},{"$f":"IF(ISNUMBER(Exercise!K11),Exercise!K11,-100%)","v":0.17345337784018078},null,null,null,{"$f":"L9-1%","v":1.98},null,1.99,0.24567632377147675,5.9999998658895493E-2,0.69950252771377563]
[null,null,null,null,null,null,null,null,null,null,null,1.97,null,1.98,0.24437727034091949,5.9999998658895493E-2,0.69351935386657715]
[null,null,null,null,null,null,null,null,null,null,null,1.96,null,1.97,0.24307741224765778,5.9999998658895493E-2,0.68754112720489502]
[null,null,null,null,null,null,null,null,null,null,null,1.95,null,1.96,0.2417767345905304,5.9999998658895493E-2,0.6815679669380188]
[null,null,null,null,null,null,null,null,null,null,null,1.94,null,1.95,0.24047520756721497,5.9999998658895493E-2,0.67559999227523804]
[null,null,null,null,null,null,null,null,null,null,null,1.93,null,1.94,0.23917283117771149,5.9999998658895493E-2,0.66963738203048706]
[null,null,null,null,null,null,null,null,null,null,null,1.92,null,1.93,0.23786959052085876,5.9999998658895493E-2,0.6636803150177002]
[null,null,null,null,null,null,null,null,null,null,null,1.91,null,1.92,0.23656545579433441,5.9999998658895493E-2,0.65772885084152222]
[null,null,null,null,null,null,null,null,null,null,null,1.9,null,1.91,0.23526042699813843,5.9999998658895493E-2,0.65178316831588745]
[null,null,null,null,null,null,null,null,null,null,null,1.89,null,1.9,0.23395447432994843,5.9999998658895493E-2,0.64584344625473022]
[null,null,null,null,null,null,null,null,null,null,null,1.88,null,1.89,0.23264758288860321,5.9999998658895493E-2,0.63990986347198486]
[null,null,null,null,null,null,null,null,null,null,null,1.8699999999999999,null,1.88,0.23133975267410278,5.9999998658895493E-2,0.63398259878158569]
[null,null,null,null,null,null,null,null,null,null,null,1.8599999999999999,null,1.8699999999999999,0.23003095388412476,5.9999998658895493E-2,0.62806177139282227]
[null,null,null,null,null,null,null,null,null,null,null,1.8499999999999999,null,1.8599999999999999,0.22872118651866913,5.9999998658895493E-2,0.62214761972427368]
[null,null,null,null,null,null,null,null,null,null,null,1.8399999999999999,null,1.8499999999999999,0.22741040587425232,5.9999998658895493E-2,0.61624032258987427]
[null,null,null,null,null,null,null,null,null,null,null,1.8299999999999998,null,1.8399999999999999,0.22609861195087433,5.9999998658895493E-2,0.61034005880355835]
[null,null,null,null,null,null,null,null,null,null,null,1.8199999999999998,null,1.8299999999999998,0.22478577494621277,5.9999998658895493E-2,0.60444700717926025]
[null,null,null,null,null,null,null,null,null,null,null,1.8099999999999998,null,1.8199999999999998,0.22347189486026764,5.9999998658895493E-2,0.59856140613555908]
[null,null,null,null,null,null,null,null,null,null,null,1.7999999999999998,null,1.8099999999999998,0.22215692698955536,5.9999998658895493E-2,0.59268349409103394]
[null,null,null,null,null,null,null,null,null,null,null,1.7899999999999998,null,1.7999999999999998,0.22084088623523712,5.9999998658895493E-2,0.58681339025497437]
[null,null,null,null,null,null,null,null,null,null,null,1.7799999999999998,null,1.7899999999999998,0.21952372789382935,5.9999998658895493E-2,0.58095145225524902]
[null,null,null,null,null,null,null,null,null,null,null,1.7699999999999998,null,1.7799999999999998,0.21820543706417084,5.9999998658895493E-2,0.57509779930114746]
[null,null,null,null,null,null,null,null,null,null,null,1.7599999999999998,null,1.7699999999999998,0.2168859988451004,5.9999998658895493E-2,0.56925272941589355]
[null,null,null,null,null,null,null,null,null,null,null,1.7499999999999998,null,1.7599999999999998,0.21556538343429565,5.9999998658895493E-2,0.56341648101806641]
[null,null,null,null,null,null,null,null,null,null,null,1.7399999999999998,null,1.7499999999999998,0.2142435759305954,5.9999998658895493E-2,0.55758935213088989]
[null,null,null,null,null,null,null,null,null,null,null,1.7299999999999998,null,1.7399999999999998,0.21292056143283844,5.9999998658895493E-2,0.55177152156829834]
[null,null,null,null,null,null,null,null,null,null,null,1.7199999999999998,null,1.7299999999999998,0.21159631013870239,5.9999998658895493E-2,0.54596328735351563]
[null,null,null,null,null,null,null,null,null,null,null,1.7099999999999997,null,1.7199999999999998,0.21027080714702606,5.9999998658895493E-2,0.5401650071144104]
[null,null,null,null,null,null,null,null,null,null,null,1.6999999999999997,null,1.7099999999999997,0.20894402265548706,5.9999998658895493E-2,0.53437685966491699]
[null,null,null,null,null,null,null,null,null,null,null,1.6899999999999997,null,1.6999999999999997,0.207615926861763,5.9999998658895493E-2,0.52859914302825928]
[null,null,null,null,null,null,null,null,null,null,null,1.6799999999999997,null,1.6899999999999997,0.20628650486469269,5.9999998658895493E-2,0.52283227443695068]
{"$rows_left_out":4963}