{"text_format":"1","workbook":"xlsx","n_sheets":30,"sheets":["Contents","Maket Watch","Yahoo","Summary","Google","GE Google","GOOG Google","ED Google","EXC Google","AAPL Google","NRG Google","AES Google","FSRL Google","FSRL Yahoo","GE Yahoo","GOOG Yahoo","ED Yahoo","EXC Yahoo","AAPL Yahoo","NRG Yahoo","AES Yahoo","^GSPC Yahoo","GE MarketW","GOOG MarketW","ED MarketW","EXC MarketW","AAPL MarketW","NRG MarketW","AES MarketW","FSRL MarketW"],"not_rendered":{"charts":0,"images":0,"macros":1,"external_links":0,"defined_names":18,"comments":0,"pivot_tables":0},"unopened":[],"bounds":{"document_bytes":16777216,"sheet_cells":100000,"rows_first":2000,"rows_last":500,"rows_between":2000,"halvings":0,"cell_chars":16384,"cell_head_chars":4096},"cells_cut":0,"cells_raw":0,"read":"whole","date_system":"1900"}

{"sheet":"Contents","index":0,"n_rows":33,"n_cols":5,"rows_kept":33,"cut":false,"hidden":false,"merged":[]}
[null,null,"Go to Charts by Pressing Shift and Enter on Menu Item "]
[]
[null,null,"Sheet Tab","Description","Author"]
[null,1,"Contents"]
[null,2,"Maket Watch"]
[null,3,"Yahoo"]
[null,4,"Google"]
[null,5,"Summary"]
[null,6,"GE Google"]
[null,7,"GOOG Google"]
[null,8,"ED Google"]
[null,9,"EXC Google"]
[null,10,"AAPL Google"]
[null,11,"NRG Google"]
[null,12,"AES Google"]
[null,13,"FSRL Google"]
[null,14,"FSRL Yahoo"]
[null,15,"GE Yahoo"]
[null,16,"GOOG Yahoo"]
[null,17,"ED Yahoo"]
[null,18,"EXC Yahoo"]
[null,19,"AAPL Yahoo"]
[null,20,"NRG Yahoo"]
[null,21,"AES Yahoo"]
[null,22,"^GSPC Yahoo"]
[null,23,"GE MarketW"]
[null,24,"GOOG MarketW"]
[null,25,"ED MarketW"]
[null,26,"EXC MarketW"]
[null,27,"AAPL MarketW"]
[null,28,"NRG MarketW"]
[null,29,"AES MarketW"]
[null,30,"FSRL MarketW"]

{"sheet":"Maket Watch","index":1,"n_rows":9,"n_cols":12,"rows_kept":9,"cut":false,"hidden":false,"merged":[]}
[]
[null,"http://www.marketwatch.com/investing/stock/ge/profile",null,null,null,null,1,"GE",null,"MarketW Code",8]
[null,null,null,null,null,null,2,"GOOG",null,"Stock",{"$f":"INDEX(H2:H9,K2)","v":"FSRL"},{"$f":"_xlfn.FORMULATEXT(K3)","v":"=INDEX(H2:H9,K2)"}]
[null,null,null,null,null,null,3,"ED",null,"MarketW Sheet",{"$f":"K3&\" \"&\"MarketW\"","v":"FSRL MarketW"}]
["MarketW URL",{"$f":"B6&K3&B7","v":"http://www.marketwatch.com/investing/stock/FSRL/profile"},null,null,null,null,4,"EXC"]
[null,"http://www.marketwatch.com/investing/stock/",null,null,null,null,5,"AAPL"]
[null,"/profile",null,null,null,null,6,"NRG"]
[null,null,null,null,null,null,7,"AES"]
[null,null,null,null,null,null,8,"FSRL"]

{"sheet":"Yahoo","index":2,"n_rows":13,"n_cols":11,"rows_kept":13,"cut":false,"hidden":false,"merged":[]}
[]
["Example URL","https://finance.yahoo.com/quote/GE/key-statistics?p=GE",null,null,null,null,1,"GE",null,"Yahoo Code",1]
[null,null,null,null,null,null,2,"GOOG"]
[null,null,null,null,null,null,3,"ED"]
["URL Part 1","https://finance.yahoo.com/quote/",null,null,null,null,4,"EXC"]
["URL Part 2","/key-statistics?p=",null,null,null,null,5,"AAPL"]
[null,null,null,null,null,null,6,"NRG"]
["Yahoo URL",{"$f":"B5&H11&B6&H11","v":"https://finance.yahoo.com/quote/GE/key-statistics?p=GE"},null,null,null,null,7,"AES"]
[null,null,null,null,null,null,8,"FSRL"]
[null,{"$f":"_xlfn.FORMULATEXT(URL)","v":"=B5&H11&B6&H11"}]
[null,null,null,null,null,null,"Sheet Name",{"$f":"INDEX(H2:H9,K2)","v":"GE"},{"$f":"_xlfn.FORMULATEXT(H11)","v":"=INDEX(H2:H9,K2)"}]
[]
[null,null,null,null,null,null,"Yahoo Sheet",{"$f":"H11&\" \"&\"Yahoo\"","v":"GE Yahoo"}]

{"sheet":"Summary","index":3,"n_rows":13,"n_cols":9,"rows_kept":13,"cut":false,"hidden":false,"merged":[]}
[]
[null,null,null,"Code","MarketW","Yahoo","Google"]
[null,null,null,"Name","P/E Current","Forward P/E 1","P/E"]
[null,null,null,"Match Letter","A","A","A"]
[null,null,null,"Index Letter","A","B","B"]
[null,null,null,{"$f":"Google!H2","v":"GE"},{"$f":"INDEX(INDIRECT(\"'\"&$D6&\" \"&E$2&\"'!\"&E$5&\":\"&E$5),MATCH(E$3,INDIRECT(\"'\"&$D6&\" \"&E$2&\"'!\"&E$4&\":\"&E$4),0)+2)","v":23.76},{"$f":"INDEX(INDIRECT(\"'\"&$D6&\" \"&F$2&\"'!\"&F$5&\":\"&F$5),MATCH(F$3,INDIRECT(\"'\"&$D6&\" \"&F$2&\"'!\"&F$4&\":\"&F$4),0))","v":14.41},{"$f":"INDEX(INDIRECT(\"'\"&$D6&\" \"&G$2&\"'!\"&G$5&\":\"&G$5),MATCH(G$3,INDIRECT(\"'\"&$D6&\" \"&G$2&\"'!\"&G$4&\":\"&G$4),0))","v":28.07},null,{"$f":"_xlfn.FORMULATEXT(F6)","v":"=INDEX(INDIRECT(\"'\"&$D6&\" \"&F$2&\"'!\"&F$5&\":\"&F$5),MATCH(F$3,INDIRECT(\"'\"&$D6&\" \"&F$2&\"'!\"&F$4&\":\"&F$4),0))"}]
[null,null,null,{"$f":"Google!H3","v":"GOOG"},{"$f":"INDEX(INDIRECT(\"'\"&$D7&\" \"&E$2&\"'!\"&E$5&\":\"&E$5),MATCH(E$3,INDIRECT(\"'\"&$D7&\" \"&E$2&\"'!\"&E$4&\":\"&E$4),0)+2)","v":33.380000000000003},{"$f":"INDEX(INDIRECT(\"'\"&$D7&\" \"&F$2&\"'!\"&F$5&\":\"&F$5),MATCH(F$3,INDIRECT(\"'\"&$D7&\" \"&F$2&\"'!\"&F$4&\":\"&F$4),0))","v":22.83},33.159999999999997]
[null,null,null,{"$f":"Google!H4","v":"ED"},20.5,{"$f":"INDEX(INDIRECT(\"'\"&$D8&\" \"&F$2&\"'!\"&F$5&\":\"&F$5),MATCH(F$3,INDIRECT(\"'\"&$D8&\" \"&F$2&\"'!\"&F$4&\":\"&F$4),0))","v":19.829999999999998},20.420000000000002]
[null,null,null,{"$f":"Google!H5","v":"EXC"},31.39,13.39,20.12]
[null,null,null,{"$f":"Google!H6","v":"AAPL"},19.239999999999998,14.73,18.18]
[null,null,null,{"$f":"Google!H7","v":"NRG"},-9.9700000000000006,18.48,"    -"]
[null,null,null,{"$f":"Google!H8","v":"AES"},-6.65,9.3699999999999992,1766.62]
[null,null,null,{"$f":"Google!H9","v":"FSRL"},12.46,"N/A",{"$error":"#N/A"}]

{"sheet":"Google","index":4,"n_rows":9,"n_cols":12,"rows_kept":9,"cut":false,"hidden":false,"merged":[]}
[]
[null,"https://www.google.com/finance?q=NYSE:GE",null,null,null,null,1,"GE",null,"Google Code",8]
[null,"https://www.google.com/finance?q=GE",null,null,null,null,2,"GOOG",null,"Stock",{"$f":"INDEX(H2:H9,K2)","v":"FSRL"},{"$f":"_xlfn.FORMULATEXT(K3)","v":"=INDEX(H2:H9,K2)"}]
[null,null,null,null,null,null,3,"ED",null,"Sheet Name",{"$f":"K3&\" \"&\"Google\"","v":"FSRL Google"}]
["URL",{"$f":"B6&K3","v":"https://www.google.com/finance?q=FSRL"},null,null,null,null,4,"EXC"]
[null,"https://www.google.com/finance?q=",null,null,null,null,5,"AAPL"]
[null,null,null,null,null,null,6,"NRG"]
[null,null,null,null,null,null,7,"AES"]
[null,null,null,null,null,null,8,"FSRL"]

{"sheet":"GE Google","index":5,"n_rows":192,"n_cols":3,"rows_kept":192,"cut":false,"hidden":false,"merged":[]}
[]
["Google+"]
["Search"]
["Images"]
["Maps"]
["Play"]
["YouTube"]
["News"]
["Gmail"]
["More"]
[]
["Drive"]
["Calendar"]
["Translate"]
["Mobile"]
["Books"]
["Wallet"]
["Shopping"]
["Blogger"]
["Finance"]
["Photos"]
["Videos"]
["Docs"]
["Even more »"]
["Account Options"]
["Sign in"]
[]
["Help"]
["Adobe Flash Player is required for interactive charts. Allow"]
[]
[]
["Company"]
["Summary"]
["News"]
["Option chain"]
["Related companies"]
["Historical prices"]
["Financials"]
["Markets"]
["News"]
{"$rows_left_out":153}
{"sheet":"GOOG Google","index":6,"n_rows":177,"n_cols":3,"rows_kept":177,"cut":false,"hidden":false,"merged":[]}
[]
["Google+"]
["Search"]
["Images"]
["Maps"]
["Play"]
["YouTube"]
["News"]
["Gmail"]
["More"]
[]
["Drive"]
["Calendar"]
["Translate"]
["Mobile"]
["Books"]
["Wallet"]
["Shopping"]
["Blogger"]
["Finance"]
["Photos"]
["Videos"]
["Docs"]
["Even more »"]
["Account Options"]
["Sign in"]
[]
["Help"]
["Adobe Flash Player is required for interactive charts. Allow"]
[]
[]
["Company"]
["Summary"]
["News"]
["Option chain"]
["Related companies"]
["Historical prices"]
["Financials"]
["Markets"]
["News"]
{"$rows_left_out":138}
{"sheet":"ED Google","index":7,"n_rows":167,"n_cols":3,"rows_kept":167,"cut":false,"hidden":false,"merged":[]}
[]
["Google+"]
["Search"]
["Images"]
["Maps"]
["Play"]
["YouTube"]
["News"]
["Gmail"]
["More"]
[]
["Drive"]
["Calendar"]
["Translate"]
["Mobile"]
["Books"]
["Wallet"]
["Shopping"]
["Blogger"]
["Finance"]
["Photos"]
["Videos"]
["Docs"]
["Even more »"]
["Account Options"]
["Sign in"]
[]
["Help"]
["Adobe Flash Player is required for interactive charts. Allow"]
[]
[]
["Company"]
["Summary"]
["News"]
["Option chain"]
["Related companies"]
["Historical prices"]
["Financials"]
["Markets"]
["News"]
{"$rows_left_out":128}
{"sheet":"EXC Google","index":8,"n_rows":170,"n_cols":3,"rows_kept":170,"cut":false,"hidden":false,"merged":[]}
[]
["Google+"]
["Search"]
["Images"]
["Maps"]
["Play"]
["YouTube"]
["News"]
["Gmail"]
["More"]
[]
["Drive"]
["Calendar"]
["Translate"]
["Mobile"]
["Books"]
["Wallet"]
["Shopping"]
["Blogger"]
["Finance"]
["Photos"]
["Videos"]
["Docs"]
["Even more »"]
["Account Options"]
["Sign in"]
[]
["Help"]
["Adobe Flash Player is required for interactive charts. Allow"]
[]
[]
["Company"]
["Summary"]
["News"]
["Option chain"]
["Related companies"]
["Historical prices"]
["Financials"]
["Markets"]
["News"]
{"$rows_left_out":131}
{"sheet":"AAPL Google","index":9,"n_rows":170,"n_cols":3,"rows_kept":170,"cut":false,"hidden":false,"merged":[]}
[]
["Google+"]
["Search"]
["Images"]
["Maps"]
["Play"]
["YouTube"]
["News"]
["Gmail"]
["More"]
[]
["Drive"]
["Calendar"]
["Translate"]
["Mobile"]
["Books"]
["Wallet"]
["Shopping"]
["Blogger"]
["Finance"]
["Photos"]
["Videos"]
["Docs"]
["Even more »"]
["Account Options"]
["Sign in"]
[]
["Help"]
["Adobe Flash Player is required for interactive charts. Allow"]
[]
[]
["Company"]
["Summary"]
["News"]
["Option chain"]
["Related companies"]
["Historical prices"]
["Financials"]
["Markets"]
["News"]
{"$rows_left_out":131}
{"sheet":"NRG Google","index":10,"n_rows":171,"n_cols":3,"rows_kept":171,"cut":false,"hidden":false,"merged":[]}
[]
["Google+"]
["Search"]
["Images"]
["Maps"]
["Play"]
["YouTube"]
["News"]
["Gmail"]
["More"]
[]
["Drive"]
["Calendar"]
["Translate"]
["Mobile"]
["Books"]
["Wallet"]
["Shopping"]
["Blogger"]
["Finance"]
["Photos"]
["Videos"]
["Docs"]
["Even more »"]
["Account Options"]
["Sign in"]
[]
["Help"]
["Adobe Flash Player is required for interactive charts. Allow"]
[]
[]
["Company"]
["Summary"]
["News"]
["Option chain"]
["Related companies"]
["Historical prices"]
["Financials"]
["Markets"]
["News"]
{"$rows_left_out":132}
{"sheet":"AES Google","index":11,"n_rows":169,"n_cols":3,"rows_kept":169,"cut":false,"hidden":false,"merged":[]}
[]
["Google+"]
["Search"]
["Images"]
["Maps"]
["Play"]
["YouTube"]
["News"]
["Gmail"]
["More"]
[]
["Drive"]
["Calendar"]
["Translate"]
["Mobile"]
["Books"]
["Wallet"]
["Shopping"]
["Blogger"]
["Finance"]
["Photos"]
["Videos"]
["Docs"]
["Even more »"]
["Account Options"]
["Sign in"]
[]
["Help"]
["Adobe Flash Player is required for interactive charts. Allow"]
[]
[]
["Company"]
["Summary"]
["News"]
["Related companies"]
["Historical prices"]
["Financials"]
["Markets"]
["News"]
["Portfolios"]
{"$rows_left_out":130}
{"sheet":"FSRL Google","index":12,"n_rows":231,"n_cols":2,"rows_kept":231,"cut":false,"hidden":false,"merged":[]}
["Home"]
["Mail"]
["Flickr"]
["Tumblr"]
["News"]
["Sports"]
["Finance"]
["Celebrity"]
["Answers"]
["Groups"]
["Mobile"]
["More"]
["Yahoo"]
["Search"]
[null,"Search"]
[]
[]
["Skip to Navigation"]
["Skip to Market Summary"]
["Skip to Main Content"]
["Skip to Related Content"]
[]
[]
["Finance Home"]
["Originals"]
["Events"]
["Personal Finance"]
["Technology"]
["Markets"]
["Industries"]
["My Screeners"]
["My Portfolio"]
[]
["Explore"]
[]
[]
["Some parts of this page is not supported on your current browser version. Upgrade to new Firefox."]
["x"]
[]
["U.S. Markets closed"]
{"$rows_left_out":192}
{"sheet":"FSRL Yahoo","index":13,"n_rows":231,"n_cols":2,"rows_kept":231,"cut":false,"hidden":false,"merged":[]}
["Home"]
["Mail"]
["Flickr"]
["Tumblr"]
["News"]
["Sports"]
["Finance"]
["Celebrity"]
["Answers"]
["Groups"]
["Mobile"]
["More"]
["Yahoo"]
["Search"]
[null,"Search"]
[]
[]
["Skip to Navigation"]
["Skip to Market Summary"]
["Skip to Main Content"]
["Skip to Related Content"]
[]
[]
["Finance Home"]
["Originals"]
["Events"]
["Personal Finance"]
["Technology"]
["Markets"]
["Industries"]
["My Screeners"]
["My Portfolio"]
[]
["Explore"]
[]
[]
["Some parts of this page is not supported on your current browser version. Upgrade to new Firefox."]
["x"]
[]
["U.S. Markets closed"]
{"$rows_left_out":192}
{"sheet":"GE Yahoo","index":14,"n_rows":318,"n_cols":2,"rows_kept":318,"cut":false,"hidden":false,"merged":[]}
["Home"]
["Mail"]
["Flickr"]
["Tumblr"]
["News"]
["Sports"]
["Finance"]
["Celebrity"]
["Answers"]
["Groups"]
["Mobile"]
["More"]
["Yahoo"]
["Search"]
[null,"Search"]
[]
[]
["Skip to Navigation"]
["Skip to Market Summary"]
["Skip to Main Content"]
["Skip to Related Content"]
[]
[]
["Finance Home"]
["Originals"]
["Events"]
["Personal Finance"]
["Technology"]
["Markets"]
["Industries"]
["My Screeners"]
["My Portfolio"]
[]
["Explore"]
[]
[]
["Some parts of this page is not supported on your current browser version. Upgrade to new Firefox."]
["x"]
[]
["U.S. Markets closed"]
{"$rows_left_out":279}
{"sheet":"GOOG Yahoo","index":15,"n_rows":251,"n_cols":2,"rows_kept":251,"cut":false,"hidden":false,"merged":[]}
["Home"]
["Mail"]
["Flickr"]
["Tumblr"]
["News"]
["Sports"]
["Finance"]
["Celebrity"]
["Answers"]
["Groups"]
["Mobile"]
["More"]
["Yahoo"]
["Search"]
[null,"Search"]
[]
[]
["Skip to Navigation"]
["Skip to Market Summary"]
["Skip to Main Content"]
["Skip to Related Content"]
[]
[]
["Finance Home"]
["Originals"]
["Events"]
["Personal Finance"]
["Technology"]
["Markets"]
["Industries"]
["My Screeners"]
["My Portfolio"]
[]
["Explore"]
[]
[]
["Some parts of this page is not supported on your current browser version. Upgrade to new Firefox."]
["x"]
[]
["U.S. Markets closed"]
{"$rows_left_out":212}
{"sheet":"ED Yahoo","index":16,"n_rows":316,"n_cols":2,"rows_kept":316,"cut":false,"hidden":false,"merged":[]}
["Home"]
["Mail"]
["Flickr"]
["Tumblr"]
["News"]
["Sports"]
["Finance"]
["Celebrity"]
["Answers"]
["Groups"]
["Mobile"]
["More"]
["Yahoo"]
["Search"]
[null,"Search"]
[]
[]
["Skip to Navigation"]
["Skip to Market Summary"]
["Skip to Main Content"]
["Skip to Related Content"]
[]
[]
["Finance Home"]
["Originals"]
["Events"]
["Personal Finance"]
["Technology"]
["Markets"]
["Industries"]
["My Screeners"]
["My Portfolio"]
[]
["Explore"]
[]
[]
["Some parts of this page is not supported on your current browser version. Upgrade to new Firefox."]
["x"]
[]
["U.S. Markets closed"]
{"$rows_left_out":277}
{"sheet":"EXC Yahoo","index":17,"n_rows":316,"n_cols":2,"rows_kept":316,"cut":false,"hidden":false,"merged":[]}
["Home"]
["Mail"]
["Flickr"]
["Tumblr"]
["News"]
["Sports"]
["Finance"]
["Celebrity"]
["Answers"]
["Groups"]
["Mobile"]
["More"]
["Yahoo"]
["Search"]
[null,"Search"]
[]
[]
["Skip to Navigation"]
["Skip to Market Summary"]
["Skip to Main Content"]
["Skip to Related Content"]
[]
[]
["Finance Home"]
["Originals"]
["Events"]
["Personal Finance"]
["Technology"]
["Markets"]
["Industries"]
["My Screeners"]
["My Portfolio"]
[]
["Explore"]
[]
[]
["Some parts of this page is not supported on your current browser version. Upgrade to new Firefox."]
["x"]
[]
["U.S. Markets closed"]
{"$rows_left_out":277}
{"sheet":"AAPL Yahoo","index":18,"n_rows":314,"n_cols":2,"rows_kept":314,"cut":false,"hidden":false,"merged":[]}
["Home"]
["Mail"]
["Flickr"]
["Tumblr"]
["News"]
["Sports"]
["Finance"]
["Celebrity"]
["Answers"]
["Groups"]
["Mobile"]
["More"]
["Yahoo"]
["Search"]
[null,"Search"]
[]
[]
["Skip to Navigation"]
["Skip to Market Summary"]
["Skip to Main Content"]
["Skip to Related Content"]
[]
[]
["Finance Home"]
["Originals"]
["Events"]
["Personal Finance"]
["Technology"]
["Markets"]
["Industries"]
["My Screeners"]
["My Portfolio"]
[]
["Explore"]
[]
[]
["Some parts of this page is not supported on your current browser version. Upgrade to new Firefox."]
["x"]
[]
["U.S. Markets closed"]
{"$rows_left_out":275}
{"sheet":"NRG Yahoo","index":19,"n_rows":317,"n_cols":2,"rows_kept":317,"cut":false,"hidden":false,"merged":[]}
["Home"]
["Mail"]
["Flickr"]
["Tumblr"]
["News"]
["Sports"]
["Finance"]
["Celebrity"]
["Answers"]
["Groups"]
["Mobile"]
["More"]
["Yahoo"]
["Search"]
[null,"Search"]
[]
[]
["Skip to Navigation"]
["Skip to Market Summary"]
["Skip to Main Content"]
["Skip to Related Content"]
[]
[]
["Finance Home"]
["Originals"]
["Events"]
["Personal Finance"]
["Technology"]
["Markets"]
["Industries"]
["My Screeners"]
["My Portfolio"]
[]
["Explore"]
[]
[]
["Some parts of this page is not supported on your current browser version. Upgrade to new Firefox."]
["x"]
[]
["U.S. Markets closed"]
{"$rows_left_out":278}
{"sheet":"AES Yahoo","index":20,"n_rows":314,"n_cols":2,"rows_kept":314,"cut":false,"hidden":false,"merged":[]}
["Home"]
["Mail"]
["Flickr"]
["Tumblr"]
["News"]
["Sports"]
["Finance"]
["Celebrity"]
["Answers"]
["Groups"]
["Mobile"]
["More"]
["Yahoo"]
["Search"]
[null,"Search"]
[]
[]
["Skip to Navigation"]
["Skip to Market Summary"]
["Skip to Main Content"]
["Skip to Related Content"]
[]
[]
["Finance Home"]
["Originals"]
["Events"]
["Personal Finance"]
["Technology"]
["Markets"]
["Industries"]
["My Screeners"]
["My Portfolio"]
[]
["Explore"]
[]
[]
["Some parts of this page is not supported on your current browser version. Upgrade to new Firefox."]
["x"]
[]
["U.S. Markets closed"]
{"$rows_left_out":275}
{"sheet":"^GSPC Yahoo","index":21,"n_rows":208,"n_cols":2,"rows_kept":208,"cut":false,"hidden":false,"merged":[]}
["Home"]
["Mail"]
["Flickr"]
["Tumblr"]
["News"]
["Sports"]
["Finance"]
["Celebrity"]
["Answers"]
["Groups"]
["Mobile"]
["More"]
["Yahoo"]
["Search"]
[null,"Search"]
[]
[]
["Skip to Navigation"]
["Skip to Market Summary"]
["Skip to Main Content"]
["Skip to Related Content"]
[]
[]
["Finance Home"]
["Originals"]
["Events"]
["Personal Finance"]
["Technology"]
["Markets"]
["Industries"]
["My Screeners"]
["My Portfolio"]
[]
["Explore"]
[]
[]
["Some parts of this page is not supported on your current browser version. Upgrade to new Firefox."]
["x"]
[]
["U.S. Markets closed"]
{"$rows_left_out":169}
{"sheet":"GE MarketW","index":22,"n_rows":974,"n_cols":5,"rows_kept":974,"cut":false,"hidden":false,"merged":[]}
["Bulletin "]
["Investor Alert "]
["Home"]
["News Viewer"]
["Markets"]
["Investing"]
["Personal Finance"]
["Retirement"]
["Economy"]
["Real Estate"]
["Entertainment"]
["Watchlist"]
["Alerts"]
["Games"]
[]
[]
["SEARCH"]
["Stocks"]
["Funds"]
["ETFs"]
["Options"]
["Bonds"]
["Commodities"]
["Currencies"]
["Futures"]
["FA Center"]
["Hedge Funds/Insider Trades"]
["Tools"]
["Getting Started"]
["Premium Newsletters"]
["Expand"]
["Keep Open"]
["Close"]
["Expand"]
["Keep Open"]
["Close"]
["Expand"]
["Keep Open"]
["Close"]
["Expand"]
{"$rows_left_out":935}
{"sheet":"GOOG MarketW","index":23,"n_rows":1002,"n_cols":5,"rows_kept":1002,"cut":false,"hidden":false,"merged":[]}
["Bulletin "]
["Investor Alert "]
["Home"]
["News Viewer"]
["Markets"]
["Investing"]
["Personal Finance"]
["Retirement"]
["Economy"]
["Real Estate"]
["Entertainment"]
["Watchlist"]
["Alerts"]
["Games"]
[]
[]
["SEARCH"]
["Stocks"]
["Funds"]
["ETFs"]
["Options"]
["Bonds"]
["Commodities"]
["Currencies"]
["Futures"]
["FA Center"]
["Hedge Funds/Insider Trades"]
["Tools"]
["Getting Started"]
["Premium Newsletters"]
["Expand"]
["Keep Open"]
["Close"]
["Expand"]
["Keep Open"]
["Close"]
["Expand"]
["Keep Open"]
["Close"]
["Expand"]
{"$rows_left_out":963}
{"sheet":"ED MarketW","index":24,"n_rows":1046,"n_cols":5,"rows_kept":1046,"cut":false,"hidden":false,"merged":[]}
["Bulletin "]
["Investor Alert "]
["Home"]
["News Viewer"]
["Markets"]
["Investing"]
["Personal Finance"]
["Retirement"]
["Economy"]
["Real Estate"]
["Entertainment"]
["Watchlist"]
["Alerts"]
["Games"]
[]
[]
["SEARCH"]
["Stocks"]
["Funds"]
["ETFs"]
["Options"]
["Bonds"]
["Commodities"]
["Currencies"]
["Futures"]
["FA Center"]
["Hedge Funds/Insider Trades"]
["Tools"]
["Getting Started"]
["Premium Newsletters"]
["Expand"]
["Keep Open"]
["Close"]
["Expand"]
["Keep Open"]
["Close"]
["Expand"]
["Keep Open"]
["Close"]
["Expand"]
{"$rows_left_out":1007}
{"sheet":"EXC MarketW","index":25,"n_rows":1002,"n_cols":5,"rows_kept":1002,"cut":false,"hidden":false,"merged":[]}
["Bulletin "]
["Investor Alert "]
["Home"]
["News Viewer"]
["Markets"]
["Investing"]
["Personal Finance"]
["Retirement"]
["Economy"]
["Real Estate"]
["Entertainment"]
["Watchlist"]
["Alerts"]
["Games"]
[]
[]
["SEARCH"]
["Stocks"]
["Funds"]
["ETFs"]
["Options"]
["Bonds"]
["Commodities"]
["Currencies"]
["Futures"]
["FA Center"]
["Hedge Funds/Insider Trades"]
["Tools"]
["Getting Started"]
["Premium Newsletters"]
["Expand"]
["Keep Open"]
["Close"]
["Expand"]
["Keep Open"]
["Close"]
["Expand"]
["Keep Open"]
["Close"]
["Expand"]
{"$rows_left_out":963}
{"sheet":"AAPL MarketW","index":26,"n_rows":958,"n_cols":5,"rows_kept":958,"cut":false,"hidden":false,"merged":[]}
["Bulletin "]
["Investor Alert "]
["Home"]
["News Viewer"]
["Markets"]
["Investing"]
["Personal Finance"]
["Retirement"]
["Economy"]
["Real Estate"]
["Entertainment"]
["Watchlist"]
["Alerts"]
["Games"]
[]
[]
["SEARCH"]
["Stocks"]
["Funds"]
["ETFs"]
["Options"]
["Bonds"]
["Commodities"]
["Currencies"]
["Futures"]
["FA Center"]
["Hedge Funds/Insider Trades"]
["Tools"]
["Getting Started"]
["Premium Newsletters"]
["Expand"]
["Keep Open"]
["Close"]
["Expand"]
["Keep Open"]
["Close"]
["Expand"]
["Keep Open"]
["Close"]
["Expand"]
{"$rows_left_out":919}
{"sheet":"NRG MarketW","index":27,"n_rows":1082,"n_cols":5,"rows_kept":1082,"cut":false,"hidden":false,"merged":[]}
["Bulletin "]
["Investor Alert "]
["Home"]
["News Viewer"]
["Markets"]
["Investing"]
["Personal Finance"]
["Retirement"]
["Economy"]
["Real Estate"]
["Entertainment"]
["Watchlist"]
["Alerts"]
["Games"]
[]
[]
["SEARCH"]
["Stocks"]
["Funds"]
["ETFs"]
["Options"]
["Bonds"]
["Commodities"]
["Currencies"]
["Futures"]
["FA Center"]
["Hedge Funds/Insider Trades"]
["Tools"]
["Getting Started"]
["Premium Newsletters"]
["Expand"]
["Keep Open"]
["Close"]
["Expand"]
["Keep Open"]
["Close"]
["Expand"]
["Keep Open"]
["Close"]
["Expand"]
{"$rows_left_out":1043}
{"sheet":"AES MarketW","index":28,"n_rows":1074,"n_cols":5,"rows_kept":1074,"cut":false,"hidden":false,"merged":[]}
["Bulletin "]
["Investor Alert "]
["Home"]
["News Viewer"]
["Markets"]
["Investing"]
["Personal Finance"]
["Retirement"]
["Economy"]
["Real Estate"]
["Entertainment"]
["Watchlist"]
["Alerts"]
["Games"]
[]
[]
["SEARCH"]
["Stocks"]
["Funds"]
["ETFs"]
["Options"]
["Bonds"]
["Commodities"]
["Currencies"]
["Futures"]
["FA Center"]
["Hedge Funds/Insider Trades"]
["Tools"]
["Getting Started"]
["Premium Newsletters"]
["Expand"]
["Keep Open"]
["Close"]
["Expand"]
["Keep Open"]
["Close"]
["Expand"]
["Keep Open"]
["Close"]
["Expand"]
{"$rows_left_out":1035}
{"sheet":"FSRL MarketW","index":29,"n_rows":598,"n_cols":5,"rows_kept":598,"cut":false,"hidden":false,"merged":[]}
["Bulletin "]
["Investor Alert "]
["Home"]
["News Viewer"]
["Markets"]
["Investing"]
["Personal Finance"]
["Retirement"]
["Economy"]
["Real Estate"]
["Entertainment"]
["Watchlist"]
["Alerts"]
["Games"]
[]
[]
["SEARCH"]
["Stocks"]
["Funds"]
["ETFs"]
["Options"]
["Bonds"]
["Commodities"]
["Currencies"]
["Futures"]
["FA Center"]
["Hedge Funds/Insider Trades"]
["Tools"]
["Getting Started"]
["Premium Newsletters"]
["Expand"]
["Keep Open"]
["Close"]
["Expand"]
["Keep Open"]
["Close"]
["Expand"]
["Keep Open"]
["Close"]
["Expand"]
{"$rows_left_out":558}