{"text_format":"1","workbook":"xlsx","n_sheets":17,"sheets":["Discussion","General Inputs","Original FM","Actual Financial Data","Change Analysis","Revised Forecast","Graph Data from Match","Graph Actual vs FM","Actual vs FM","FM Comparison Chart","FM with History","IRR and Growth","Data from PDF","Reformatted Data","Tenaga Chart","Waterfall Chart1","Waterfall Chartdata1"],"not_rendered":{"charts":11,"images":0,"macros":1,"external_links":0,"defined_names":5,"comments":0,"pivot_tables":0},"unopened":[{"sheet":"Actual vs FM","index":8,"reason":"not_a_worksheet"},{"sheet":"FM Comparison Chart","index":9,"reason":"not_a_worksheet"},{"sheet":"FM with History","index":10,"reason":"not_a_worksheet"},{"sheet":"Tenaga Chart","index":14,"reason":"not_a_worksheet"},{"sheet":"Waterfall Chart1","index":15,"reason":"not_a_worksheet"}],"bounds":{"document_bytes":16777216,"sheet_cells":100000,"rows_first":2000,"rows_last":500,"rows_between":2000,"halvings":0,"cell_chars":16384,"cell_head_chars":4096},"cells_cut":0,"cells_raw":0,"read":"whole","date_system":"1900"}

{"sheet":"Discussion","index":0,"n_rows":32,"n_cols":3,"rows_kept":32,"cut":false,"hidden":false,"merged":[]}
[]
[null,"Comparison of Actuals and Projections"]
[]
[null,"Step 1: Introduction Analysis of Project Finance Model"]
[null,null,"Financial Model and ROE, ROIC"]
[null,null,"Presentation Issues"]
[null,null,"Forecasting Methods"]
[]
{"$rows_left_out":25}
{"sheet":"General Inputs","index":1,"n_rows":3,"n_cols":5,"rows_kept":3,"cut":false,"hidden":false,"merged":[]}
[]
[]
[null,"Last Year of Actuals",null,null,2013]

{"sheet":"Original FM","index":2,"n_rows":84,"n_cols":23,"rows_kept":84,"cut":false,"hidden":false,"merged":[]}
[]
["Financial Model"]
[null,null,null,null,null,2008,{"$f":"F3+1","v":2009},2010,2011,2012,2013,2014,2015,2016,2017,2018,2019,2020,2021,2022,2023,2024,2025]
[null,"Production"]
[null,null,"Gross Energy","MWH",null,null,150000,{"$f":"G5*0.985","v":147750},{"$f":"H5*0.985","v":145533.75},143350.74374999999,141200.48259375,139082.47535484374,136996.23822452108,134941.29465115326,132917.17523138598,130923.41760291519,128959.56633887146,127025.17284378839,125119.79525113155,123242.99832236458,121394.35334752912,119573.43804731619,117779.83647660645]
[null,null,"Energy for Outage","MWH",null,null,{"$f":"G5*0.08","v":12000},{"$f":"H5*0.08","v":11820},11642.7,11468.059499999999,11296.038607500001,11126.5980283875,10959.699057961687,10795.303572092262,10633.374018510878,10473.873408233216,10316.765307109717,10162.013827503071,10009.583620090525,9859.439865789167,9711.5482678023291,9565.8750437852959,9422.3869181285154]
[null,null,"Net Energy","MWH",null,null,{"$f":"G5-G6","v":138000},135930,133891.04999999999,131882.68424999999,129904.44398625,127955.87732645625,126036.53916655939,124145.991079061,122283.8012128751,120449.54419468198,118642.80103176174,116863.15901628531,115110.21163104102,113383.55845657541,111682.80507972679,110007.56300353089,108357.44955847794]
[]
{"$rows_left_out":77}
{"sheet":"Actual Financial Data","index":3,"n_rows":34,"n_cols":11,"rows_kept":34,"cut":false,"hidden":false,"merged":[]}
[]
["Actual"]
[null,"Last Year Actual",null,null,{"$f":"'General Inputs'!E3","v":2013}]
[]
[null,"Year",null,null,null,2008,{"$f":"F5+1","v":2009},{"$f":"G5+1","v":2010},{"$f":"H5+1","v":2011},{"$f":"I5+1","v":2012},{"$f":"J5+1","v":2013}]
[null,"Switch",null,null,null,null,{"$f":"G5<=$E$3","v":true},{"$f":"H5<=$E$3","v":true},true,true,true]
[]
[null,{"$f":"'Original FM'!C5","v":"Gross Energy"},null,"MWH",null,null,135000,140000,138000,136000,135500]
{"$rows_left_out":27}
{"sheet":"Change Analysis","index":4,"n_rows":21,"n_cols":10,"rows_kept":21,"cut":false,"hidden":false,"merged":[]}
[]
[]
[null,null,"Year",2011]
[null,null,"Match",{"$f":"MATCH(D3,F6:J6,0)","v":3}]
[null,null,null,null,null,"Actual vs Financial Model Forecast"]
[null,null,null,{"$f":"INDEX(F6:J6,$D$4)","v":2011},null,{"$f":"'Original FM'!G3","v":2009},{"$f":"'Original FM'!H3","v":2010},{"$f":"'Original FM'!I3","v":2011},{"$f":"'Original FM'!J3","v":2012},{"$f":"'Original FM'!K3","v":2013}]
[null,null,"EBITDA in FM",{"$f":"INDEX(F7:J7,$D$4)","v":10341.675159330003},null,{"$f":"'Original FM'!G21","v":10287},{"$f":"'Original FM'!H21","v":10314.783900000002},{"$f":"'Original FM'!I21","v":10341.675159330003},{"$f":"'Original FM'!J21","v":10367.668739953851},{"$f":"'Original FM'!K21","v":10392.759297558514}]
[null,null,"Reduced Revenue",{"$f":"INDEX(F8:J8,$D$4)","v":-1231.4772630000007},null,{"$f":"'Actual Financial Data'!G14-'Original FM'!G11","v":-2100},{"$f":"'Actual Financial Data'!H14-'Original FM'!H11","v":-1213.2900000000009},{"$f":"'Actual Financial Data'!I14-'Original FM'!I11","v":-1231.4772630000007},{"$f":"'Actual Financial Data'!J14-'Original FM'!J11","v":-1175.1845381360981},{"$f":"'Actual Financial Data'!K14-'Original FM'!K11","v":-1039.8564206453411}]
{"$rows_left_out":14}
{"sheet":"Revised Forecast","index":5,"n_rows":69,"n_cols":28,"rows_kept":69,"cut":false,"hidden":false,"merged":[]}
[null,"Last Year Actual",null,null,null,null,null,null,null,null,null,{"$f":"'Original FM'!G3","v":2009},{"$f":"'Original FM'!H3","v":2010},{"$f":"'Original FM'!I3","v":2011},{"$f":"'Original FM'!J3","v":2012},{"$f":"'Original FM'!K3","v":2013},{"$f":"'Original FM'!L3","v":2014},{"$f":"'Original FM'!M3","v":2015},{"$f":"'Original FM'!N3","v":2016},{"$f":"'Original FM'!O3","v":2017},{"$f":"'Original FM'!P3","v":2018},{"$f":"'Original FM'!Q3","v":2019},{"$f":"'Original FM'!R3","v":2020},{"$f":"'Original FM'!S3","v":2021},{"$f":"'Original FM'!T3","v":2022},{"$f":"'Original FM'!U3","v":2023},{"$f":"'Original FM'!V3","v":2024},{"$f":"'Original FM'!W3","v":2025}]
[null,"Historic Switch",null,2013,null,null,null,null,null,null,null,{"$f":"L1<=$D$2","v":true},true,true,true,true,false,false,false,false,false,false,false,false,false,false,false,false]
[]
["Production, Revenues and Expense"]
[null,null,null,null,null,"Code","Avg Hist","Last His","Input","Growth"]
[null,"Gross Energy",null,"MWH","Financial Model ",{"$f":"MATCH(E6,'Graph Data from Match'!$C$113:$C$117,0)","v":3},{"$f":"AVERAGEIF('Actual Financial Data'!$6:$6,TRUE,'Actual Financial Data'!8:8)","v":136900},{"$f":"SUMIF('Actual Financial Data'!$5:$5,'Actual Financial Data'!$E$3,'Actual Financial Data'!8:8)","v":135500},136000,-0.01,null,{"$f":"IF(L$2,'Actual Financial Data'!G8,CHOOSE($F6,$G6,$H6,'Original FM'!G5,$I6,L61)*(1+$J6))","v":135000},{"$f":"IF(M2,'Actual Financial Data'!H8,CHOOSE($F6,$G6,$H$6,'Original FM'!H5,$I6,M61))","v":140000},{"$f":"IF(N2,'Actual Financial Data'!I8,CHOOSE($F6,$G6,$H$6,'Original FM'!I5,$I6,N61))","v":138000},{"$f":"IF(O2,'Actual Financial Data'!J8,CHOOSE($F6,$G6,$H$6,'Original FM'!J5,$I6,O61))","v":136000},{"$f":"IF(P2,'Actual Financial Data'!K8,CHOOSE($F6,$G6,$H$6,'Original FM'!K5,$I6,P61))","v":135500},{"$f":"IF(Q2,'Actual Financial Data'!L8,CHOOSE($F6,$G6,$H$6,'Original FM'!L5,$I6,Q61))","v":139082.47535484374},{"$f":"IF(R2,'Actual Financial Data'!M8,CHOOSE($F6,$G6,$H$6,'Original FM'!M5,$I6,R61))","v":136996.23822452108},{"$f":"IF(S2,'Actual Financial Data'!N8,CHOOSE($F6,$G6,$H$6,'Original FM'!N5,$I6,S61))","v":134941.29465115326},{"$f":"IF(T2,'Actual Financial Data'!O8,CHOOSE($F6,$G6,$H$6,'Original FM'!O5,$I6,T61))","v":132917.17523138598},{"$f":"IF(U2,'Actual Financial Data'!P8,CHOOSE($F6,$G6,$H$6,'Original FM'!P5,$I6,U61))","v":130923.41760291519},{"$f":"IF(V2,'Actual Financial Data'!Q8,CHOOSE($F6,$G6,$H$6,'Original FM'!Q5,$I6,V61))","v":128959.56633887146},{"$f":"IF(W2,'Actual Financial Data'!R8,CHOOSE($F6,$G6,$H$6,'Original FM'!R5,$I6,W61))","v":127025.17284378839},{"$f":"IF(X2,'Actual Financial Data'!S8,CHOOSE($F6,$G6,$H$6,'Original FM'!S5,$I6,X61))","v":125119.79525113155},{"$f":"IF(Y2,'Actual Financial Data'!T8,CHOOSE($F6,$G6,$H$6,'Original FM'!T5,$I6,Y61))","v":123242.99832236458},{"$f":"IF(Z2,'Actual Financial Data'!U8,CHOOSE($F6,$G6,$H$6,'Original FM'!U5,$I6,Z61))","v":121394.35334752912},{"$f":"IF(AA2,'Actual Financial Data'!V8,CHOOSE($F6,$G6,$H$6,'Original FM'!V5,$I6,AA61))","v":119573.43804731619},{"$f":"IF(AB2,'Actual Financial Data'!W8,CHOOSE($F6,$G6,$H$6,'Original FM'!W5,$I6,AB61))","v":117779.83647660645}]
[null,"Energy for Outage",null,"MWH","Last History",{"$f":"MATCH(E7,'Graph Data from Match'!$C$113:$C$117,0)","v":2},{"$f":"AVERAGEIF('Actual Financial Data'!$6:$6,TRUE,'Actual Financial Data'!9:9)","v":11700},{"$f":"SUMIF('Actual Financial Data'!$5:$5,'Actual Financial Data'!$E$3,'Actual Financial Data'!9:9)","v":12000},11600,-5.0000000000000001E-3,null,{"$f":"IF(L$2,'Actual Financial Data'!G9,CHOOSE($F7,$G7,$H7,'Original FM'!G6,$I7,L62)*(1+$J7))","v":11000},{"$f":"IF(M$2,'Actual Financial Data'!H9,CHOOSE($F7,$G7,$H7,'Original FM'!H6,$I7,M62)*(1+$J7))","v":12000},{"$f":"IF(N$2,'Actual Financial Data'!I9,CHOOSE($F7,$G7,$H7,'Original FM'!I6,$I7,N62)*(1+$J7))","v":12000},{"$f":"IF(O$2,'Actual Financial Data'!J9,CHOOSE($F7,$G7,$H7,'Original FM'!J6,$I7,O62)*(1+$J7))","v":11500},{"$f":"IF(P$2,'Actual Financial Data'!K9,CHOOSE($F7,$G7,$H7,'Original FM'!K6,$I7,P62)*(1+$J7))","v":12000},{"$f":"IF(Q$2,'Actual Financial Data'!L9,CHOOSE($F7,$G7,$H7,'Original FM'!L6,$I7,Q62)*(1+$J7))","v":11940},{"$f":"IF(R$2,'Actual Financial Data'!M9,CHOOSE($F7,$G7,$H7,'Original FM'!M6,$I7,R62)*(1+$J7))","v":11940},{"$f":"IF(S$2,'Actual Financial Data'!N9,CHOOSE($F7,$G7,$H7,'Original FM'!N6,$I7,S62)*(1+$J7))","v":11940},{"$f":"IF(T$2,'Actual Financial Data'!O9,CHOOSE($F7,$G7,$H7,'Original FM'!O6,$I7,T62)*(1+$J7))","v":11940},{"$f":"IF(U$2,'Actual Financial Data'!P9,CHOOSE($F7,$G7,$H7,'Original FM'!P6,$I7,U62)*(1+$J7))","v":11940},{"$f":"IF(V$2,'Actual Financial Data'!Q9,CHOOSE($F7,$G7,$H7,'Original FM'!Q6,$I7,V62)*(1+$J7))","v":11940},{"$f":"IF(W$2,'Actual Financial Data'!R9,CHOOSE($F7,$G7,$H7,'Original FM'!R6,$I7,W62)*(1+$J7))","v":11940},{"$f":"IF(X$2,'Actual Financial Data'!S9,CHOOSE($F7,$G7,$H7,'Original FM'!S6,$I7,X62)*(1+$J7))","v":11940},{"$f":"IF(Y$2,'Actual Financial Data'!T9,CHOOSE($F7,$G7,$H7,'Original FM'!T6,$I7,Y62)*(1+$J7))","v":11940},{"$f":"IF(Z$2,'Actual Financial Data'!U9,CHOOSE($F7,$G7,$H7,'Original FM'!U6,$I7,Z62)*(1+$J7))","v":11940},{"$f":"IF(AA$2,'Actual Financial Data'!V9,CHOOSE($F7,$G7,$H7,'Original FM'!V6,$I7,AA62)*(1+$J7))","v":11940},{"$f":"IF(AB$2,'Actual Financial Data'!W9,CHOOSE($F7,$G7,$H7,'Original FM'!W6,$I7,AB62)*(1+$J7))","v":11940}]
[null,"Net Energy",null,"MWH",null,null,null,null,null,null,null,{"$f":"L6-L7","v":124000},128000,126000,124500,123500,127142.47535484374,125056.23822452108,123001.29465115326,120977.17523138598,118983.41760291519,117019.56633887146,115085.17284378839,113179.79525113155,111302.99832236458,109454.35334752912,107633.43804731619,105839.83647660645]
{"$rows_left_out":62}
{"sheet":"Graph Data from Match","index":6,"n_rows":123,"n_cols":32,"rows_kept":123,"cut":false,"hidden":false,"merged":[]}
["Detailed Forecast/Graph List",null,null,null,null,null,null,null,null,null,null,null,null,null,null,"Raw Data"]
[null,null,null,"FM Row",null,"Actual Col B","Actual Col C","Final Match Actual",null,null,null,null,null,null,null,"Pct of Energy"]
[null,"Gross Energy",null,{"$f":"MATCH(B3,'Original FM'!C:C,0)","v":5},null,{"$f":"MATCH(B3,'Actual Financial Data'!B:B,0)","v":8},{"$f":"MATCH(B3,'Actual Financial Data'!C:C,0)","v":{"$error":"#N/A"}},{"$f":"na_sum(F3:G3)","v":8},null,null,null,null,null,null,null,"Pct of Revenue"]
[null,"Energy for Outage",null,{"$f":"MATCH(B4,'Original FM'!C:C,0)","v":6},null,{"$f":"MATCH(B4,'Actual Financial Data'!B:B,0)","v":{"$error":"#N/A"}},{"$f":"MATCH(B4,'Actual Financial Data'!C:C,0)","v":9},{"$f":"na_sum(F4:G4)","v":9},null,null,null,null,null,null,null,"Pct of Expense",null,1]
[null,"Royalty Expense",null,{"$f":"MATCH(B5,'Original FM'!C:C,0)","v":13},null,{"$f":"MATCH(B5,'Actual Financial Data'!B:B,0)","v":16},{"$f":"MATCH(B5,'Actual Financial Data'!C:C,0)","v":{"$error":"#N/A"}},16]
[null,"Labour at Plant - Operations",null,{"$f":"MATCH(B6,'Original FM'!C:C,0)","v":14},null,{"$f":"MATCH(B6,'Actual Financial Data'!B:B,0)","v":17},{"$f":"MATCH(B6,'Actual Financial Data'!C:C,0)","v":{"$error":"#N/A"}},17,null,null,"Code Number",null,3]
[null,"Materials for Maintenance",null,{"$f":"MATCH(B7,'Original FM'!C:C,0)","v":15},null,{"$f":"MATCH(B7,'Actual Financial Data'!B:B,0)","v":18},{"$f":"MATCH(B7,'Actual Financial Data'!C:C,0)","v":{"$error":"#N/A"}},18,null,null,null,null,null,null,2009,2010,2011,2012,2013,2014,2015,2016,2017,2018,2019,2020]
[null,"Labour for Maintenance",null,{"$f":"MATCH(B8,'Original FM'!C:C,0)","v":16},null,{"$f":"MATCH(B8,'Actual Financial Data'!B:B,0)","v":19},{"$f":"MATCH(B8,'Actual Financial Data'!C:C,0)","v":{"$error":"#N/A"}},19]
{"$rows_left_out":116}
{"sheet":"Graph Actual vs FM","index":7,"n_rows":0,"n_cols":0,"rows_kept":0,"cut":false,"hidden":false,"merged":[]}

{"sheet":"IRR and Growth","index":11,"n_rows":9,"n_cols":10,"rows_kept":9,"cut":false,"hidden":false,"merged":[]}
[null,null,"One Year Case",null,null,"Two Year Case",null,null,"Three Year Case"]
[]
[null,"Cash Outflow",-100,100,null,-100,100,null,-100,100]
[null,null,null,null,null,null,null,null,0]
[null,null,null,null,null,0,null,null,0]
[null,"Cash Inflow",110,110,null,110,110,null,110,110]
[]
[null,"IRR",{"$f":"IRR(C3:C6)","v":0.10000000000000009},null,null,{"$f":"IRR(F3:F6)","v":4.8808848169907604E-2},null,null,{"$f":"IRR(I3:I6)","v":3.2280115456367664E-2}]
{"$rows_left_out":2}
{"sheet":"Data from PDF","index":12,"n_rows":40,"n_cols":1,"rows_kept":40,"cut":false,"hidden":false,"merged":[]}
["five-year"]
["group financial"]
["summary"]
["Group"]
["Year Ended 31 August"]
[2011]
["(Restated)"]
[2012]
{"$rows_left_out":33}
{"sheet":"Reformatted Data","index":13,"n_rows":31,"n_cols":6,"rows_kept":31,"cut":false,"hidden":false,"merged":[]}
[null,2011,2012,2013,2014,2015]
["OPERATING RESULTS RM MILLION Revenue",32241.200000000001,35848.400000000001,37130.699999999997,42792.4,43286.8]
["Operating Profit",1816.8,6680.8,5906.9,7181,8627.6]
["Profit before taxation and zakat",1156.7,5821.1,5925.1,7114.7,7133.7]
["Net profit attributable to owners of the Company",965.4,4410.5,5356.2,6467,6118.4]
["KEY BALANCE SHEET DATA RM MILLION Property plant and equipment",61861.4,64769.9,75460.5,83045.100000000006,90300.3]
["Total assets",79064.3,88469.1,99999.3,110665.4,117135]
["Total borrowings",19054.099999999999,23071.8,22888.400000000001,25456,24698.9]
{"$rows_left_out":24}
{"sheet":"Waterfall Chartdata1","index":16,"n_rows":20,"n_cols":86,"rows_kept":20,"cut":false,"hidden":false,"merged":[]}
["EBITDA in FM \r 10,314.78",10314.783900000002,null,null,687.65226000000018,10314.783900000002,null,null,null,null,null,null,10314.783900000002,{"$f":"M1","v":10314.783900000002},null,{"$f":"N1","v":10314.783900000002},{"$f":"ABS(O1)","v":0},null,null,null,null,null,null,null,null,null,null,null,null,null,null,null,null,null,null,null,null,null,null,null,null,null,null,null,null,null,null,null,null,null,null,{"$f":"waterfall_graph_data1","v":"EBITDA in FM"},10341.675159330003,{"$f":"BA1","v":10341.675159330003},null,{"$f":"BB1","v":10341.675159330003},{"$f":"ABS(BC1)","v":0},687.65226000000018,{"$f":"BD1","v":10341.675159330003},{"$f":"IF(BC1>=0,0,BF1)","v":0},{"$f":"IF(BC1<0,0,BF1)","v":687.65226000000018},{"$f":"BA1","v":10341.675159330003},null,null,null,null,null,null,{"$f":"AZ1","v":"EBITDA in FM"}," \n",{"$f":"BB1","v":10341.675159330003},{"$f":"BQ1&BR1&TEXT(BS1,\"*,#,##0.00;(*,(#,##0.00);(* ??_);_(@_)\")","v":"EBITDA in FM \n10,341.68"},{"$f":"BG1","v":10341.675159330003},{"$f":"BH1","v":0},{"$f":"BE1","v":0},{"$f":"BI1","v":687.65226000000018},{"$f":"BB1","v":10341.675159330003}]
["Reduced Revenue \r 9,101.49",8413.8416400000006,687.65226000000018,1213.2900000000009,null,10314.783900000002,9101.4939000000013,null,null,null,null,null,-1213.2900000000009,{"$f":"IF(M2<>0,N1+M2,N1)","v":9101.4939000000013},{"$f":"N2-N1","v":-1213.2900000000009},{"$f":"IF(O2>=0,N2-O2,N1+O2)","v":9101.4939000000013},1213.2900000000009,null,null,null,null,null,null,null,null,null,null,null,null,null,null,null,null,null,null,null,null,null,null,null,null,null,null,null,null,null,null,null,null,null,null,"Reduced Revenue",-1231.4772630000007,{"$f":"IF(BA2<>0,BB1+BA2,BB1)","v":9110.1978963300025},{"$f":"BB2-BB1","v":-1231.4772630000007},{"$f":"IF(BC2>=0,BB2-BC2,BB1+BC2)","v":9110.1978963300025},1231.4772630000007,687.65226000000018,{"$f":"IF(BC2>=0,BD2,BD2-BF2)","v":8422.5456363300018},687.65226000000018,0,{"$f":"IF(BC2<>0,BC2,BB2)","v":-1231.4772630000007},null,null,null,null,null,null,"Reduced Revenue"," \n",9110.1978963300025,"Reduced Revenue \n9,110.20",8422.5456363300018,687.65226000000018,1231.4772630000007,0,{"$f":"BB1","v":10341.675159330003},{"$f":"BB2","v":9110.1978963300025}]
["Sub Total \r 9,101.49",9101.4939000000013,null,0,687.65226000000018,null,9101.4939000000013,9101.4939000000013,null,null,null,null,null,9101.4939000000013,0,9101.4939000000013,0,null,null,null,null,null,null,null,null,null,null,null,null,null,null,null,null,null,null,null,null,null,null,null,null,null,null,null,null,null,null,null,null,null,null,"Sub Total",0,9110.1978963300025,0,9110.1978963300025,0,687.65226000000018,9110.1978963300025,0,687.65226000000018,9110.1978963300025,null,null,null,null,null,null,"Sub Total"," \n",9110.1978963300025,"Sub Total \n9,110.20",9110.1978963300025,0,0,687.65226000000018,null,{"$f":"BB2","v":9110.1978963300025},{"$f":"BB3","v":9110.1978963300025}]
["Royalty Expense \r 9,573.25",9101.4939000000013,null,471.75610000000052,687.65226000000018,null,null,9101.4939000000013,9573.2500000000018,null,null,null,471.75610000000006,9573.2500000000018,471.75610000000052,9101.4939000000013,471.75610000000052,null,null,null,null,null,null,null,null,null,null,null,null,null,null,null,null,null,null,null,null,null,null,null,null,null,null,null,null,null,null,null,null,null,null,"Royalty Expense",530.55335367000021,9640.751250000003,530.55335367000043,9110.1978963300025,530.55335367000043,687.65226000000018,9110.1978963300025,0,687.65226000000018,530.55335367000043,null,null,null,null,null,null,"Royalty Expense"," \n",9640.751250000003,"Royalty Expense \n9,640.75",9110.1978963300025,0,530.55335367000043,687.65226000000018,null,null,{"$f":"BB3","v":9110.1978963300025},{"$f":"BB4","v":9640.751250000003}]
["Labour at Plant - Operations \r 9,321.25",8633.5977400000011,687.65226000000018,252,null,null,null,null,9573.2500000000018,9321.2500000000018,null,null,-252.00000000000045,9321.2500000000018,-252,9321.2500000000018,252,null,null,null,null,null,null,null,null,null,null,null,null,null,null,null,null,null,null,null,null,null,null,null,null,null,null,null,null,null,null,null,null,null,null,"Labour at Plant - Operations",496.71999999999935,10137.471250000002,496.71999999999935,9640.751250000003,496.71999999999935,687.65226000000018,9640.751250000003,0,687.65226000000018,496.71999999999935,null,null,null,null,null,null,"Labour at Plant - Operations"," \n",10137.471250000002,"Labour at Plant - Operations \n10,137.47",9640.751250000003,0,496.71999999999935,687.65226000000018,null,null,null,{"$f":"BB4","v":9640.751250000003},{"$f":"BB5","v":10137.471250000002}]
["Materials for Maintenance \r 9,405.25",9321.2500000000018,null,84,687.65226000000018,null,null,null,null,9321.2500000000018,9405.2500000000018,null,84,9405.2500000000018,84,9321.2500000000018,84,null,null,null,null,null,null,null,null,null,null,null,null,null,null,null,null,null,null,null,null,null,null,null,null,null,null,null,null,null,null,null,null,null,null,"Materials for Maintenance",118.31999999999994,10255.791250000002,118.31999999999971,10137.471250000002,118.31999999999971,687.65226000000018,10137.471250000002,0,687.65226000000018,118.31999999999971,null,null,null,null,null,null,"Materials for Maintenance"," \n",10255.791250000002,"Materials for Maintenance \n10,255.79",10137.471250000002,0,118.31999999999971,687.65226000000018,null,null,null,null,{"$f":"BB5","v":10137.471250000002},{"$f":"BB6","v":10255.791250000002}]
["Labour for Maintenance \r 9,230.25",8542.5977400000011,687.65226000000018,175,null,null,null,null,null,null,9405.2500000000018,9230.2500000000018,-175,9230.2500000000018,-175,9230.2500000000018,175,null,null,null,null,null,null,null,null,null,null,null,null,null,null,null,null,null,null,null,null,null,null,null,null,null,null,null,null,null,null,null,null,null,null,"Labour for Maintenance",-49.75,10206.041250000002,-49.75,10206.041250000002,49.75,687.65226000000018,9518.3889900000013,687.65226000000018,0,-49.75,null,null,null,null,null,null,"Labour for Maintenance"," \n",10206.041250000002,"Labour for Maintenance \n10,206.04",9518.3889900000013,687.65226000000018,49.75,0,null,null,null,null,null,{"$f":"BB6","v":10255.791250000002},{"$f":"BB7","v":10206.041250000002}]
["Other Admin Expense \r 9,354.00",9230.2500000000018,null,123.75,687.65226000000018,null,null,null,null,null,null,9230.2500000000018,123.74999999999989,9354.0000000000018,123.75,9230.2500000000018,123.75,null,null,null,null,null,null,null,null,null,null,null,null,null,null,null,null,null,null,null,null,null,null,null,null,null,null,null,null,null,null,null,null,null,null,"Other Admin Expense",117.51874999999984,10323.560000000001,117.51874999999927,10206.041250000002,117.51874999999927,687.65226000000018,10206.041250000002,0,687.65226000000018,117.51874999999927,null,null,null,null,null,null,"Other Admin Expense"," \n",10323.560000000001,"Other Admin Expense \n10,323.56",10206.041250000002,0,117.51874999999927,687.65226000000018,null,null,null,null,null,null,{"$f":"BB7","v":10206.041250000002},{"$f":"BB8","v":10323.560000000001}]
{"$rows_left_out":12}