{"text_format":"1","workbook":"xlsx","n_sheets":12,"sheets":["Contents","Summary","Assumptions","S&U and Pro-Forma","LBO Model","Chart1","1.05 - Implied COC in LBO","Annual Model","Audit sheet","Tornado Chart","PE Scenario","PE Ratio"],"not_rendered":{"charts":7,"images":1,"macros":1,"external_links":0,"defined_names":20,"comments":1,"pivot_tables":0},"unopened":[{"sheet":"Chart1","index":5,"reason":"not_a_worksheet"},{"sheet":"Tornado Chart","index":9,"reason":"not_a_worksheet"}],"bounds":{"document_bytes":16777216,"sheet_cells":100000,"rows_first":2000,"rows_last":500,"rows_between":2000,"halvings":0,"cell_chars":16384,"cell_head_chars":4096},"cells_cut":0,"cells_raw":0,"read":"whole","date_system":"1900"}

{"sheet":"Contents","index":0,"n_rows":24,"n_cols":10,"rows_kept":24,"cut":false,"hidden":false,"merged":[]}
[]
[]
[null,null,"Sheet Tab","Description","Author",null,null,null,null,"Depreciation"]
[null,1,"Contents",null,null,null,null,null,null,"Goal Seek for Entry Multiple"]
[null,2,"Summary",null,null,null,null,null,null,"Finish Balance Sheet"]
[null,3,"Assumptions",null,null,null,null,null,null,"Data Tables in Different Sheets"]
[null,4,"S&U and Pro-Forma",null,null,null,null,null,null,"Audit Sheet"]
[null,5,"LBO",null,null,null,null,null,null,"Taxes with NOL"]
{"$rows_left_out":17}
{"sheet":"Summary","index":1,"n_rows":24,"n_cols":10,"rows_kept":24,"cut":false,"hidden":false,"merged":[]}
[]
["Sources and uses of funds",null,null,null,null,null,"Transaction Assumptions"]
[null,"Uses of funds",null,null,null,null,null,"Entry EV/EBITDA",null,{"$f":"Assumptions!E61","v":8.0229612262464762}]
[null,null,"Consideration",null,{"$f":"Assumptions!E13","v":473},null,null,"Entry P/E Ratio",null,{"$f":"Assumptions!E48","v":13.514285714285714}]
[null,null,"Debt fees",null,{"$f":"SUM(Assumptions!E101:E103)*Assumptions!E123","v":4.6499999999999995},null,null,"Entry M/B Ratio",null,{"$f":"Assumptions!E43","v":3.0516129032258066}]
[null,null,"Advisory fees",null,{"$f":"E4*Assumptions!E124","v":4.7300000000000004}]
[null,null,"Existing debt paydown",null,{"$f":"Assumptions!E95","v":100},null,"Assumptions"]
[null,null,"Dividend payment",null,{"$f":"Assumptions!E97","v":40},null,null,"Revnue Growth"]
{"$rows_left_out":17}
{"sheet":"Assumptions","index":2,"n_rows":135,"n_cols":13,"rows_kept":135,"cut":false,"hidden":false,"merged":[]}
[]
["Transaction assumptions"]
[null,"Entry EV to EBITDA",null,null,7]
[null,"Holding period",null,null,8,null,null,"Ungeared IRR",{"$f":"'LBO Model'!G45","v":0.14480487704277037}]
[null,"Exit EV to EBITDA",null,null,5,null,null,"Equity IRR",{"$f":"'LBO Model'!G227","v":0.19484276479041451}]
[null,"Target Equity IRR",null,null,0.2]
[]
[null,"Transaction date",null,null,"2015-10-01"]
{"$rows_left_out":128}
{"sheet":"S&U and Pro-Forma","index":3,"n_rows":76,"n_cols":14,"rows_kept":76,"cut":false,"hidden":false,"merged":[[53,1,53,3]]}
[]
["Sources and uses of funds",null,null,null,{"$f":"Assumptions!E8","v":"2015-10-01"}]
[null,"Uses of funds"]
[null,null,"Consideration",null,{"$f":"Assumptions!E13","v":473}]
[null,null,"Debt fees",null,{"$f":"SUM(Assumptions!E101:E103)*Assumptions!E123","v":4.6499999999999995}]
[null,null,"Advisory fees",null,{"$f":"E4*Assumptions!E124","v":4.7300000000000004}]
[null,null,"existing debt paydown",null,{"$f":"Assumptions!E95","v":100}]
[null,null,"dividend payment",null,{"$f":"Assumptions!E97","v":40}]
{"$rows_left_out":69}
{"sheet":"LBO Model","index":4,"n_rows":291,"n_cols":61,"rows_kept":291,"cut":false,"hidden":false,"merged":[[255,1,255,3]]}
["Timings"]
[]
[null,"Date",null,null,null,null,{"$f":"Assumptions!E8","v":"2015-10-01"},{"$f":"EDATE(G3,Assumptions!$E$12)","v":"2016-01-01"},{"$f":"EDATE(H3,Assumptions!$E$12)","v":"2016-04-01"},{"$f":"EDATE(I3,Assumptions!$E$12)","v":"2016-07-01"},{"$f":"EDATE(J3,Assumptions!$E$12)","v":"2016-10-01"},{"$f":"EDATE(K3,Assumptions!$E$12)","v":"2017-01-01"},{"$f":"EDATE(L3,Assumptions!$E$12)","v":"2017-04-01"},{"$f":"EDATE(M3,Assumptions!$E$12)","v":"2017-07-01"},{"$f":"EDATE(N3,Assumptions!$E$12)","v":"2017-10-01"},{"$f":"EDATE(O3,Assumptions!$E$12)","v":"2018-01-01"},{"$f":"EDATE(P3,Assumptions!$E$12)","v":"2018-04-01"},{"$f":"EDATE(Q3,Assumptions!$E$12)","v":"2018-07-01"},{"$f":"EDATE(R3,Assumptions!$E$12)","v":"2018-10-01"},{"$f":"EDATE(S3,Assumptions!$E$12)","v":"2019-01-01"},{"$f":"EDATE(T3,Assumptions!$E$12)","v":"2019-04-01"},{"$f":"EDATE(U3,Assumptions!$E$12)","v":"2019-07-01"},{"$f":"EDATE(V3,Assumptions!$E$12)","v":"2019-10-01"},{"$f":"EDATE(W3,Assumptions!$E$12)","v":"2020-01-01"},{"$f":"EDATE(X3,Assumptions!$E$12)","v":"2020-04-01"},{"$f":"EDATE(Y3,Assumptions!$E$12)","v":"2020-07-01"},{"$f":"EDATE(Z3,Assumptions!$E$12)","v":"2020-10-01"},{"$f":"EDATE(AA3,Assumptions!$E$12)","v":"2021-01-01"},{"$f":"EDATE(AB3,Assumptions!$E$12)","v":"2021-04-01"},{"$f":"EDATE(AC3,Assumptions!$E$12)","v":"2021-07-01"},{"$f":"EDATE(AD3,Assumptions!$E$12)","v":"2021-10-01"},{"$f":"EDATE(AE3,Assumptions!$E$12)","v":"2022-01-01"},{"$f":"EDATE(AF3,Assumptions!$E$12)","v":"2022-04-01"},{"$f":"EDATE(AG3,Assumptions!$E$12)","v":"2022-07-01"},{"$f":"EDATE(AH3,Assumptions!$E$12)","v":"2022-10-01"},{"$f":"EDATE(AI3,Assumptions!$E$12)","v":"2023-01-01"},{"$f":"EDATE(AJ3,Assumptions!$E$12)","v":"2023-04-01"},{"$f":"EDATE(AK3,Assumptions!$E$12)","v":"2023-07-01"},{"$f":"EDATE(AL3,Assumptions!$E$12)","v":"2023-10-01"},{"$f":"EDATE(AM3,Assumptions!$E$12)","v":"2024-01-01"},{"$f":"EDATE(AN3,Assumptions!$E$12)","v":"2024-04-01"},{"$f":"EDATE(AO3,Assumptions!$E$12)","v":"2024-07-01"},{"$f":"EDATE(AP3,Assumptions!$E$12)","v":"2024-10-01"},{"$f":"EDATE(AQ3,Assumptions!$E$12)","v":"2025-01-01"},{"$f":"EDATE(AR3,Assumptions!$E$12)","v":"2025-04-01"},{"$f":"EDATE(AS3,Assumptions!$E$12)","v":"2025-07-01"},{"$f":"EDATE(AT3,Assumptions!$E$12)","v":"2025-10-01"},{"$f":"EDATE(AU3,Assumptions!$E$12)","v":"2026-01-01"},{"$f":"EDATE(AV3,Assumptions!$E$12)","v":"2026-04-01"},{"$f":"EDATE(AW3,Assumptions!$E$12)","v":"2026-07-01"},{"$f":"EDATE(AX3,Assumptions!$E$12)","v":"2026-10-01"},{"$f":"EDATE(AY3,Assumptions!$E$12)","v":"2027-01-01"},{"$f":"EDATE(AZ3,Assumptions!$E$12)","v":"2027-04-01"},{"$f":"EDATE(BA3,Assumptions!$E$12)","v":"2027-07-01"},{"$f":"EDATE(BB3,Assumptions!$E$12)","v":"2027-10-01"},{"$f":"EDATE(BC3,Assumptions!$E$12)","v":"2028-01-01"},{"$f":"EDATE(BD3,Assumptions!$E$12)","v":"2028-04-01"},{"$f":"EDATE(BE3,Assumptions!$E$12)","v":"2028-07-01"},{"$f":"EDATE(BF3,Assumptions!$E$12)","v":"2028-10-01"},{"$f":"EDATE(BG3,Assumptions!$E$12)","v":"2029-01-01"},{"$f":"EDATE(BH3,Assumptions!$E$12)","v":"2029-04-01"}]
[null,"Cash flow date",null,null,null,null,{"$f":"G3","v":"2015-10-01"},{"$f":"IF(H6,H3,AVERAGE(G3:H3))","v":"2015-11-16"},"2016-02-15T12:00:00","2016-05-16T12:00:00","2016-08-16","2016-11-16","2017-02-15","2017-05-16T12:00:00","2017-08-16","2017-11-16","2018-02-15","2018-05-16T12:00:00","2018-08-16","2018-11-16","2019-02-15","2019-05-16T12:00:00","2019-08-16","2019-11-16","2020-02-15T12:00:00","2020-05-16T12:00:00","2020-08-16","2020-11-16","2021-02-15","2021-05-16T12:00:00","2021-08-16","2021-11-16","2022-02-15","2022-05-16T12:00:00","2022-08-16","2022-11-16","2023-02-15","2023-05-16T12:00:00","2023-10-01",{"$f":"IF(AN6,AN3,AVERAGE(AM3:AN3))","v":"2023-11-16"},"2024-02-15T12:00:00","2024-05-16T12:00:00","2024-08-16","2024-11-16","2025-02-15","2025-05-16T12:00:00","2025-08-16","2025-11-16","2026-02-15","2026-05-16T12:00:00","2026-08-16","2026-11-16","2027-02-15","2027-05-16T12:00:00","2027-08-16","2027-11-16","2028-02-15T12:00:00","2028-05-16T12:00:00","2028-08-16","2028-11-16","2029-02-15"]
[null,"Holding period",null,null,null,null,null,{"$f":"AND(H3<=Assumptions!$E$9)","v":true},{"$f":"AND(I3<=Assumptions!$E$9)","v":true},{"$f":"AND(J3<=Assumptions!$E$9)","v":true},{"$f":"AND(K3<=Assumptions!$E$9)","v":true},{"$f":"AND(L3<=Assumptions!$E$9)","v":true},{"$f":"AND(M3<=Assumptions!$E$9)","v":true},{"$f":"AND(N3<=Assumptions!$E$9)","v":true},{"$f":"AND(O3<=Assumptions!$E$9)","v":true},{"$f":"AND(P3<=Assumptions!$E$9)","v":true},{"$f":"AND(Q3<=Assumptions!$E$9)","v":true},{"$f":"AND(R3<=Assumptions!$E$9)","v":true},{"$f":"AND(S3<=Assumptions!$E$9)","v":true},{"$f":"AND(T3<=Assumptions!$E$9)","v":true},{"$f":"AND(U3<=Assumptions!$E$9)","v":true},{"$f":"AND(V3<=Assumptions!$E$9)","v":true},{"$f":"AND(W3<=Assumptions!$E$9)","v":true},{"$f":"AND(X3<=Assumptions!$E$9)","v":true},{"$f":"AND(Y3<=Assumptions!$E$9)","v":true},{"$f":"AND(Z3<=Assumptions!$E$9)","v":true},{"$f":"AND(AA3<=Assumptions!$E$9)","v":true},{"$f":"AND(AB3<=Assumptions!$E$9)","v":true},{"$f":"AND(AC3<=Assumptions!$E$9)","v":true},{"$f":"AND(AD3<=Assumptions!$E$9)","v":true},{"$f":"AND(AE3<=Assumptions!$E$9)","v":true},{"$f":"AND(AF3<=Assumptions!$E$9)","v":true},{"$f":"AND(AG3<=Assumptions!$E$9)","v":true},{"$f":"AND(AH3<=Assumptions!$E$9)","v":true},{"$f":"AND(AI3<=Assumptions!$E$9)","v":true},{"$f":"AND(AJ3<=Assumptions!$E$9)","v":true},{"$f":"AND(AK3<=Assumptions!$E$9)","v":true},{"$f":"AND(AL3<=Assumptions!$E$9)","v":true},{"$f":"AND(AM3<=Assumptions!$E$9)","v":true},{"$f":"AND(AN3<=Assumptions!$E$9)","v":false},{"$f":"AND(AO3<=Assumptions!$E$9)","v":false},{"$f":"AND(AP3<=Assumptions!$E$9)","v":false},{"$f":"AND(AQ3<=Assumptions!$E$9)","v":false},{"$f":"AND(AR3<=Assumptions!$E$9)","v":false},{"$f":"AND(AS3<=Assumptions!$E$9)","v":false},{"$f":"AND(AT3<=Assumptions!$E$9)","v":false},{"$f":"AND(AU3<=Assumptions!$E$9)","v":false},{"$f":"AND(AV3<=Assumptions!$E$9)","v":false},{"$f":"AND(AW3<=Assumptions!$E$9)","v":false},{"$f":"AND(AX3<=Assumptions!$E$9)","v":false},{"$f":"AND(AY3<=Assumptions!$E$9)","v":false},{"$f":"AND(AZ3<=Assumptions!$E$9)","v":false},{"$f":"AND(BA3<=Assumptions!$E$9)","v":false},{"$f":"AND(BB3<=Assumptions!$E$9)","v":false},{"$f":"AND(BC3<=Assumptions!$E$9)","v":false},{"$f":"AND(BD3<=Assumptions!$E$9)","v":false},{"$f":"AND(BE3<=Assumptions!$E$9)","v":false},{"$f":"AND(BF3<=Assumptions!$E$9)","v":false},{"$f":"AND(BG3<=Assumptions!$E$9)","v":false},{"$f":"AND(BH3<=Assumptions!$E$9)","v":false},{"$f":"AND(BI3<=Assumptions!$E$9)","v":false}]
[null,"Exit period",null,null,null,null,null,{"$f":"H3=Assumptions!$E$9","v":false},{"$f":"I3=Assumptions!$E$9","v":false},{"$f":"J3=Assumptions!$E$9","v":false},{"$f":"K3=Assumptions!$E$9","v":false},{"$f":"L3=Assumptions!$E$9","v":false},{"$f":"M3=Assumptions!$E$9","v":false},{"$f":"N3=Assumptions!$E$9","v":false},{"$f":"O3=Assumptions!$E$9","v":false},{"$f":"P3=Assumptions!$E$9","v":false},{"$f":"Q3=Assumptions!$E$9","v":false},{"$f":"R3=Assumptions!$E$9","v":false},{"$f":"S3=Assumptions!$E$9","v":false},{"$f":"T3=Assumptions!$E$9","v":false},{"$f":"U3=Assumptions!$E$9","v":false},{"$f":"V3=Assumptions!$E$9","v":false},{"$f":"W3=Assumptions!$E$9","v":false},{"$f":"X3=Assumptions!$E$9","v":false},{"$f":"Y3=Assumptions!$E$9","v":false},{"$f":"Z3=Assumptions!$E$9","v":false},{"$f":"AA3=Assumptions!$E$9","v":false},{"$f":"AB3=Assumptions!$E$9","v":false},{"$f":"AC3=Assumptions!$E$9","v":false},{"$f":"AD3=Assumptions!$E$9","v":false},{"$f":"AE3=Assumptions!$E$9","v":false},{"$f":"AF3=Assumptions!$E$9","v":false},{"$f":"AG3=Assumptions!$E$9","v":false},{"$f":"AH3=Assumptions!$E$9","v":false},{"$f":"AI3=Assumptions!$E$9","v":false},{"$f":"AJ3=Assumptions!$E$9","v":false},{"$f":"AK3=Assumptions!$E$9","v":false},{"$f":"AL3=Assumptions!$E$9","v":false},{"$f":"AM3=Assumptions!$E$9","v":true},{"$f":"AN3=Assumptions!$E$9","v":false},{"$f":"AO3=Assumptions!$E$9","v":false},{"$f":"AP3=Assumptions!$E$9","v":false},{"$f":"AQ3=Assumptions!$E$9","v":false},{"$f":"AR3=Assumptions!$E$9","v":false},{"$f":"AS3=Assumptions!$E$9","v":false},{"$f":"AT3=Assumptions!$E$9","v":false},{"$f":"AU3=Assumptions!$E$9","v":false},{"$f":"AV3=Assumptions!$E$9","v":false},{"$f":"AW3=Assumptions!$E$9","v":false},{"$f":"AX3=Assumptions!$E$9","v":false},{"$f":"AY3=Assumptions!$E$9","v":false},{"$f":"AZ3=Assumptions!$E$9","v":false},{"$f":"BA3=Assumptions!$E$9","v":false},{"$f":"BB3=Assumptions!$E$9","v":false},{"$f":"BC3=Assumptions!$E$9","v":false},{"$f":"BD3=Assumptions!$E$9","v":false},{"$f":"BE3=Assumptions!$E$9","v":false},{"$f":"BF3=Assumptions!$E$9","v":false},{"$f":"BG3=Assumptions!$E$9","v":false},{"$f":"BH3=Assumptions!$E$9","v":false},{"$f":"BI3=Assumptions!$E$9","v":false}]
[null,"Year",null,null,null,null,{"$f":"YEAR(G3)","v":2015},{"$f":"YEAR(H3)","v":2016},2016,2016,2016,2017,2017,2017,2017,2018,2018,2018,2018,2019,2019,2019,2019,2020,2020,2020,2020,2021,2021,2021,2021,2022,2022,2022,2022,2023,2023,2023,2023,2024,2024,2024,2024,{"$f":"YEAR(AR3)","v":2025},2025,2025,2025,2026,2026,2026,2026,2027,2027,2027,2027,2028,2028,2028,2028,2029,2029]
[null,"Period",null,null,null,null,0,{"$f":"G8+1","v":1},{"$f":"H8+1","v":2},{"$f":"I8+1","v":3},{"$f":"J8+1","v":4},5,6,7,8,9,10,11,12,13,14,15,16,17,{"$f":"X8+1","v":18},{"$f":"Y8+1","v":19},{"$f":"Z8+1","v":20},{"$f":"AA8+1","v":21},{"$f":"AB8+1","v":22},{"$f":"AC8+1","v":23},{"$f":"AD8+1","v":24},{"$f":"AE8+1","v":25},{"$f":"AF8+1","v":26},{"$f":"AG8+1","v":27},{"$f":"AH8+1","v":28},{"$f":"AI8+1","v":29},{"$f":"AJ8+1","v":30},{"$f":"AK8+1","v":31},{"$f":"AL8+1","v":32},{"$f":"AM8+1","v":33},{"$f":"AN8+1","v":34},{"$f":"AO8+1","v":35},{"$f":"AP8+1","v":36},37,38,39,40,41,42,43,44,45,46,47,48,49,50,51,52,53,54]
{"$rows_left_out":284}
{"sheet":"1.05 - Implied COC in LBO","index":6,"n_rows":108,"n_cols":25,"rows_kept":108,"cut":false,"hidden":false,"merged":[[31,2,37,2],[15,0,15,12],[17,4,17,11],[19,2,25,2],[27,0,27,12],[29,4,29,11],[63,4,63,9],[65,2,74,2],[42,2,42,9],[44,4,44,8],[46,2,55,2]]}
[]
[null,null,null,null,null,null,null,null,null,null,null,null,null,null,null,"Table Number",null,3]
[]
[null,null,null,null,null,null,null,null,null,null,null,null,null,null,{"$f":"show_formulaL(Row_Start)","v":"=INDEX(U4:X4,$R$2)----> "},null,null,{"$f":"INDEX(U4:X4,$R$2)","v":47},"Row Start",null,{"$f":"ROW(E20)","v":20},{"$f":"ROW(D32)","v":32},{"$f":"ROW(E47)","v":47},{"$f":"ROW(D66)","v":66},{"$f":"show_formulaR(X4)","v":"< ---- =ROW(D66)"}]
["Equity IRR",null,{"$f":"Assumptions!I5","v":0.19484276479041451},null,null,null,null,null,null,null,null,null,null,null,{"$f":"show_formulaL(Row_Start)","v":"=INDEX(U4:X4,$R$2)----> "},null,null,{"$f":"INDEX(U5:X5,$R$2)","v":56},"Row End",null,{"$f":"ROW(C26)","v":26},{"$f":"ROW(D38)","v":38},{"$f":"ROW(E56)","v":56},{"$f":"ROW(D75)","v":75},{"$f":"show_formulaR(X5)","v":"< ---- =ROW(D75)"}]
["Target IRR",null,{"$f":"Assumptions!E6","v":0.2},null,null,null,null,null,null,null,null,null,null,null,{"$f":"show_formulaL(Row_Start)","v":"=INDEX(U4:X4,$R$2)----> "},null,null,5,"Column Start",null,{"$f":"COLUMN(D22)","v":4},{"$f":"COLUMN(E19)","v":5},{"$f":"COLUMN(E47)","v":5},{"$f":"COLUMN(E66)","v":5},"< ---- =COLUMN(E66)"]
["Difference",null,{"$f":"C5-C6","v":-5.1572352095854979E-3},null,null,null,null,null,null,null,null,null,null,null,{"$f":"show_formulaL(Row_Start)","v":"=INDEX(U4:X4,$R$2)----> "},null,null,9,"Column End",null,{"$f":"COLUMN(Y2)","v":25},{"$f":"COLUMN(L22)","v":12},{"$f":"COLUMN(I47)","v":9},{"$f":"COLUMN(J70)","v":10},"< ---- =COLUMN(J70)"]
[null,null,null,null,null,null,null,null,null,null,null,null,null,null,null,null,null,"Eq_IRR","Output Variable",null,"EV_EBITDA","EV_EBITDA","Eq_IRR","Ung_IRR"]
{"$rows_left_out":101}
{"sheet":"Annual Model","index":7,"n_rows":44,"n_cols":18,"rows_kept":44,"cut":false,"hidden":false,"merged":[]}
[]
[null,null,null,"Year",{"$f":"YEAR(Assumptions!E8)","v":2015},{"$f":"E2+1","v":2016},{"$f":"F2+1","v":2017},2018,2019,2020,2021,2022,2023,2024,2025,2026,2027,2028]
[]
[null,null,null,"EBITDA",{"$f":"SUMIF('LBO Model'!$7:$7,'Annual Model'!E$2,'LBO Model'!23:23)","v":0},{"$f":"SUMIF('LBO Model'!$7:$7,'Annual Model'!F$2,'LBO Model'!23:23)","v":60.748143516582786},{"$f":"SUMIF('LBO Model'!$7:$7,'Annual Model'!G$2,'LBO Model'!23:23)","v":63.495434180757655},{"$f":"SUMIF('LBO Model'!$7:$7,'Annual Model'!H$2,'LBO Model'!23:23)","v":76.862894008285593},{"$f":"SUMIF('LBO Model'!$7:$7,'Annual Model'!I$2,'LBO Model'!23:23)","v":89.094335078850577},{"$f":"SUMIF('LBO Model'!$7:$7,'Annual Model'!J$2,'LBO Model'!23:23)","v":101.05991942073888},{"$f":"SUMIF('LBO Model'!$7:$7,'Annual Model'!K$2,'LBO Model'!23:23)","v":109.24199595477299},{"$f":"SUMIF('LBO Model'!$7:$7,'Annual Model'!L$2,'LBO Model'!23:23)","v":115.50866977986612},{"$f":"SUMIF('LBO Model'!$7:$7,'Annual Model'!M$2,'LBO Model'!23:23)","v":121.2841032688595},{"$f":"SUMIF('LBO Model'!$7:$7,'Annual Model'!N$2,'LBO Model'!23:23)","v":0},{"$f":"SUMIF('LBO Model'!$7:$7,'Annual Model'!O$2,'LBO Model'!23:23)","v":0},{"$f":"SUMIF('LBO Model'!$7:$7,'Annual Model'!P$2,'LBO Model'!23:23)","v":0},{"$f":"SUMIF('LBO Model'!$7:$7,'Annual Model'!Q$2,'LBO Model'!23:23)","v":0},{"$f":"SUMIF('LBO Model'!$7:$7,'Annual Model'!R$2,'LBO Model'!23:23)","v":0}]
[null,null,null,"CAPEX",{"$f":"SUMIF('LBO Model'!$7:$7,'Annual Model'!E$2,'LBO Model'!28:28)","v":0},{"$f":"SUMIF('LBO Model'!$7:$7,'Annual Model'!F$2,'LBO Model'!28:28)","v":30.621188429096136},{"$f":"SUMIF('LBO Model'!$7:$7,'Annual Model'!G$2,'LBO Model'!28:28)","v":31.652247850550953},{"$f":"SUMIF('LBO Model'!$7:$7,'Annual Model'!H$2,'LBO Model'!28:28)","v":22.734860243078508},{"$f":"SUMIF('LBO Model'!$7:$7,'Annual Model'!I$2,'LBO Model'!28:28)","v":23.871603255232444},{"$f":"SUMIF('LBO Model'!$7:$7,'Annual Model'!J$2,'LBO Model'!28:28)","v":25.065183417994074},{"$f":"SUMIF('LBO Model'!$7:$7,'Annual Model'!K$2,'LBO Model'!28:28)","v":26.318442588893781},{"$f":"SUMIF('LBO Model'!$7:$7,'Annual Model'!L$2,'LBO Model'!28:28)","v":27.634364718338478},{"$f":"SUMIF('LBO Model'!$7:$7,'Annual Model'!M$2,'LBO Model'!28:28)","v":29.01608295425541},{"$f":"SUMIF('LBO Model'!$7:$7,'Annual Model'!N$2,'LBO Model'!28:28)","v":0},{"$f":"SUMIF('LBO Model'!$7:$7,'Annual Model'!O$2,'LBO Model'!28:28)","v":0},{"$f":"SUMIF('LBO Model'!$7:$7,'Annual Model'!P$2,'LBO Model'!28:28)","v":0},{"$f":"SUMIF('LBO Model'!$7:$7,'Annual Model'!Q$2,'LBO Model'!28:28)","v":0},{"$f":"SUMIF('LBO Model'!$7:$7,'Annual Model'!R$2,'LBO Model'!28:28)","v":0}]
[null,null,null,"Working Capital changes",{"$f":"SUMIF('LBO Model'!$7:$7,'Annual Model'!E$2,'LBO Model'!37:37)","v":0},{"$f":"SUMIF('LBO Model'!$7:$7,'Annual Model'!F$2,'LBO Model'!37:37)","v":-3.2690217391304319},{"$f":"SUMIF('LBO Model'!$7:$7,'Annual Model'!G$2,'LBO Model'!37:37)","v":1.1662092391304331},{"$f":"SUMIF('LBO Model'!$7:$7,'Annual Model'!H$2,'LBO Model'!37:37)","v":1.6495312500000026},{"$f":"SUMIF('LBO Model'!$7:$7,'Annual Model'!I$2,'LBO Model'!37:37)","v":1.4779799999999987},{"$f":"SUMIF('LBO Model'!$7:$7,'Annual Model'!J$2,'LBO Model'!37:37)","v":1.4040809999999979},{"$f":"SUMIF('LBO Model'!$7:$7,'Annual Model'!K$2,'LBO Model'!37:37)","v":1.0100145825000038},{"$f":"SUMIF('LBO Model'!$7:$7,'Annual Model'!L$2,'LBO Model'!37:37)","v":0.77193971662500438},{"$f":"SUMIF('LBO Model'!$7:$7,'Annual Model'!M$2,'LBO Model'!37:37)","v":0.81053670245626108},{"$f":"SUMIF('LBO Model'!$7:$7,'Annual Model'!N$2,'LBO Model'!37:37)","v":0},{"$f":"SUMIF('LBO Model'!$7:$7,'Annual Model'!O$2,'LBO Model'!37:37)","v":0},{"$f":"SUMIF('LBO Model'!$7:$7,'Annual Model'!P$2,'LBO Model'!37:37)","v":0},{"$f":"SUMIF('LBO Model'!$7:$7,'Annual Model'!Q$2,'LBO Model'!37:37)","v":0},{"$f":"SUMIF('LBO Model'!$7:$7,'Annual Model'!R$2,'LBO Model'!37:37)","v":0}]
[null,null,null,"Terminal Proceeds",{"$f":"SUMIF('LBO Model'!$7:$7,'Annual Model'!E$2,'LBO Model'!40:40)","v":0},{"$f":"SUMIF('LBO Model'!$7:$7,'Annual Model'!F$2,'LBO Model'!40:40)","v":0},{"$f":"SUMIF('LBO Model'!$7:$7,'Annual Model'!G$2,'LBO Model'!40:40)","v":0},{"$f":"SUMIF('LBO Model'!$7:$7,'Annual Model'!H$2,'LBO Model'!40:40)","v":0},{"$f":"SUMIF('LBO Model'!$7:$7,'Annual Model'!I$2,'LBO Model'!40:40)","v":0},{"$f":"SUMIF('LBO Model'!$7:$7,'Annual Model'!J$2,'LBO Model'!40:40)","v":0},{"$f":"SUMIF('LBO Model'!$7:$7,'Annual Model'!K$2,'LBO Model'!40:40)","v":0},{"$f":"SUMIF('LBO Model'!$7:$7,'Annual Model'!L$2,'LBO Model'!40:40)","v":0},{"$f":"SUMIF('LBO Model'!$7:$7,'Annual Model'!M$2,'LBO Model'!40:40)","v":606.42051634429754},{"$f":"SUMIF('LBO Model'!$7:$7,'Annual Model'!N$2,'LBO Model'!40:40)","v":0},{"$f":"SUMIF('LBO Model'!$7:$7,'Annual Model'!O$2,'LBO Model'!40:40)","v":0},{"$f":"SUMIF('LBO Model'!$7:$7,'Annual Model'!P$2,'LBO Model'!40:40)","v":0},{"$f":"SUMIF('LBO Model'!$7:$7,'Annual Model'!Q$2,'LBO Model'!40:40)","v":0},{"$f":"SUMIF('LBO Model'!$7:$7,'Annual Model'!R$2,'LBO Model'!40:40)","v":0}]
[null,null,null,"Pre-tax cash flow",{"$f":"-Assumptions!E58","v":-487.38},{"$f":"F4-F5-F6+F7","v":33.39597682661708},30.676977091076267,52.478502515207083,63.744751823618131,74.590655002744796,81.913538783379195,{"$f":"L4-L5-L6+L7","v":87.102365344902651},697.87799995644536,0,0,0,0,0]
{"$rows_left_out":37}
{"sheet":"Audit sheet","index":8,"n_rows":13,"n_cols":6,"rows_kept":13,"cut":false,"hidden":false,"merged":[]}
[]
[null," Existing balance sheet",null,null,{"$f":"Assumptions!E37","v":true},{"$f":"IF(E2,\"\",B2)","v":""}]
[null," Proforma adjustments",null,null,{"$f":"'S&U and Pro-Forma'!E76","v":true},{"$f":"IF(E3,\"\",B3)","v":""}]
[null," Proforma balance sheet",null,null,{"$f":"'S&U and Pro-Forma'!N76","v":true},""]
[null," Existing Debt Test",null,null,null," Existing Debt Test"]
[null," Amortising debt",null,null,null," Amortising debt"]
[null," Bullet Debt ",null,null,{"$f":"'LBO Model'!G123","v":true},""]
[null," Capitalising ",null,null,{"$f":"'LBO Model'!G137","v":true},""]
{"$rows_left_out":6}
{"sheet":"PE Scenario","index":10,"n_rows":29,"n_cols":12,"rows_kept":29,"cut":false,"hidden":false,"merged":[]}
[null,null,"Scenario number",null,3]
[null,null,null,null,null,null,null,null,null,null,"PE Ratio","M/B ratio"]
[null,null,null,"ST ROE","LT ROE","STGR","COE","LTGR ","Length",null,{"$f":"'PE Ratio'!E2","v":54.751378797905033},{"$f":"'PE Ratio'!E3","v":13.687844699476258}]
[null,null,"Base case",0.3,0.15,0.2,0.12,0.05,7,1,9.3404084832468079,2.8021225449740421]
[null,null,"Low case",0.35,0.1,0.15,0.14000000000000001,0.03,4,2,3.3834384851295178,1.1842034697953312]
[null,null,"High case",0.25,0.2,0.25,0.1,7.0000000000000007E-2,10,3,54.751378797905033,13.687844699476258]
[null,null,{"$f":"TRANSPOSE(D3:I3)&\"lowcase\"","v":"ST ROElowcase"},{"$f":"D5","v":0.35},{"$f":"E$4","v":0.15},0.2,0.12,0.05,7,4,8.9217651673143141,3.1226178085600096]
[null,null,"LT ROElowcase",{"$f":"D$4","v":0.3},{"$f":"E5","v":0.1},0.2,0.12,0.05,7,5,5.7385217869099518,1.7215565360729854]
{"$rows_left_out":22}
{"sheet":"PE Ratio","index":11,"n_rows":62,"n_cols":301,"rows_kept":62,"cut":false,"hidden":false,"merged":[]}
[null,"short run","long run"]
["ROE",{"$f":"'PE Scenario'!D21","v":0.25},{"$f":"'PE Scenario'!E21","v":0.2},"PE Ratio",{"$f":"E6/C17","v":54.751378797905033}]
["COE",{"$f":"'PE Scenario'!G21","v":0.1},{"$f":"'PE Scenario'!G21","v":0.1},"PB Ratio",{"$f":"E6/B6","v":13.687844699476258}]
["Growth rate",{"$f":"'PE Scenario'!F21","v":0.25},{"$f":"'PE Scenario'!H21","v":7.0000000000000007E-2}]
["Dividend Payout",{"$f":"1-B4/B2","v":0},null,"Value per share"]
["BV/share",11.95,null,"NPV of dividends",{"$f":"NPV(B3,C18:KO18)","v":163.56974415874129}]
["Short run",{"$f":"'PE Scenario'!I21","v":10}]
[]
{"$rows_left_out":54}