{"text_format":"1","workbook":"xlsx","n_sheets":14,"sheets":["Table of Contents","Summary Transaction","Scenario","Waterfall","Corporate Model","Tornado Diagram","Transaction Assumption","Acquisition Model","Long-term Analysis","Synergy & Premium","Accretion & Dilution","Simple Accretion Graph","Admin Cost Analysis","Waterfalldata"],"not_rendered":{"charts":12,"images":0,"macros":1,"external_links":3,"defined_names":56,"comments":8,"pivot_tables":0},"unopened":[{"sheet":"Waterfall","index":3,"reason":"not_a_worksheet"},{"sheet":"Tornado Diagram","index":5,"reason":"not_a_worksheet"},{"sheet":"Simple Accretion Graph","index":11,"reason":"not_a_worksheet"}],"bounds":{"document_bytes":16777216,"sheet_cells":100000,"rows_first":2000,"rows_last":500,"rows_between":2000,"halvings":0,"cell_chars":16384,"cell_head_chars":4096},"cells_cut":0,"cells_raw":0,"read":"whole","date_system":"1900"}

{"sheet":"Table of Contents","index":0,"n_rows":26,"n_cols":5,"rows_kept":26,"cut":false,"hidden":false,"merged":[]}
[null,null,"SHIFT,CNTL,Q to Hide Comments, SHIFT, CNTL N to Show Comments"]
[]
[null,null,"Sheet Tab","Description","Author"]
[null,1,"Table of Contents"]
[null,2,"Summary Transaction"]
[null,3,"Scenario"]
[null,4,"Corporate Model"]
[null,5,"Tornado Diagram"]
{"$rows_left_out":19}
{"sheet":"Summary Transaction","index":1,"n_rows":23,"n_cols":27,"rows_kept":23,"cut":false,"hidden":false,"merged":[]}
[]
["Cosideration"]
[null,"Total",{"$f":"'Transaction Assumption'!$E$7","v":2380}]
[null,"P/E Ratio",{"$f":"'Transaction Assumption'!$E$11","v":13.755365064768011},null,"Uses of Funds"]
[null,"EV/EBITDA",{"$f":"'Transaction Assumption'!$E$20","v":9.5694204985055986},null,"Consideration for Equity",null,{"$f":"'Transaction Assumption'!E58","v":2380},null,"Sorces of Funds"]
[null,null,null,null,"Banking Fee",null,{"$f":"'Transaction Assumption'!E59","v":12},null,"New Debt Issues",null,{"$f":"'Transaction Assumption'!E64","v":800}]
[null,"Synergy",{"$f":"'Transaction Assumption'!$E$24","v":95},null,"Advisory Fee",null,{"$f":"'Transaction Assumption'!E60","v":23.8},null,"Equity",null,{"$f":"'Transaction Assumption'!E65","v":1815.8000000000002}]
[null,null,null,null,"Debt Retired",null,{"$f":"'Transaction Assumption'!E61","v":200},null,"Total",null,{"$f":"'Transaction Assumption'!E66","v":2615.8000000000002}]
{"$rows_left_out":16}
{"sheet":"Scenario","index":2,"n_rows":29,"n_cols":15,"rows_kept":29,"cut":false,"hidden":false,"merged":[]}
["Part 1: Page 25, 37",null,null,null,"Scenario Code No.",null,1,null,null,null,null,null,null,null,"SHIFT,CNTL,Q to Hide Comments, SHIFT, CNTL N to Show Comments"]
[null,null,null,null,"WACC",0.08]
[]
[]
[null,null,null,null,null,null,null,null,null,"One-Way Data Table"]
[null,null,null,null,"Sale Growth","COGS Percent","Admin","CAPEX","Working Capital",null,"DCF Value Growth","DCF Value Multiple Case","EV/EBITDA Growth Case","EV/EBITDA Multiple Case"]
[null,null,null,null,null,null,null,null,null,null,{"$f":"'Corporate Model'!F290","v":2400.4401239472718},{"$f":"'Corporate Model'!F310","v":2708.8081192626382},{"$f":"'Corporate Model'!F297","v":8.9062351840767562},{"$f":"'Corporate Model'!F311","v":10.050357823138784}]
[null,null,null,"Base Case",0.06,1,1,1,0.35,1,2400.4401239472718,2708.8081192626382,8.9062351840767562,10.050357823138784]
{"$rows_left_out":22}
{"sheet":"Corporate Model","index":4,"n_rows":354,"n_cols":16384,"rows_kept":354,"cut":false,"hidden":false,"merged":[]}
["> Standalone model for target company to derive DCF"]
["Book Part1, P.9/P.25"]
[]
["Timeline",null,null,null,null,"special column"]
[null,null,null,null,null,null,null,null,2007,{"$f":"I5+1","v":2008},{"$f":"J5+1","v":2009},2010,2011,2012,2013,2014,2015,2016,2017,2018,2019,2020,2021,2022,2023,2024,2025]
[null,"Historical Switch",null,null,null,2013,null,null,{"$f":"I5<=$F$6","v":true},{"$f":"J5<=$F$6","v":true},true,true,true,true,true,false,false,false,false,false,false,false,false,false,false,false,false]
[null,"Valuation Period",null,null,null,2015,2021,null,{"$f":"AND(I5>=$F$7,I5<=$G$7)","v":false},{"$f":"AND(J5>=$F$7,J5<=$G$7)","v":false},false,false,false,false,false,false,true,true,true,true,true,true,true,false,false,false,false]
[null,"Terminal Period",null,null,null,{"$f":"G7","v":2021},null,null,{"$f":"I5=$F$8","v":false},{"$f":"J5=$F$8","v":false},false,false,false,false,false,false,false,false,false,false,false,false,true,false,false,false,false]
{"$rows_left_out":347}
{"sheet":"Transaction Assumption","index":6,"n_rows":120,"n_cols":18,"rows_kept":120,"cut":false,"hidden":false,"merged":[]}
["> Ref. workbook part1 p.20"]
[]
["Consideration"]
[]
[null,"Transaction Period",null,null,2014]
[null,"Column No.",null,null,{"$f":"MATCH(E5,'Corporate Model'!5:5)","v":16},null,{"$f":"show_formulaR(E6)","v":"< ---- =MATCH(E5,'Corporate Model'!5:5)"}]
[null,"Payment to Equity",null,null,2380]
[null,"Book Value of Equity",null,null,{"$f":"INDEX('Corporate Model'!246:246,'Transaction Assumption'!$E$6)","v":1253.1054008000001},null,{"$f":"show_formulaR(E8)","v":"< ---- =INDEX('Corporate Model'!246:246,'Transaction Assumption'!$E$6)"}]
{"$rows_left_out":113}
{"sheet":"Acquisition Model","index":7,"n_rows":127,"n_cols":19,"rows_kept":127,"cut":false,"hidden":false,"merged":[]}
["Timing",null,null,null,null,null,{"$f":"DATE(G2,12,31)","v":"2014-12-31"},{"$f":"EDATE(G1,6)","v":"2015-06-30"},{"$f":"EDATE(H1,12)","v":"2016-06-30"},{"$f":"EDATE(I1,12)","v":"2017-06-30"},"2018-06-30","2019-06-30","2020-06-30","2021-06-30","2022-06-30","2023-06-30","2024-06-30","2025-06-30"]
[null,null,null,null,null,null,{"$f":"'Transaction Assumption'!E5","v":2014},{"$f":"G2+1","v":2015},{"$f":"H2+1","v":2016},2017,2018,2019,2020,2021,2022,2023,2024,2025,2026]
[null,"Year of Transaction",null,null,null,null,0,{"$f":"G3+1","v":1},{"$f":"H3+1","v":2},3,4,5,6,7,8,9,10,11,12]
[null,"Holding Period",null,null,{"$f":"'Transaction Assumption'!E37","v":6},null,null,{"$f":"H3<=$E$4","v":true},{"$f":"I3<=$E$4","v":true},true,true,true,true,false,false,false,false,false]
[null,"Exit Period",null,null,{"$f":"'Transaction Assumption'!E37","v":6},null,null,{"$f":"H3=$E$5","v":false},{"$f":"I3=$E$5","v":false},false,false,false,true,false,false,false,false,false]
[]
["Data transferred from Corporate Model"]
[null,"Column No.",null,null,null,null,{"$f":"MATCH(G2,'Corporate Model'!5:5)","v":16},{"$f":"MATCH(H2,'Corporate Model'!5:5)","v":17},{"$f":"MATCH(I2,'Corporate Model'!5:5)","v":18},{"$f":"MATCH(J2,'Corporate Model'!5:5)","v":19},{"$f":"MATCH(K2,'Corporate Model'!5:5)","v":20},{"$f":"MATCH(L2,'Corporate Model'!5:5)","v":21},{"$f":"MATCH(M2,'Corporate Model'!5:5)","v":22},{"$f":"MATCH(N2,'Corporate Model'!5:5)","v":23},{"$f":"MATCH(O2,'Corporate Model'!5:5)","v":24},{"$f":"MATCH(P2,'Corporate Model'!5:5)","v":25},{"$f":"MATCH(Q2,'Corporate Model'!5:5)","v":26},{"$f":"MATCH(R2,'Corporate Model'!5:5)","v":27},{"$f":"MATCH(S2,'Corporate Model'!5:5)","v":27}]
{"$rows_left_out":120}
{"sheet":"Long-term Analysis","index":8,"n_rows":78,"n_cols":306,"rows_kept":78,"cut":false,"hidden":false,"merged":[]}
["Year",null,null,null,null,null,1,2,3,4,5,6,7,8,9,10,11,12,13,14,15,16,17,18,19,20,21,22,23,24,25,26,27,28,29,30,31,32,33,34,35,36,37,38,39,40,41,42,43,44,45,46,47,48,49,50,51,52,53,54,55,56,57,58,59,60,61,62,63,64,65,66,67,68,69,70,71,72,73,74,75,76,77,78,79,80,81,82,83,84,85,86,87,88,89,90,91,92,93,94,95,96,97,98,99,100,101,102,103,104,105,106,107,108,109,110,111,112,113,114,115,116,117,118,119,120,121,122,123,124,125,126,127,128,129,130,131,132,133,134,135,136,137,138,139,140,141,142,143,144,145,146,147,148,149,150,151,152,153,154,155,156,157,158,159,160,161,162,163,164,165,166,167,168,169,170,171,172,173,174,175,176,177,178,179,180,181,182,183,184,185,186,187,188,189,190,191,192,193,194,195,196,197,198,199,200,201,202,203,204,205,206,207,208,209,210,211,212,213,214,215,216,217,218,219,220,221,222,223,224,225,226,227,228,229,230,231,232,233,234,235,236,237,238,239,240,241,242,243,244,245,246,247,248,249,250,251,252,253,254,255,256,257,258,259,260,261,262,263,264,265,266,267,268,269,270,271,272,273,274,275,276,277,278,279,280,281,282,283,284,285,286,287,288,289,290,291,292,293,294,295,296,297,298,299,300]
[null,null,null,null,null,null,"2014-01-01",{"$f":"EDATE(G$2,6)","v":"2014-07-01"},{"$f":"EDATE(H$2,12)","v":"2015-07-01"},{"$f":"EDATE(I$2,12)","v":"2016-07-01"},"2017-07-01","2018-07-01","2019-07-01","2020-07-01","2021-07-01","2022-07-01","2023-07-01","2024-07-01","2025-07-01","2026-07-01","2027-07-01","2028-07-01","2029-07-01","2030-07-01","2031-07-01","2032-07-01","2033-07-01","2034-07-01","2035-07-01","2036-07-01","2037-07-01","2038-07-01","2039-07-01","2040-07-01","2041-07-01","2042-07-01","2043-07-01","2044-07-01","2045-07-01","2046-07-01","2047-07-01","2048-07-01","2049-07-01","2050-07-01","2051-07-01","2052-07-01","2053-07-01","2054-07-01","2055-07-01","2056-07-01","2057-07-01","2058-07-01","2059-07-01","2060-07-01","2061-07-01","2062-07-01","2063-07-01","2064-07-01","2065-07-01","2066-07-01","2067-07-01","2068-07-01","2069-07-01","2070-07-01","2071-07-01","2072-07-01","2073-07-01","2074-07-01","2075-07-01","2076-07-01","2077-07-01","2078-07-01","2079-07-01",{"$f":"EDATE(BU$2,12)","v":"2080-07-01"},"2081-07-01","2082-07-01","2083-07-01","2084-07-01","2085-07-01","2086-07-01","2087-07-01","2088-07-01","2089-07-01","2090-07-01","2091-07-01","2092-07-01","2093-07-01","2094-07-01","2095-07-01","2096-07-01","2097-07-01","2098-07-01","2099-07-01","2100-07-01","2101-07-01","2102-07-01","2103-07-01","2104-07-01","2105-07-01","2106-07-01","2107-07-01","2108-07-01","2109-07-01","2110-07-01","2111-07-01","2112-07-01","2113-07-01","2114-07-01","2115-07-01","2116-07-01","2117-07-01","2118-07-01","2119-07-01","2120-07-01","2121-07-01","2122-07-01","2123-07-01","2124-07-01","2125-07-01","2126-07-01","2127-07-01","2128-07-01","2129-07-01","2130-07-01","2131-07-01","2132-07-01","2133-07-01","2134-07-01","2135-07-01","2136-07-01","2137-07-01","2138-07-01","2139-07-01","2140-07-01","2141-07-01","2142-07-01","2143-07-01",{"$f":"EDATE(EG$2,12)","v":"2144-07-01"},"2145-07-01","2146-07-01","2147-07-01","2148-07-01","2149-07-01","2150-07-01","2151-07-01","2152-07-01","2153-07-01","2154-07-01","2155-07-01","2156-07-01","2157-07-01","2158-07-01","2159-07-01","2160-07-01","2161-07-01","2162-07-01","2163-07-01","2164-07-01","2165-07-01","2166-07-01","2167-07-01","2168-07-01","2169-07-01","2170-07-01","2171-07-01","2172-07-01","2173-07-01","2174-07-01","2175-07-01","2176-07-01","2177-07-01","2178-07-01","2179-07-01","2180-07-01","2181-07-01","2182-07-01","2183-07-01","2184-07-01","2185-07-01","2186-07-01","2187-07-01","2188-07-01","2189-07-01","2190-07-01","2191-07-01","2192-07-01","2193-07-01","2194-07-01","2195-07-01","2196-07-01","2197-07-01","2198-07-01","2199-07-01","2200-07-01","2201-07-01","2202-07-01","2203-07-01","2204-07-01","2205-07-01","2206-07-01","2207-07-01",{"$f":"EDATE(GS$2,12)","v":"2208-07-01"},"2209-07-01","2210-07-01","2211-07-01","2212-07-01","2213-07-01","2214-07-01","2215-07-01","2216-07-01","2217-07-01","2218-07-01","2219-07-01","2220-07-01","2221-07-01","2222-07-01","2223-07-01","2224-07-01","2225-07-01","2226-07-01","2227-07-01","2228-07-01","2229-07-01","2230-07-01","2231-07-01","2232-07-01","2233-07-01","2234-07-01","2235-07-01","2236-07-01","2237-07-01","2238-07-01","2239-07-01","2240-07-01","2241-07-01","2242-07-01","2243-07-01","2244-07-01","2245-07-01","2246-07-01","2247-07-01","2248-07-01","2249-07-01","2250-07-01","2251-07-01","2252-07-01","2253-07-01","2254-07-01","2255-07-01","2256-07-01","2257-07-01","2258-07-01","2259-07-01","2260-07-01","2261-07-01","2262-07-01","2263-07-01","2264-07-01","2265-07-01","2266-07-01","2267-07-01","2268-07-01","2269-07-01","2270-07-01","2271-07-01",{"$f":"EDATE(JE$2,12)","v":"2272-07-01"},"2273-07-01","2274-07-01","2275-07-01","2276-07-01","2277-07-01","2278-07-01","2279-07-01","2280-07-01","2281-07-01","2282-07-01","2283-07-01","2284-07-01","2285-07-01","2286-07-01","2287-07-01","2288-07-01","2289-07-01","2290-07-01","2291-07-01","2292-07-01","2293-07-01","2294-07-01","2295-07-01","2296-07-01","2297-07-01","2298-07-01","2299-07-01","2300-07-01","2301-07-01","2302-07-01","2303-07-01","2304-07-01","2305-07-01","2306-07-01","2307-07-01","2308-07-01","2309-07-01","2310-07-01","2311-07-01","2312-07-01"]
[null,null,null,null,null,null,0,67]
[null,null,null,null,"Ref: Part3, Page 51"]
["PE Ratio Analysis",null,null,null,null,null,null,null,null,"G=ROE(1-DPO)"]
[null,"ROE (Return on Equity)",null,null,0.11700000000000001,"PE Ratio",null,{"$f":"E18/H14","v":10.500321579044879},null,"G/ROE = (1-DPO)"]
[null,"COE (Cost of Equity)",null,null,0.10267614154435399,"Market/ Book Ratio",null,{"$f":"E18/H13","v":1.2285376247482509},null,"DPO=1-G/ROE"]
[null,"Earnings Growth Rate",null,null,0.04,null,null,null,null,"Value=CF1/(COE-Growth Rate)"]
{"$rows_left_out":71}
{"sheet":"Synergy & Premium","index":9,"n_rows":29,"n_cols":11,"rows_kept":29,"cut":false,"hidden":false,"merged":[]}
[null,null,null,null,null,"(Ref.Book P.27)"]
[]
[]
[null,"Stock price",30]
[null,"Shares",1000]
[null,"Market Capitalization",{"$f":"C4*C5","v":30000}]
[null,"Premium",0.3]
[null,"Consideration",{"$f":"C6*(1+C7)","v":39000}]
{"$rows_left_out":22}
{"sheet":"Accretion & Dilution","index":10,"n_rows":21,"n_cols":10,"rows_kept":21,"cut":false,"hidden":false,"merged":[]}
[]
[null,"Accretion","Increase the EPS "]
[null,"Dilution","Decrease the EPS"]
[]
[null,null,"Stock Price (USD)","Share",null,{"$f":"F19","v":2013},2014,2015]
[null,"Google",1021.52,335,null,36.15,42.9,63.6,null,"higher price due to relatively less risk and higher growth than AAPL"]
[null,"Apple",489.1,905,null,39,40.700000000000003,65]
[null,"Google earnings",null,null,null,{"$f":"F6*$D6","v":12110.25},14371.5,21306]
{"$rows_left_out":14}
{"sheet":"Admin Cost Analysis","index":12,"n_rows":27,"n_cols":9,"rows_kept":27,"cut":false,"hidden":false,"merged":[]}
["Sale",null,{"$f":"'Corporate Model'!I29","v":800},{"$f":"'Corporate Model'!J29","v":850},{"$f":"'Corporate Model'!K29","v":760},{"$f":"'Corporate Model'!L29","v":800},{"$f":"'Corporate Model'!M29","v":880},{"$f":"'Corporate Model'!N29","v":920},{"$f":"'Corporate Model'!O29","v":950}]
[null,"Admin cost",{"$f":"'Corporate Model'!I32","v":30},{"$f":"'Corporate Model'!J32","v":35},{"$f":"'Corporate Model'!K32","v":28},{"$f":"'Corporate Model'!L32","v":34},{"$f":"'Corporate Model'!M32","v":39},{"$f":"'Corporate Model'!N32","v":42},{"$f":"'Corporate Model'!O32","v":50}]
[null,null,{"$f":"CORREL(C1:I1,C2:I2)","v":0.96290751555736387}]
[]
[]
[]
[]
[]
{"$rows_left_out":20}
{"sheet":"Waterfalldata","index":13,"n_rows":14,"n_cols":80,"rows_kept":14,"cut":false,"hidden":false,"merged":[]}
["Equity Value \r 2 090,44",2090.4401239472718,null,null,209.04401239472719,2090.4401239472718,null,null,null,null,null,null,2090.4401239472718,{"$f":"M1","v":2090.4401239472718},null,{"$f":"N1","v":2090.4401239472718},{"$f":"ABS(O1)","v":0},null,null,null,null,null,null,null,null,null,null,null,null,null,null,null,null,null,null,null,null,null,null,null,null,null,null,null,null,null,null,null,null,null,null,{"$f":"waterfall_graph_data","v":"Equity Value"},2090.4401239472718,{"$f":"BA1","v":2090.4401239472718},null,{"$f":"BB1","v":2090.4401239472718},{"$f":"ABS(BC1)","v":0},209.04401239472719,{"$f":"BD1","v":2090.4401239472718},{"$f":"IF(BC1>=0,0,BF1)","v":0},{"$f":"IF(BC1<0,0,BF1)","v":209.04401239472719},{"$f":"BA1","v":2090.4401239472718},null,null,null,null,null,null,{"$f":"AZ1","v":"Equity Value"}," \n",{"$f":"BB1","v":2090.4401239472718},{"$f":"BQ1&BR1&TEXT(BS1,\" ####\")","v":"Equity Value \n 2090"},{"$f":"BG1","v":2090.4401239472718},0,{"$f":"BE1","v":0},{"$f":"BI1","v":209.04401239472719},{"$f":"BB1","v":2090.4401239472718}]
["PV Synergies \r 3 040,44",2090.4401239472718,null,950,209.04401239472719,2090.4401239472718,3040.4401239472718,null,null,null,null,null,950,{"$f":"IF(M2<>0,N1+M2,N1)","v":3040.4401239472718},{"$f":"N2-N1","v":950},{"$f":"IF(O2>=0,N2-O2,N1+O2)","v":2090.4401239472718},{"$f":"ABS(O2)","v":950},null,null,null,null,null,null,null,null,null,null,null,null,null,null,null,null,null,null,null,null,null,null,null,null,null,null,null,null,null,null,null,null,null,null,"PV Synergies",950,{"$f":"IF(BA2<>0,BB1+BA2,BB1)","v":3040.4401239472718},{"$f":"BB2-BB1","v":950},{"$f":"IF(BC2>=0,BB2-BC2,BB1+BC2)","v":2090.4401239472718},{"$f":"ABS(BC2)","v":950},209.04401239472719,{"$f":"IF(BC2>=0,BD2,BD2-BF2)","v":2090.4401239472718},{"$f":"IF(BC2>=0,0,BF2)","v":0},{"$f":"IF(BC2<0,0,BF2)","v":209.04401239472719},{"$f":"IF(BC2<>0,BC2,BB2)","v":950},null,null,null,null,null,null,{"$f":"AZ2","v":"PV Synergies"}," \n",{"$f":"BB2","v":3040.4401239472718},{"$f":"BQ2&BR2&TEXT(BS2,\" ####\")","v":"PV Synergies \n 3040"},2090.4401239472718,0,{"$f":"BE2","v":950},{"$f":"BI2","v":209.04401239472719},{"$f":"BB1","v":2090.4401239472718},{"$f":"BB2","v":3040.4401239472718}]
["Transaction Cost \r 3 004,64",2795.5961115525442,209.04401239472719,35.800000000000182,null,null,3040.4401239472718,3004.6401239472716,null,null,null,null,-35.799999999999997,{"$f":"IF(M3<>0,N2+M3,N2)","v":3004.6401239472716},{"$f":"N3-N2","v":-35.800000000000182},{"$f":"IF(O3>=0,N3-O3,N2+O3)","v":3004.6401239472716},{"$f":"ABS(O3)","v":35.800000000000182},null,null,null,null,null,null,null,null,null,null,null,null,null,null,null,null,null,null,null,null,null,null,null,null,null,null,null,null,null,null,null,null,null,null,"Transaction Cost",-35.799999999999997,{"$f":"IF(BA3<>0,BB2+BA3,BB2)","v":3004.6401239472716},{"$f":"BB3-BB2","v":-35.800000000000182},{"$f":"IF(BC3>=0,BB3-BC3,BB2+BC3)","v":3004.6401239472716},{"$f":"ABS(BC3)","v":35.800000000000182},209.04401239472719,{"$f":"IF(BC3>=0,BD3,BD3-BF3)","v":2795.5961115525442},{"$f":"IF(BC3>=0,0,BF3)","v":209.04401239472719},{"$f":"IF(BC3<0,0,BF3)","v":0},{"$f":"IF(BC3<>0,BC3,BB3)","v":-35.800000000000182},null,null,null,null,null,null,{"$f":"AZ3","v":"Transaction Cost"}," \n",{"$f":"BB3","v":3004.6401239472716},{"$f":"BQ3&BR3&TEXT(BS3,\" ####\")","v":"Transaction Cost \n 3005"},2795.5961115525442,209.04401239472719,{"$f":"BE3","v":35.800000000000182},{"$f":"BI3","v":0},null,{"$f":"BB2","v":3040.4401239472718},{"$f":"BB3","v":3004.6401239472716}]
["Transaction Value \r 3 004,64",3004.6401239472716,null,0,209.04401239472719,null,null,3004.6401239472716,3004.6401239472716,null,null,null,0,{"$f":"IF(M4<>0,N3+M4,N3)","v":3004.6401239472716},{"$f":"N4-N3","v":0},{"$f":"IF(O4>=0,N4-O4,N3+O4)","v":3004.6401239472716},{"$f":"ABS(O4)","v":0},null,null,null,null,null,null,null,null,null,null,null,null,null,null,null,null,null,null,null,null,null,null,null,null,null,null,null,null,null,null,null,null,null,null,"Transaction Value",0,{"$f":"IF(BA4<>0,BB3+BA4,BB3)","v":3004.6401239472716},{"$f":"BB4-BB3","v":0},{"$f":"IF(BC4>=0,BB4-BC4,BB3+BC4)","v":3004.6401239472716},{"$f":"ABS(BC4)","v":0},209.04401239472719,{"$f":"IF(BC4>=0,BD4,BD4-BF4)","v":3004.6401239472716},{"$f":"IF(BC4>=0,0,BF4)","v":0},{"$f":"IF(BC4<0,0,BF4)","v":209.04401239472719},{"$f":"IF(BC4<>0,BC4,BB4)","v":3004.6401239472716},null,null,null,null,null,null,{"$f":"AZ4","v":"Transaction Value"}," \n",{"$f":"BB4","v":3004.6401239472716},{"$f":"BQ4&BR4&TEXT(BS4,\" ####\")","v":"Transaction Value \n 3005"},3004.6401239472716,0,{"$f":"BE4","v":0},{"$f":"BI4","v":209.04401239472719},null,null,{"$f":"BB3","v":3004.6401239472716}]
[{"$f":"COLUMN()","v":1},{"$f":"COLUMN()","v":2},{"$f":"COLUMN()","v":3},{"$f":"COLUMN()","v":4},{"$f":"COLUMN()","v":5},{"$f":"COLUMN()","v":6},{"$f":"COLUMN()","v":7},{"$f":"COLUMN()","v":8},{"$f":"COLUMN()","v":9},{"$f":"COLUMN()","v":10},{"$f":"COLUMN()","v":11},{"$f":"COLUMN()","v":12},{"$f":"COLUMN()","v":13},{"$f":"COLUMN()","v":14},{"$f":"COLUMN()","v":15},{"$f":"COLUMN()","v":16},{"$f":"COLUMN()","v":17},null,null,null,null,null,null,null,null,null,null,null,null,null,null,null,null,null,null,null,null,null,null,null,null,null,null,null,null,null,null,null,null,null,null,null,null,{"$f":"COLUMN()","v":54},{"$f":"COLUMN()","v":55},{"$f":"COLUMN()","v":56},{"$f":"COLUMN()","v":57},{"$f":"COLUMN()","v":58},{"$f":"COLUMN()","v":59},{"$f":"COLUMN()","v":60},{"$f":"COLUMN()","v":61},{"$f":"COLUMN()","v":62},{"$f":"COLUMN()","v":63},{"$f":"COLUMN()","v":64},{"$f":"COLUMN()","v":65},{"$f":"COLUMN()","v":66},{"$f":"COLUMN()","v":67},{"$f":"COLUMN()","v":68},{"$f":"COLUMN()","v":69},{"$f":"COLUMN()","v":70},{"$f":"COLUMN()","v":71},{"$f":"COLUMN()","v":72},{"$f":"COLUMN()","v":73},{"$f":"COLUMN()","v":74},{"$f":"COLUMN()","v":75},{"$f":"COLUMN()","v":76},{"$f":"COLUMN()","v":77},{"$f":"COLUMN()","v":78},{"$f":"COLUMN()","v":79},{"$f":"COLUMN()","v":80}]
[" Fixed Graph: Graph Titles ",null,null," Fixed Graph: Increment (absolute Value) ",null," Fixed Graph: Connectors ",null,null,null,null,null,null,null,null,null,null,null,null,null,null,null,null,null,null,null,null,null,null,null,null,null,null,null,null,null,null,null,null,null,null,null,null,null,null,null,null,null,null,null,null,null,null,null," CALCULATION: BASE VALUE: If not zero accumulate; if zero Last Value ",null,null,null,null,null,null,null,null,null,null,null,null,null,null,null,null,null," GRAPH: Link to the Title "]
[null," Fixed Graph: Base of Stacked Bar",null,null," Fixed Graph: Space for Increment ",null,null,null,null,null,null,null,null,null,null,null,null,null,null,null,null,null,null,null,null,null,null,null,null,null,null,null,null,null,null,null,null,null,null,null,null,null,null,null,null,null,null,null,null,null,null,null,null," CALCULATION: ACCUMULATED VALUE:  Formula is accumulation ",null,null,null,null,null,null,null,null,null,null,null,null,null,null,null,null,null,null," GRAPH: Adjusted Base of Stack from calculation  "]
[null,null," Fixed Graph: Space for Negative Label (Not Graphed ",null,null,null,null,null,null,null,null,null,null,null,null,null,null,null,null,null,null,null,null,null,null,null,null,null,null,null,null,null,null,null,null,null,null,null,null,null,null,null,null,null,null,null,null,null,null,null,null,null,null,null," CALCULATION: INCREMENT: Formula is difference between accumulated value ",null,null,null,null,null,null,null,null,null,null,null,null,null,null,null,null,null,null," GRAPH: Space for Value in Negative Case  "]
{"$rows_left_out":6}