{"text_format":"1","workbook":"xlsx","n_sheets":18,"sheets":["Table of Contents","Summary","LBO Summary","Master Scenario","Corporate Model","Valuation","Tornado Diagram","SG&A Analysis","Acquisition","Audit","PE ratio","Stock price download","Stock prices","Offset Function","Codes","2012 Update","Circular Sweep","Circular Corporate"],"not_rendered":{"charts":9,"images":0,"macros":1,"external_links":0,"defined_names":33,"comments":1,"pivot_tables":0},"unopened":[{"sheet":"Tornado Diagram","index":6,"reason":"not_a_worksheet"}],"bounds":{"document_bytes":16777216,"sheet_cells":100000,"rows_first":2000,"rows_last":500,"rows_between":2000,"halvings":0,"cell_chars":16384,"cell_head_chars":4096},"cells_cut":0,"cells_raw":0,"read":"whole","date_system":"1900"}

{"sheet":"Table of Contents","index":0,"n_rows":28,"n_cols":5,"rows_kept":28,"cut":false,"hidden":false,"merged":[]}
[]
[]
[null,null,"Sheet Tab","Description","Author"]
[null,1,"Table of content"]
[null,2,"Master Scenario"]
[null,3,"Summary"]
{"$rows_left_out":23}
{"sheet":"Summary","index":1,"n_rows":23,"n_cols":17,"rows_kept":23,"cut":false,"hidden":false,"merged":[]}
[null,null,null,null,null,null,null,null,"Scenario"]
[]
[null,null,null,null,null,null,null,null,null,"Valuation Year",{"$f":"Valuation!$H$18","v":2012},null,null,null,"Custom Case Senstivity"]
[null,null,null,null,null,null,null,null,null,"Terminal Year",{"$f":"Valuation!$H$19","v":2019}]
[null,null,null,null,null,null,null,null,null,"WACC",{"$f":"Valuation!H11","v":0.06},null,null,null,"Sales Sensitivity"]
[null,null,null,null,null,null,null,null,null,null,null,null,null,null,"Margin Sensitvity"]
{"$rows_left_out":18}
{"sheet":"LBO Summary","index":2,"n_rows":23,"n_cols":11,"rows_kept":23,"cut":false,"hidden":false,"merged":[]}
[]
[null,"Transaction Assumptions",null,null,null,null,null,"Scenario"]
[null,null,"Premium",null,{"$f":"Acquisition!F14","v":0.2}]
[null,null,"Stock Price",null,{"$f":"Acquisition!$F$10*(1+Acquisition!$F$14)","v":24.485860465116271},null,null,"Synergy Sensitivity",null,null,{"$f":"'Master Scenario'!E4","v":1}]
[null,null,"Implied P/E Ratio",null,{"$f":"Acquisition!F21","v":24.584616258824433},null,null,"Capital Expenditures",null,null,{"$f":"Acquisition!F85","v":1}]
[null,null,"Implied EV/EBITDA Ratio"]
{"$rows_left_out":18}
{"sheet":"Master Scenario","index":3,"n_rows":44,"n_cols":19,"rows_kept":44,"cut":false,"hidden":false,"merged":[[4,9,4,12]]}
[]
[null,null,"Scenario number",null,1]
[]
[null,null,"Synergy Sensitivity",null,{"$f":"Acquisition!F83","v":1}]
[null,null,"Premium",null,{"$f":"Acquisition!F14","v":0.2},null,null,null,null,"DCF Analysis"]
[null,null,null,"Sales Growth","COGS margin","Sales/AR","Inventory/ COGS","Capex/sales","AP/Expenses","Scenario","Equity IRR",{"$f":"Summary!J8","v":"Growth rate method"},{"$f":"Summary!K8","v":"Value driver method"},{"$f":"Summary!L8","v":"Input EV/EBITDA "},{"$f":"Summary!M8","v":"Computed EV/ EBITDA"},{"$f":"Summary!J18","v":"Growth rate method"},{"$f":"Summary!K18","v":"Value driver method"},{"$f":"Summary!L18","v":"Input PE"},"Unlevereged IRR from Acquisition"]
{"$rows_left_out":39}
{"sheet":"Corporate Model","index":4,"n_rows":755,"n_cols":31,"rows_kept":755,"cut":false,"hidden":false,"merged":[]}
["Timeline"]
[null,null,null,null,null,null,null,null,2000,2001,2002,2003,2004,2005,2006,2007,2008,2009,2010,2011,2012,2013,2014,2015,2016,2017,2018,2019,2020,2021,2021]
[null,"Historic timeline switch",null,null,null,null,{"$f":"COUNTIF(I3:AE3,TRUE)","v":13},null,{"$f":"I2<=Valuation!$H$17","v":true},{"$f":"J2<=Valuation!$H$17","v":true},{"$f":"K2<=Valuation!$H$17","v":true},{"$f":"L2<=Valuation!$H$17","v":true},{"$f":"M2<=Valuation!$H$17","v":true},{"$f":"N2<=Valuation!$H$17","v":true},{"$f":"O2<=Valuation!$H$17","v":true},{"$f":"P2<=Valuation!$H$17","v":true},{"$f":"Q2<=Valuation!$H$17","v":true},{"$f":"R2<=Valuation!$H$17","v":true},{"$f":"S2<=Valuation!$H$17","v":true},{"$f":"T2<=Valuation!$H$17","v":true},{"$f":"U2<=Valuation!$H$17","v":true},{"$f":"V2<=Valuation!$H$17","v":false},{"$f":"W2<=Valuation!$H$17","v":false},{"$f":"X2<=Valuation!$H$17","v":false},{"$f":"Y2<=Valuation!$H$17","v":false},{"$f":"Z2<=Valuation!$H$17","v":false},{"$f":"AA2<=Valuation!$H$17","v":false},{"$f":"AB2<=Valuation!$H$17","v":false},{"$f":"AC2<=Valuation!$H$17","v":false},{"$f":"AD2<=Valuation!$H$17","v":false},{"$f":"AE2<=Valuation!$H$17","v":false}]
[null,"Explicit period switch",null,null,null,null,{"$f":"COUNTIF(I4:AE4,TRUE)","v":8},{"$f":"Valuation!H19-Valuation!H18+1=G4","v":true},{"$f":"AND(I2>=Valuation!$H$18,I2<=Valuation!$H$19)","v":false},{"$f":"AND(J2>=Valuation!$H$18,J2<=Valuation!$H$19)","v":false},{"$f":"AND(K2>=Valuation!$H$18,K2<=Valuation!$H$19)","v":false},{"$f":"AND(L2>=Valuation!$H$18,L2<=Valuation!$H$19)","v":false},{"$f":"AND(M2>=Valuation!$H$18,M2<=Valuation!$H$19)","v":false},{"$f":"AND(N2>=Valuation!$H$18,N2<=Valuation!$H$19)","v":false},{"$f":"AND(O2>=Valuation!$H$18,O2<=Valuation!$H$19)","v":false},{"$f":"AND(P2>=Valuation!$H$18,P2<=Valuation!$H$19)","v":false},{"$f":"AND(Q2>=Valuation!$H$18,Q2<=Valuation!$H$19)","v":false},{"$f":"AND(R2>=Valuation!$H$18,R2<=Valuation!$H$19)","v":false},{"$f":"AND(S2>=Valuation!$H$18,S2<=Valuation!$H$19)","v":false},{"$f":"AND(T2>=Valuation!$H$18,T2<=Valuation!$H$19)","v":false},{"$f":"AND(U2>=Valuation!$H$18,U2<=Valuation!$H$19)","v":true},{"$f":"AND(V2>=Valuation!$H$18,V2<=Valuation!$H$19)","v":true},{"$f":"AND(W2>=Valuation!$H$18,W2<=Valuation!$H$19)","v":true},{"$f":"AND(X2>=Valuation!$H$18,X2<=Valuation!$H$19)","v":true},{"$f":"AND(Y2>=Valuation!$H$18,Y2<=Valuation!$H$19)","v":true},{"$f":"AND(Z2>=Valuation!$H$18,Z2<=Valuation!$H$19)","v":true},{"$f":"AND(AA2>=Valuation!$H$18,AA2<=Valuation!$H$19)","v":true},{"$f":"AND(AB2>=Valuation!$H$18,AB2<=Valuation!$H$19)","v":true},{"$f":"AND(AC2>=Valuation!$H$18,AC2<=Valuation!$H$19)","v":false},{"$f":"AND(AD2>=Valuation!$H$18,AD2<=Valuation!$H$19)","v":false},{"$f":"AND(AE2>=Valuation!$H$18,AE2<=Valuation!$H$19)","v":false}]
[null,"Valuation year",null,null,null,null,{"$f":"COUNTIF(I5:AE5,TRUE)","v":1},null,{"$f":"I2=Valuation!$H$18","v":false},{"$f":"J2=Valuation!$H$18","v":false},{"$f":"K2=Valuation!$H$18","v":false},{"$f":"L2=Valuation!$H$18","v":false},{"$f":"M2=Valuation!$H$18","v":false},{"$f":"N2=Valuation!$H$18","v":false},{"$f":"O2=Valuation!$H$18","v":false},{"$f":"P2=Valuation!$H$18","v":false},{"$f":"Q2=Valuation!$H$18","v":false},{"$f":"R2=Valuation!$H$18","v":false},{"$f":"S2=Valuation!$H$18","v":false},{"$f":"T2=Valuation!$H$18","v":false},{"$f":"U2=Valuation!$H$18","v":true},{"$f":"V2=Valuation!$H$18","v":false},{"$f":"W2=Valuation!$H$18","v":false},{"$f":"X2=Valuation!$H$18","v":false},{"$f":"Y2=Valuation!$H$18","v":false},{"$f":"Z2=Valuation!$H$18","v":false},{"$f":"AA2=Valuation!$H$18","v":false},{"$f":"AB2=Valuation!$H$18","v":false},{"$f":"AC2=Valuation!$H$18","v":false},{"$f":"AD2=Valuation!$H$18","v":false},{"$f":"AE2=Valuation!$H$18","v":false}]
[null,"Closing Balance Sheet for valuation",null,null,null,null,{"$f":"COUNTIF(I6:AE6,TRUE)","v":1},null,{"$f":"I2=Valuation!$H$18-1","v":false},{"$f":"J2=Valuation!$H$18-1","v":false},{"$f":"K2=Valuation!$H$18-1","v":false},{"$f":"L2=Valuation!$H$18-1","v":false},{"$f":"M2=Valuation!$H$18-1","v":false},{"$f":"N2=Valuation!$H$18-1","v":false},{"$f":"O2=Valuation!$H$18-1","v":false},{"$f":"P2=Valuation!$H$18-1","v":false},{"$f":"Q2=Valuation!$H$18-1","v":false},{"$f":"R2=Valuation!$H$18-1","v":false},{"$f":"S2=Valuation!$H$18-1","v":false},{"$f":"T2=Valuation!$H$18-1","v":true},{"$f":"U2=Valuation!$H$18-1","v":false},{"$f":"V2=Valuation!$H$18-1","v":false},{"$f":"W2=Valuation!$H$18-1","v":false},{"$f":"X2=Valuation!$H$18-1","v":false},{"$f":"Y2=Valuation!$H$18-1","v":false},{"$f":"Z2=Valuation!$H$18-1","v":false},{"$f":"AA2=Valuation!$H$18-1","v":false},{"$f":"AB2=Valuation!$H$18-1","v":false},{"$f":"AC2=Valuation!$H$18-1","v":false},{"$f":"AD2=Valuation!$H$18-1","v":false},{"$f":"AE2=Valuation!$H$18-1","v":false}]
{"$rows_left_out":750}
{"sheet":"Valuation","index":5,"n_rows":203,"n_cols":31,"rows_kept":203,"cut":false,"hidden":false,"merged":[]}
["Timeline"]
[null,null,null,null,null,null,null,null,2000,2001,2002,2003,2004,2005,2006,2007,2008,2009,2010,2011,2012,2013,2014,2015,2016,2017,2018,2019,2020,2021,2021]
[null,"Historic timeline switch",null,null,null,null,{"$f":"COUNTIF(I3:AE3,TRUE)","v":13},null,{"$f":"I2<=Valuation!$H$17","v":true},{"$f":"J2<=Valuation!$H$17","v":true},{"$f":"K2<=Valuation!$H$17","v":true},{"$f":"L2<=Valuation!$H$17","v":true},{"$f":"M2<=Valuation!$H$17","v":true},{"$f":"N2<=Valuation!$H$17","v":true},{"$f":"O2<=Valuation!$H$17","v":true},{"$f":"P2<=Valuation!$H$17","v":true},{"$f":"Q2<=Valuation!$H$17","v":true},{"$f":"R2<=Valuation!$H$17","v":true},{"$f":"S2<=Valuation!$H$17","v":true},{"$f":"T2<=Valuation!$H$17","v":true},{"$f":"U2<=Valuation!$H$17","v":true},{"$f":"V2<=Valuation!$H$17","v":false},{"$f":"W2<=Valuation!$H$17","v":false},{"$f":"X2<=Valuation!$H$17","v":false},{"$f":"Y2<=Valuation!$H$17","v":false},{"$f":"Z2<=Valuation!$H$17","v":false},{"$f":"AA2<=Valuation!$H$17","v":false},{"$f":"AB2<=Valuation!$H$17","v":false},{"$f":"AC2<=Valuation!$H$17","v":false},{"$f":"AD2<=Valuation!$H$17","v":false},{"$f":"AE2<=Valuation!$H$17","v":false}]
[null,"Explicit period switch",null,null,null,null,{"$f":"COUNTIF(I4:AE4,TRUE)","v":8},{"$f":"Valuation!H19-Valuation!H18+1=G4","v":true},{"$f":"AND(I2>=Valuation!$H$18,I2<=Valuation!$H$19)","v":false},{"$f":"AND(J2>=Valuation!$H$18,J2<=Valuation!$H$19)","v":false},{"$f":"AND(K2>=Valuation!$H$18,K2<=Valuation!$H$19)","v":false},{"$f":"AND(L2>=Valuation!$H$18,L2<=Valuation!$H$19)","v":false},{"$f":"AND(M2>=Valuation!$H$18,M2<=Valuation!$H$19)","v":false},{"$f":"AND(N2>=Valuation!$H$18,N2<=Valuation!$H$19)","v":false},{"$f":"AND(O2>=Valuation!$H$18,O2<=Valuation!$H$19)","v":false},{"$f":"AND(P2>=Valuation!$H$18,P2<=Valuation!$H$19)","v":false},{"$f":"AND(Q2>=Valuation!$H$18,Q2<=Valuation!$H$19)","v":false},{"$f":"AND(R2>=Valuation!$H$18,R2<=Valuation!$H$19)","v":false},{"$f":"AND(S2>=Valuation!$H$18,S2<=Valuation!$H$19)","v":false},{"$f":"AND(T2>=Valuation!$H$18,T2<=Valuation!$H$19)","v":false},{"$f":"AND(U2>=Valuation!$H$18,U2<=Valuation!$H$19)","v":true},{"$f":"AND(V2>=Valuation!$H$18,V2<=Valuation!$H$19)","v":true},{"$f":"AND(W2>=Valuation!$H$18,W2<=Valuation!$H$19)","v":true},{"$f":"AND(X2>=Valuation!$H$18,X2<=Valuation!$H$19)","v":true},{"$f":"AND(Y2>=Valuation!$H$18,Y2<=Valuation!$H$19)","v":true},{"$f":"AND(Z2>=Valuation!$H$18,Z2<=Valuation!$H$19)","v":true},{"$f":"AND(AA2>=Valuation!$H$18,AA2<=Valuation!$H$19)","v":true},{"$f":"AND(AB2>=Valuation!$H$18,AB2<=Valuation!$H$19)","v":true},{"$f":"AND(AC2>=Valuation!$H$18,AC2<=Valuation!$H$19)","v":false},{"$f":"AND(AD2>=Valuation!$H$18,AD2<=Valuation!$H$19)","v":false},{"$f":"AND(AE2>=Valuation!$H$18,AE2<=Valuation!$H$19)","v":false}]
[null,"Valuation year",null,null,null,null,{"$f":"COUNTIF(I5:AE5,TRUE)","v":1},null,{"$f":"I2=Valuation!$H$18","v":false},{"$f":"J2=Valuation!$H$18","v":false},{"$f":"K2=Valuation!$H$18","v":false},{"$f":"L2=Valuation!$H$18","v":false},{"$f":"M2=Valuation!$H$18","v":false},{"$f":"N2=Valuation!$H$18","v":false},{"$f":"O2=Valuation!$H$18","v":false},{"$f":"P2=Valuation!$H$18","v":false},{"$f":"Q2=Valuation!$H$18","v":false},{"$f":"R2=Valuation!$H$18","v":false},{"$f":"S2=Valuation!$H$18","v":false},{"$f":"T2=Valuation!$H$18","v":false},{"$f":"U2=Valuation!$H$18","v":true},{"$f":"V2=Valuation!$H$18","v":false},{"$f":"W2=Valuation!$H$18","v":false},{"$f":"X2=Valuation!$H$18","v":false},{"$f":"Y2=Valuation!$H$18","v":false},{"$f":"Z2=Valuation!$H$18","v":false},{"$f":"AA2=Valuation!$H$18","v":false},{"$f":"AB2=Valuation!$H$18","v":false},{"$f":"AC2=Valuation!$H$18","v":false},{"$f":"AD2=Valuation!$H$18","v":false},{"$f":"AE2=Valuation!$H$18","v":false}]
[null,"Closing Balance Sheet for valuation",null,null,null,null,{"$f":"COUNTIF(I6:AE6,TRUE)","v":1},null,{"$f":"I2=Valuation!$H$18-1","v":false},{"$f":"J2=Valuation!$H$18-1","v":false},{"$f":"K2=Valuation!$H$18-1","v":false},{"$f":"L2=Valuation!$H$18-1","v":false},{"$f":"M2=Valuation!$H$18-1","v":false},{"$f":"N2=Valuation!$H$18-1","v":false},{"$f":"O2=Valuation!$H$18-1","v":false},{"$f":"P2=Valuation!$H$18-1","v":false},{"$f":"Q2=Valuation!$H$18-1","v":false},{"$f":"R2=Valuation!$H$18-1","v":false},{"$f":"S2=Valuation!$H$18-1","v":false},{"$f":"T2=Valuation!$H$18-1","v":true},{"$f":"U2=Valuation!$H$18-1","v":false},{"$f":"V2=Valuation!$H$18-1","v":false},{"$f":"W2=Valuation!$H$18-1","v":false},{"$f":"X2=Valuation!$H$18-1","v":false},{"$f":"Y2=Valuation!$H$18-1","v":false},{"$f":"Z2=Valuation!$H$18-1","v":false},{"$f":"AA2=Valuation!$H$18-1","v":false},{"$f":"AB2=Valuation!$H$18-1","v":false},{"$f":"AC2=Valuation!$H$18-1","v":false},{"$f":"AD2=Valuation!$H$18-1","v":false},{"$f":"AE2=Valuation!$H$18-1","v":false}]
{"$rows_left_out":198}
{"sheet":"SG&A Analysis","index":7,"n_rows":12,"n_cols":33,"rows_kept":12,"cut":false,"hidden":false,"merged":[]}
[]
[null,null,null,"Year",1,{"$f":"E2+1","v":2},{"$f":"F2+1","v":3},4,5,6,7,8,9,10,11,12,13]
[null,null,null,"Revenues",{"$f":"'Corporate Model'!I82","v":1568934},{"$f":"'Corporate Model'!J82","v":1299490},{"$f":"'Corporate Model'!K82","v":1328607},{"$f":"'Corporate Model'!L82","v":1452995},{"$f":"'Corporate Model'!M82","v":1551308},{"$f":"'Corporate Model'!N82","v":1715869},{"$f":"'Corporate Model'!O82","v":1888654},{"$f":"'Corporate Model'!P82","v":2036674},{"$f":"'Corporate Model'!Q82","v":2414892},{"$f":"'Corporate Model'!R82","v":2600849},{"$f":"'Corporate Model'!S82","v":2573769},{"$f":"'Corporate Model'!T82","v":2773356},{"$f":"'Corporate Model'!U82","v":3046491},{"$f":"'Corporate Model'!V82","v":0},{"$f":"'Corporate Model'!W82","v":0},{"$f":"'Corporate Model'!X82","v":0},{"$f":"'Corporate Model'!Y82","v":0},{"$f":"'Corporate Model'!Z82","v":0},{"$f":"'Corporate Model'!AA82","v":0},{"$f":"'Corporate Model'!AB82","v":0},{"$f":"'Corporate Model'!AC82","v":0},{"$f":"'Corporate Model'!AD82","v":0},{"$f":"'Corporate Model'!AE82","v":0},{"$f":"'Corporate Model'!AF82","v":0},{"$f":"'Corporate Model'!AG82","v":0},{"$f":"'Corporate Model'!AH82","v":0},{"$f":"'Corporate Model'!AI82","v":0},{"$f":"'Corporate Model'!AJ82","v":0},{"$f":"'Corporate Model'!AK82","v":0}]
[null,null,null,"SG&A Costs",{"$f":"'Corporate Model'!I84","v":591489},{"$f":"'Corporate Model'!J84","v":557957},{"$f":"'Corporate Model'!K84","v":554078},{"$f":"'Corporate Model'!L84","v":601013},{"$f":"'Corporate Model'!M84","v":632895},{"$f":"'Corporate Model'!N84","v":695656},{"$f":"'Corporate Model'!O84","v":759387},{"$f":"'Corporate Model'!P84","v":787821},{"$f":"'Corporate Model'!Q84","v":894800},{"$f":"'Corporate Model'!R84","v":926418},{"$f":"'Corporate Model'!S84","v":935999},{"$f":"'Corporate Model'!T84","v":1016491},{"$f":"'Corporate Model'!U84","v":1107480},{"$f":"'Corporate Model'!V84","v":0},{"$f":"'Corporate Model'!W84","v":0},{"$f":"'Corporate Model'!X84","v":0},{"$f":"'Corporate Model'!Y84","v":0},{"$f":"'Corporate Model'!Z84","v":0},{"$f":"'Corporate Model'!AA84","v":0},{"$f":"'Corporate Model'!AB84","v":0},{"$f":"'Corporate Model'!AC84","v":0},{"$f":"'Corporate Model'!AD84","v":0},{"$f":"'Corporate Model'!AE84","v":0},{"$f":"'Corporate Model'!AF84","v":0},{"$f":"'Corporate Model'!AG84","v":0},{"$f":"'Corporate Model'!AH84","v":0},{"$f":"'Corporate Model'!AI84","v":0},{"$f":"'Corporate Model'!AJ84","v":0},{"$f":"'Corporate Model'!AK84","v":0}]
[null,null,null,"SG&A Cost",{"$f":"$G$9+$F$9*E2+$E$9*E3","v":593823.40604287176},{"$f":"$G$9+$F$9*F2+$E$9*F3","v":543435.88856394659},562732.43137487071,604265.20097989822,639712.07231938594,690621.20974882494,743449.82665422943,790498.29895575694,891274.92500342918,947177.88330686581,953358.06083194015,1012442.2576151202,1088692.5386028606]
[]
{"$rows_left_out":7}
{"sheet":"Acquisition","index":8,"n_rows":233,"n_cols":18,"rows_kept":233,"cut":false,"hidden":false,"merged":[]}
["Transaction date",null,null,null,null,2012,null,"Col Number",{"$f":"MATCH(F1,'Corporate Model'!2:2)","v":21}]
[null,null,"Period",null,null,0,{"$f":"F2+1","v":1},{"$f":"G2+1","v":2},3,4,5,6,7,8,9,10,11,12]
[null,null,"Exit period",null,null,{"$f":"F2=$F$17","v":false},false,false,false,false,false,false,false,false,false,true,false,false]
[null,null,"Holding period",null,null,null,{"$f":"G2<=$F$17","v":true},true,true,true,true,true,true,true,true,true,false,false]
[null,null,"Year",null,null,{"$f":"F1","v":2012},{"$f":"F5+1","v":2013},{"$f":"G5+1","v":2014},2015,2016,2017,2018,2019,2020,2021,2022,2023,2024]
[null,null,"Date for XIRR",null,null,{"$f":"DATE(F5,12,31)","v":"2012-12-31"},{"$f":"DATE(G5,7,1)","v":"2013-07-01"},{"$f":"DATE(H5,7,1)","v":"2014-07-01"},"2015-07-01","2016-07-01","2017-07-01","2018-07-01","2019-07-01","2020-07-01","2021-07-01","2022-07-01","2023-07-01","2024-07-01"]
{"$rows_left_out":228}
{"sheet":"Audit","index":9,"n_rows":7,"n_cols":3,"rows_kept":7,"cut":false,"hidden":false,"merged":[]}
[]
[]
[]
[null,"Test of current assets",{"$f":"'Corporate Model'!H391","v":true}]
[null,"Test of current liabilities",{"$f":"'Corporate Model'!H392","v":true}]
[null,"income Statement Test",{"$f":"'Corporate Model'!H613","v":true}]
{"$rows_left_out":2}
{"sheet":"PE ratio","index":10,"n_rows":77,"n_cols":257,"rows_kept":77,"cut":false,"hidden":false,"merged":[]}
[null,null,null,null,null,null,null,null,null,null,null,null,null,null,null,null,null,null,null,null,null,null,null,null,null,null,null,null,null,null,null,null,null,null,null,null,null,null,null,null,null,null,null,null,null,null,null,null,null,null,null,null,null,null,null,null,null,null,null,null,null,null,null,null,null,null,null,null,null,null,null,null,null,null,null,null,null,null,null,null,null,null,null,null,null,null,null,null,null,null,null,null,null,null,null,null,null,null,null,null,null,null,null,null,null,null,null,null,null,null,null,null,null,null,null,null,null,null,null,null,null,null,null,null,null,null,null,null,null,null,null,null,null,null,null,null,null,null,null,null,null,null,null,null,null,null,null,null,null,null,null,null,null,null,null,null,null,null,null,null,null,null,null,null,null,null,null,null,null,null,null,null,null,null,null,null,null,null,null,null,null,null,null,null,null,null,null,null,null,null,null,null,null,null,null,null,null,null,null,null,null,null,null,null,null,null,null,null,null,null,null,null,null,null,null,null,null,null,null,null,null,null,null,null,null,null,null,null,null,null,null,null,null,null,null,null,null,null,null,null,null,null,null,null,0]
[null,null,null,null,null,null,null,null,null,null,"M/B ratio","P/E ratio"]
[null,null,null,"RoE",0.12,null,"P/E ratio",{"$f":"F29","v":20.000050758355016},null,null,{"$f":"H4","v":2.4000060910026018},{"$f":"H3","v":20.000050758355016}]
[null,null,null,"Long-term ROE",0.1,null,"M/B ratio",{"$f":"F28/Book_value_per_share","v":2.4000060910026018},null,0.15,2.5125424989407845,16.750283326271898]
[null,null,null,"Short Term COE",5.6508521506509028E-2,null,"Actual P/e Ratio",{"$f":"H8/10","v":20},null,0.12,2.4000060910026018,20.000050758355016]
[null,null,null,"Long term COE",{"$f":"CoE","v":5.6508521506509028E-2},null,"Difference",{"$f":"H3-H5","v":5.0758355016000678E-5},null,0.1,2.3249818190438116,23.249818190438116]
{"$rows_left_out":72}
{"sheet":"Stock price download","index":11,"n_rows":15,"n_cols":4,"rows_kept":15,"cut":false,"hidden":false,"merged":[]}
[{"$f":"A15","v":"http://ichart.finance.yahoo.com/table.csv?s=FLO&d=3&e=16&f=2013&g=d&a=10&b=5&c=1987&ignore=.csv"}]
[]
[]
[]
[]
["http://ichart.finance.yahoo.com/table.csv?s="]
{"$rows_left_out":10}
{"sheet":"Stock prices","index":12,"n_rows":6413,"n_cols":27,"rows_kept":6413,"cut":false,"hidden":false,"merged":[]}
["Date",null,"Open","High","Low","Close","Volume","Adj Close"]
[]
[]
[]
[]
[]
{"$rows_left_out":6408}
{"sheet":"Offset Function","index":13,"n_rows":17,"n_cols":14,"rows_kept":17,"cut":false,"hidden":false,"merged":[]}
[]
[]
[null,null,"Off Set Function Analysis"]
[null,null,null,null,2000,{"$f":"E4+1","v":2001},2002,2003,2004,2005,2006,2007,2008,2009]
[null,null,1,"Arjen",-835,{"$f":"E5*1.05","v":-876.75},-920.58750000000009,-966.61687500000016,-1014.9477187500003,-1065.6951046875004,-1118.9798599218755,-1174.9288529179694,-1233.6752955638678,-1295.3590603420612]
[null,null,4,"Roxanne",6,{"$f":"E6*9","v":54},{"$f":"F6*9","v":486},4374,39366,354294,3188646,28697814,258280326,2324522934]
{"$rows_left_out":12}
{"sheet":"Codes","index":14,"n_rows":14,"n_cols":10,"rows_kept":14,"cut":false,"hidden":false,"merged":[]}
[]
[]
[null,null,null,null,null,"True Code",{"$f":"1=1","v":true}]
[null,null,null,null,null,"False Code",{"$f":"1=2","v":false}]
[]
[]
{"$rows_left_out":9}
{"sheet":"2012 Update","index":15,"n_rows":181,"n_cols":12,"rows_kept":181,"cut":false,"hidden":false,"merged":[]}
[null,"December 29, 2012",null,null,"December 31, 2011"]
[null,"(Amounts in thousands, except"]
[null,"share data)"]
[null,null,"ASSETS",2012]
["Current Assets:"]
["Cash and cash equivalents","$",13275,null,"$",7783]
{"$rows_left_out":176}
{"sheet":"Circular Sweep","index":16,"n_rows":260,"n_cols":14,"rows_kept":260,"cut":false,"hidden":false,"merged":[]}
[]
[null,"Note: In tax case need to adjust for other items not deducted for tax such as cap exp and wc changes"]
[]
[]
[]
["Sweep No Taxes"]
{"$rows_left_out":255}
{"sheet":"Circular Corporate","index":17,"n_rows":229,"n_cols":17,"rows_kept":229,"cut":false,"hidden":false,"merged":[]}
[]
["Notes: Could include adjustment for minority interest"]
["notes: Anything variable in I/S that affects taxes and anything that is not sub-total in cash flow statement must be in function"]
["Note: by the tme get to I/S or the cash flow the items are virtually always the same: EBITDA, Interest Expense, Interest Income etc."]
["Note: Can have mini loop for items that seem impossible to resolve"]
["Note: Create cash flow waterfall"]
{"$rows_left_out":223}