{"text_format":"1","workbook":"xlsx","n_sheets":15,"sheets":["Contents","Summary","Master Scenario","Financial Model","Valuation and Analysis","Audit","Financial Data Chart","Assumption Chart","Sheet2","2015 EBITDA Forecast","Forecst of Sustaining Cap Exp","2012 Volumes","2012 Summary Income","2013 Assumptions","Gross Plant"],"not_rendered":{"charts":6,"images":10,"macros":1,"external_links":0,"defined_names":14,"comments":0,"pivot_tables":0},"unopened":[{"sheet":"Financial Data Chart","index":6,"reason":"not_a_worksheet"},{"sheet":"Assumption Chart","index":7,"reason":"not_a_worksheet"}],"bounds":{"document_bytes":16777216,"sheet_cells":100000,"rows_first":2000,"rows_last":500,"rows_between":2000,"halvings":0,"cell_chars":16384,"cell_head_chars":4096},"cells_cut":0,"cells_raw":0,"read":"whole","date_system":"1900"}

{"sheet":"Contents","index":0,"n_rows":25,"n_cols":5,"rows_kept":25,"cut":false,"hidden":false,"merged":[]}
[]
[]
[null,null,"Sheet Tab","Description","Author"]
[null,1,"Contents"]
[null,2,"Summary"]
[null,3,"Master Scenario"]
[null,4,"Financial Model"]
[null,5,"Valuation and Analysis"]
[null,6,"Audit"]
[null,7,"Financial Data Chart"]
[null,8,"Assumption Chart"]
[null,9,"Sheet2"]
[null,10,"2015 EBITDA Forecast"]
[null,11,"Forecst of Sustaining Cap Exp"]
[null,12,"2012 Volumes"]
[null,13,"2012 Summary Income"]
[null,14,"2013 Assumptions"]
[null,15,"Gross Plant"]
[]
[null," File Name: ",null,{"$f":"File_name()","v":"C:\\Users\\Monika Lewenski\\Courses\\Chapter 1. Models and Analysis\\A. Corporate Models Templates and Exercises\\A. Featured Corporate Finance Models\\LaFarge Financial Model.xlsm"}]
[]
[null," Last Save Date ",null,{"$f":"lastsaved1()","v":"18/03/2017 07:19:33"}]
[null," Last Save By",null,{"$f":"lastsaveby1()","v":"Elvis Presley"}]
[]
[null," Colour Codes "]

{"sheet":"Summary","index":1,"n_rows":26,"n_cols":20,"rows_kept":26,"cut":false,"hidden":false,"merged":[]}
[]
[null,null,null,"Scenario",null,null,null,"Assumption Item to Graph",null,null,null,null,null,"Explicit Period",null,null,null,{"$f":"'Valuation and Analysis'!$E$11","v":6}]
[null,null,null,null,null,null,null,null,null,null,null,null,null,"WACC",null,null,null,{"$f":"wacc","v":9.5000000000000001E-2}]
[null,null,null,"Key Value Drivers","Custom Case Senstivity"]
[null,null,null,"Cement prices",null,null,null,null,null,null,null,null,null,null,null,null,null,"Growth","EV/EBITDA","ROIC"]
[null,null,null,"Growth rate",null,null,null,null,null,null,null,null,null,"Valuation from Free Cash Flow",null,null,null,{"$f":"growth","v":0.02},{"$f":"EV_EBITDA","v":6},{"$f":"long_term_roic","v":0.105}]
[null,null,null,"Utilisation Rate",null,null,null,null,null,null,null,null,null,"Value of Explicit Cash Flow",null,null,null,{"$f":"'Valuation and Analysis'!E38","v":8328.0806555826839},{"$f":"R7","v":8328.0806555826839},{"$f":"S7","v":8328.0806555826839}]
[null,null,null,"Capex per tonne /new capacity",null,null,null,null,null,null,null,null,null,"Value of Terminal Cash Flow",null,null,null,{"$f":"'Valuation and Analysis'!E42","v":16351.863772601642},{"$f":"'Valuation and Analysis'!E69","v":23594.558628332041},{"$f":"'Valuation and Analysis'!E91","v":23504.519975860108}]
[null,null,null,"Sustaining Capital Expenditures",null,null,null,null,null,null,null,null,null,"Value of Enterprise",null,null,null,{"$f":"SUM(R7:R8)","v":24679.944428184324},{"$f":"SUM(S7:S8)","v":31922.639283914723},{"$f":"SUM(T7:T8)","v":31832.600631442794}]
[null,null,null,"COGS/Tonne",null,null,null,null,null,null,null,null,null,"Bridge: Equity Value vs EV",null,null,null,{"$f":"'Valuation and Analysis'!E72","v":-12443},{"$f":"R10","v":-12443},{"$f":"S10","v":-12443}]
[null,null,null,"SG&A",{"$f":"'Master Scenario'!G42","v":0.11},null,null,null,null,null,null,null,null,"Equity Value",null,null,null,{"$f":"R9+R10","v":12236.944428184324},{"$f":"S9+S10","v":19479.639283914723},{"$f":"T9+T10","v":19389.600631442794}]
[null,null,null,"Interest Rate",{"$f":"'Master Scenario'!N42","v":0.08},null,null,null,null,null,null,null,null,"Shares",null,null,null,{"$f":"'Valuation and Analysis'!E75","v":286514},{"$f":"R12","v":286514},{"$f":"S12","v":286514}]
[null,null,null,null,null,null,null,null,null,null,null,null,null,"Value Per Share",null,null,null,{"$f":"'Valuation and Analysis'!E63","v":42.709760877947765},{"$f":"'Valuation and Analysis'!E76","v":67.988437856142184},{"$f":"'Valuation and Analysis'!E97","v":67.674182174144349}]
[]
[]
[null,null,null,null,null,null,null,"Finanial Ratio to Graph"]
[]
[]
[]
[]
[]
[null,null,null,"Stable Ratios in Terminal Year"]
[null,null,null,"Capital Expenditures/Dep"]
[null,null,null,"Net Depreciation Rate"]
[null,null,null,"Working Capital/EBITDA"]
[null,null,null,"Dividend Payout"]

{"sheet":"Master Scenario","index":2,"n_rows":42,"n_cols":20,"rows_kept":42,"cut":false,"hidden":false,"merged":[]}
[]
[null,"Explicit Period"]
[null,"Perpetual Terminal Growth",null,null,"Explicit Period",{"$f":"'Valuation and Analysis'!$E$11","v":6},"WACC"]
[null,"Scenario #",4]
[null,"Production Increase","Utilisation","Cement Price","Aggregrate and Concrete Percent","Cost of Production","SG&A %","Sustaining Cap Exp","New Cap Exp","Minimum Cash Balance","AR / Sales","Inv / COGS","Effective Tax Rate","Interest Rate","Other Expenses",null,"DCF Valuation","DCF / EV EBITDA","DCF / Value Drivers","Equity Cash Flow Valuation"]
[null,null,null,null,null,null,null,null,null,null,null,null,null,null,null,null,{"$f":"'Valuation and Analysis'!E63","v":42.709760877947765},{"$f":"'Valuation and Analysis'!E76","v":67.988437856142184},{"$f":"Summary!$T$13","v":67.674182174144349}]
["Company Case",1,1,1,0.52,1,0.1,1,1,0.02,0.17,0.15,0.25,7.0000000000000007E-2,150,1]
["Base Case",1,1,1,0.52,1,0.1,1,1,0.02,0.17,0.15,0.25,7.0000000000000007E-2,150,2]
["High Case",2,2,2,0.55000000000000004,2,8.5000000000000006E-2,2,2,0.01,0.16,0.14000000000000001,0.2,0.06,100,3]
["Low Case",3,3,3,0.45,3,0.11,3,3,0.1,0.2,0.16,0.3,0.08,170,4]
[{"$f":"\"Low Case \"&TRANSPOSE(B5:O5)","v":"Low Case Production Increase"},{"$f":"B10","v":3},{"$f":"C$7","v":1},1,0.52,1,0.1,1,1,0.02,0.17,0.15,0.25,7.0000000000000007E-2,150,5]
["Low Case Utilisation",{"$f":"B$7","v":1},{"$f":"C10","v":3},1,0.52,1,0.1,1,1,0.02,0.17,0.15,0.25,7.0000000000000007E-2,150,6]
["Low Case Cement Price",1,1,{"$f":"D10","v":3},0.52,1,0.1,1,1,0.02,0.17,0.15,0.25,7.0000000000000007E-2,150,7]
["Low Case Aggregrate and Concrete Percent",1,1,1,{"$f":"E10","v":0.45},1,0.1,1,1,0.02,0.17,0.15,0.25,7.0000000000000007E-2,150,8]
["Low Case Cost of Production",1,1,1,0.52,{"$f":"F10","v":3},0.1,1,1,0.02,0.17,0.15,0.25,7.0000000000000007E-2,150,9]
["Low Case SG&A %",1,1,1,0.52,1,{"$f":"G10","v":0.11},1,1,0.02,0.17,0.15,0.25,7.0000000000000007E-2,150,10]
["Low Case Sustaining Cap Exp",1,1,1,0.52,1,0.1,{"$f":"H10","v":3},1,0.02,0.17,0.15,0.25,7.0000000000000007E-2,150,11]
["Low Case New Cap Exp",1,1,1,0.52,1,0.1,1,{"$f":"I10","v":3},0.02,0.17,0.15,0.25,7.0000000000000007E-2,150,12]
["Low Case Minimum Cash Balance",1,1,1,0.52,1,0.1,1,1,{"$f":"J10","v":0.1},0.17,0.15,0.25,7.0000000000000007E-2,150,13]
["Low Case AR / Sales",1,1,1,0.52,1,0.1,1,1,0.02,{"$f":"K10","v":0.2},0.15,0.25,7.0000000000000007E-2,150,14]
["Low Case Inv / COGS",1,1,1,0.52,1,0.1,1,1,0.02,0.17,{"$f":"L10","v":0.16},0.25,7.0000000000000007E-2,150,15]
["Low Case Effective Tax Rate",1,1,1,0.52,1,0.1,1,1,0.02,0.17,0.15,0.25,7.0000000000000007E-2,150,16]
["Low Case Interest Rate",1,1,1,0.52,1,0.1,1,1,0.02,0.17,0.15,0.25,7.0000000000000007E-2,150,17]
["Low Case Other Expenses",1,1,1,0.52,1,0.1,1,1,0.02,0.17,0.15,0.25,7.0000000000000007E-2,150,18]
[{"$f":"\"High Case \"&TRANSPOSE(B5:O5)","v":"High Case Production Increase"},1,1,1,0.52,1,0.1,1,1,0.02,0.17,0.15,0.25,7.0000000000000007E-2,150,19]
["High Case Utilisation",1,1,1,0.52,1,0.1,1,1,0.02,0.17,0.15,0.25,7.0000000000000007E-2,150,20]
["High Case Cement Price",1,{"$f":"C$7","v":1},1,0.52,1,0.1,1,1,0.02,0.17,0.15,0.25,7.0000000000000007E-2,150,21]
["High Case Aggregrate and Concrete Percent",1,1,1,0.52,1,0.1,1,1,0.02,0.17,0.15,0.25,7.0000000000000007E-2,150,22]
["High Case Cost of Production",1,1,1,0.52,1,0.1,1,1,0.02,0.17,0.15,0.25,7.0000000000000007E-2,150,23]
["High Case SG&A %",1,1,1,0.52,1,0.1,1,1,0.02,0.17,0.15,0.25,7.0000000000000007E-2,150,24]
["High Case Sustaining Cap Exp",1,1,1,0.52,1,0.1,1,1,0.02,0.17,0.15,0.25,7.0000000000000007E-2,150,25]
["High Case New Cap Exp",1,1,1,0.52,1,0.1,1,1,0.02,0.17,0.15,0.25,7.0000000000000007E-2,150,26]
["High Case Minimum Cash Balance",1,1,1,0.52,1,0.1,1,1,0.02,0.17,0.15,0.25,7.0000000000000007E-2,150,27]
["High Case AR / Sales",1,1,1,0.52,1,0.1,1,1,0.02,0.17,0.15,0.25,7.0000000000000007E-2,150,28]
["High Case Inv / COGS",1,1,1,0.52,1,0.1,1,1,0.02,0.17,0.15,0.25,7.0000000000000007E-2,150,29]
["High Case Effective Tax Rate",1,1,1,0.52,1,0.1,1,1,0.02,0.17,0.15,0.25,7.0000000000000007E-2,150,30]
["High Case Interest Rate",1,1,1,0.52,1,0.1,1,1,0.02,0.17,0.15,0.25,7.0000000000000007E-2,150,31]
["High Case Other Expenses",1,1,1,0.52,1,0.1,1,1,0.02,0.17,0.15,0.25,7.0000000000000007E-2,150,32]
["Custom Case Sensitivity",2,1,1,0.52,1,0.1,3,2,0.02,0.17,{"$f":"L$7","v":0.15},{"$f":"M$7","v":0.25},{"$f":"N$7","v":7.0000000000000007E-2},{"$f":"O$7","v":150},33]
[]
{"$rows_left_out":3}
{"sheet":"Financial Model","index":3,"n_rows":760,"n_cols":30,"rows_kept":760,"cut":false,"hidden":false,"merged":[]}
[null,null,null,null,null,null,null,45,null,null,null,null,null,null,{"$f":"AD370","v":1}]
[]
[null,null,null,null,2006,2007,2008,2009,2010,2011,2012,2013,2014,2015,2016,2017,2018,2019,2020,2021,2022]
[null,null,"Historic switch",null,{"$f":"E3<=$E$8","v":true},true,true,true,true,true,false,false,false,false,false,false,false,false,false,false,false]
[null,null,"Explicit Forecast Period",null,{"$f":"AND(E3>$E$8,E3<=$E$9)","v":false},false,false,false,false,false,true,true,true,true,true,true,true,false,false,false,false]
[null,null,"Terminal Period",null,{"$f":"E3=$E$9","v":false},false,false,false,false,false,false,false,false,false,false,false,true,false,false,false,false]
[]
[null,null,"Last Historic Year",null,2011]
[null,null,"Terminal Period",null,{"$f":"E8+'Valuation and Analysis'!E11+1","v":2018}]
[]
["Historic Financials"]
[null,"Prodction and Capacity"]
[null,null,null,"Cement Volumes (MM Tonnes)",null,136.30000000000001,154.6,141.25299999999999,135.65,145.38999999999999,{"$f":"'2012 Volumes'!O9","v":141.1}]
[null,null,null,"Cement Capacity",null,null,196.29999999999998,201.29999999999995,216.5,221]
[]
[null,"Income Statement"]
[null,null,"Revenues"]
[null,null,null,"Cement",8847,9456,10911,9477,9656,9975]
[null,null,null,"Aggregates",6439,6586,6573,5064,5088,5227]
[null,null,null,"Gypsum",1610,1556,1521,1334,90,82]
[null,null,null,"Other",13,16,28,9]
[null,null,null,"Total Revenue",{"$f":"SUM(E18:E21)","v":16909},17614,19033,15884,14834,15284]
[null,null,null," Cost of sales       ",-12385,-12700,-13729,-11707,-10920,-11627]
[null,null,null," Selling and administrative expenses      ",-1752,-1672,-1762,-1700,-1521,-1478]
[null,null,null," OPERATING INCOME BEFORE CAPITAL GAINS, IMPAIRMENT, RESTRUCTURING AND OTHER ",{"$f":"SUM(E22:E24)","v":2772},3242,3542,2477,2393,2179]
[null,null,null," Net gains (losses) on disposals     ",28,196,229,103,45,45]
[null,null,null," Other operating income (expenses)      ",-122,-149,-409,-330,-304,-541]
[null,null,null," OPERATING INCOME        ",{"$f":"SUM(E25:E27)","v":2678},3289,3362,2250,2134,1683]
[null,null,null," Finance costs        ",-582,-652,-1157,-1136,-1055,-1142]
[null,null,null," Finance income        ",97,126,216,210,343,143]
[null,null,null," Share of net income (loss) of associates   ",30,0,-3,-18,-23,-8]
[null,null,null," INCOME BEFORE INCOME TAX      ",{"$f":"SUM(E28:E31)","v":2223},2763,2418,1306,1399,676]
[null,null,null," Income tax        ",-630,-725,-479,-260,-305,-432]
[null,null,null," NET INCOME FROM CONTINUING OPERATIONS     ",1593,2038,1939,1046,1094,244]
[null,null,null," Net income / (loss) from discontinued operations   ",-4,118,0,0,20,492]
[null,null,null," NET INCOME        ",1589,2156,1939,1046,1114,736]
[null,null,null," Of which, attributable to:      "]
[null,null,null," Owners of the parent company     ",1372,1909,1598,736,827,593]
[null,null,null," Non-controlling interests        ",217,247,341,310,287,143]
[null,null,null," EARNINGS PER SHARE (EUROS)      "]
{"$rows_left_out":721}
{"sheet":"Valuation and Analysis","index":4,"n_rows":115,"n_cols":21,"rows_kept":115,"cut":false,"hidden":false,"merged":[]}
[null,null,null,null,2006,2007,2008,2009,2010,2011,2012,2013,2014,2015,2016,2017,2018,2019,2020,2021,2022]
[null,null,"Historic switch",null,{"$f":"E1<=$E$8","v":true},true,true,true,true,true,false,false,false,false,false,false,false,false,false,false,false]
[null,null,"Explicit Forecast Period",null,{"$f":"AND(E1>$E$8,E1<=$E$10)","v":false},false,false,false,false,false,true,true,true,true,true,true,false,false,false,false,false]
[null,null,"Terminal Period",null,{"$f":"E1=$E$10","v":false},false,false,false,false,false,false,false,false,false,false,true,false,false,false,false,false]
[]
["Valuation Assumptions"]
[null,"Date Parameters for Valuation"]
[null,null,"last historic year",null,2011]
[null,null,"Explicit Period",null,5]
[null,null,"Terminal Period",null,{"$f":"E8+E9+1","v":2017}]
[null,null,"Explicit Period",null,6]
[]
[null,"DCF Parameters"]
[null,null,"WACC",null,9.5000000000000001E-2,"wacc"]
[null,null,"Growth Rate",null,0.02,"growth"]
[null,null,"Long-term ROIC vs WACC",null,0.01,"roic spread"]
[null,null,"Long-term ROIC  ",null,{"$f":"roic_spread+wacc","v":0.105},"long-term roic"]
[null,null,"Terminal EV/EBITDA Ratio",null,6,"EV/EBITDA"]
[]
[null,"Equity Valuation"]
[null,null,"Cost of Equity"]
[null,null,"Growth Rate"]
[null,null,"ROE in Terminal Year"]
[null,null,"Implied Payout Ratio"]
[null,null,"Long-term ROE vs COE"]
[null,null,"Long-term ROE  "]
[]
[]
["Free Cash Flow (FCF)"]
[]
[null,null,"EBITDA",null,{"$f":"'Financial Model'!E421","v":3704},{"$f":"'Financial Model'!F421","v":4183},{"$f":"'Financial Model'!G421","v":4618},{"$f":"'Financial Model'!H421","v":3600},{"$f":"'Financial Model'!I421","v":3486},{"$f":"'Financial Model'!J421","v":3217},{"$f":"'Financial Model'!K421","v":3642.5439600000009},{"$f":"'Financial Model'!L421","v":4264.2470199999989},{"$f":"'Financial Model'!M421","v":5136.2829000000002},{"$f":"'Financial Model'!N421","v":5971.0298399999992},{"$f":"'Financial Model'!O421","v":6454.9058400000031},{"$f":"'Financial Model'!P421","v":6938.7818399999996},{"$f":"'Financial Model'!Q421","v":7422.6578399999999},{"$f":"'Financial Model'!R421","v":7906.5338400000001},{"$f":"'Financial Model'!S421","v":8390.4098400000039},{"$f":"'Financial Model'!T421","v":8874.2858400000041},{"$f":"'Financial Model'!U421","v":9358.1618400000043}]
[null,null,"Less CAPEX",null,{"$f":"'Financial Model'!E433","v":4814},{"$f":"'Financial Model'!F433","v":3170},{"$f":"'Financial Model'!G433","v":11761},{"$f":"'Financial Model'!H433","v":1719},{"$f":"'Financial Model'!I433","v":1321},{"$f":"'Financial Model'!J433","v":1125},{"$f":"'Financial Model'!K433","v":1722},{"$f":"'Financial Model'!L433","v":1953.91},{"$f":"'Financial Model'!M433","v":2198.1848},{"$f":"'Financial Model'!N433","v":2455.3575690000002},{"$f":"'Financial Model'!O433","v":2725.9823378200003},{"$f":"'Financial Model'!P433","v":3010.6347709571005},{"$f":"'Financial Model'!Q433","v":3309.9129659783885},{"$f":"'Financial Model'!R433","v":3624.4382814070923},{"$f":"'Financial Model'!S433","v":3954.8561940921377},{"$f":"'Financial Model'!T433","v":4301.8371870850197},{"$f":"'Financial Model'!U433","v":4666.0776690827925}]
[null,null,"Less Changing in Working Capital",null,{"$f":"'Financial Model'!E453","v":0},{"$f":"'Financial Model'!F453","v":-113.00000000000045},{"$f":"'Financial Model'!G453","v":-117},{"$f":"'Financial Model'!H453","v":-865.99999999999955},{"$f":"'Financial Model'!I453","v":-481},{"$f":"'Financial Model'!J453","v":-31},{"$f":"'Financial Model'!K453","v":217.54961600000024},{"$f":"'Financial Model'!L453","v":103.18347600000016},{"$f":"'Financial Model'!M453","v":140.90674800000033},{"$f":"'Financial Model'!N453","v":137.1630239999995},{"$f":"'Financial Model'!O453","v":81.669600000001083},{"$f":"'Financial Model'!P453","v":81.669599999997445},{"$f":"'Financial Model'!Q453","v":81.669600000001083},{"$f":"'Financial Model'!R453","v":81.669600000001083},{"$f":"'Financial Model'!S453","v":81.669600000000173},{"$f":"'Financial Model'!T453","v":81.669600000000173},{"$f":"'Financial Model'!U453","v":81.669600000000173}]
[null,null,"Less (EBIT X Tax Rate)",null,{"$f":"'Financial Model'!E468","v":785.58704453441294},{"$f":"'Financial Model'!F468","v":850.6876583423815},{"$f":"'Financial Model'!G468","v":701.66170388751038},{"$f":"'Financial Model'!H468","v":493.1240428790199},{"$f":"'Financial Model'!I468","v":521.70478913509658},{"$f":"'Financial Model'!J468","v":1392.4970414201184},{"$f":"'Financial Model'!K468","v":766.38118800000018},{"$f":"'Financial Model'!L468","v":939.57684599999959},{"$f":"'Financial Model'!M468","v":1183.9343082},{"$f":"'Financial Model'!N468","v":1413.1830487259997},{"$f":"'Financial Model'!O468","v":1533.2521530061808},{"$f":"'Financial Model'!P468","v":1649.3946958415272},{"$f":"'Financial Model'!Q468","v":1761.590955582521},{"$f":"'Financial Model'!R468","v":1869.8100310461987},{"$f":"'Financial Model'!S468","v":1974.010135603417},{"$f":"'Financial Model'!T468","v":2074.138852675243},{"$f":"'Financial Model'!U468","v":2170.1333546991905}]
[null,null,null,"Free Cash Flow",{"$f":"E31-SUM(E32:E34)","v":-1895.5870445344126},275.31234165761907,-7727.6617038875102,2253.8759571209794,2124.2952108649033,730.50295857988158,936.61315600000034,1267.5766979999994,1613.2570437999998,1965.3261982739996,2114.0017491738208,2197.0827732013749,2269.4843184390893,2330.615927546708,2379.8739103044491,2416.6402002397408,2440.2812162180217]
[]
[null,null,"FCF over Explicit Period",null,{"$f":"IF('Financial Model'!E5,E35)","v":false},{"$f":"IF('Financial Model'!F5,F35)","v":false},{"$f":"IF('Financial Model'!G5,G35)","v":false},{"$f":"IF('Financial Model'!H5,H35)","v":false},{"$f":"IF('Financial Model'!I5,I35)","v":false},{"$f":"IF('Financial Model'!J5,J35)","v":false},{"$f":"IF('Financial Model'!K5,K35)","v":936.61315600000034},{"$f":"IF('Financial Model'!L5,L35)","v":1267.5766979999994},{"$f":"IF('Financial Model'!M5,M35)","v":1613.2570437999998},{"$f":"IF('Financial Model'!N5,N35)","v":1965.3261982739996},{"$f":"IF('Financial Model'!O5,O35)","v":2114.0017491738208},{"$f":"IF('Financial Model'!P5,P35)","v":2197.0827732013749},{"$f":"IF('Financial Model'!Q5,Q35)","v":2269.4843184390893},{"$f":"IF('Financial Model'!R5,R35)","v":false},{"$f":"IF('Financial Model'!S5,S35)","v":false},{"$f":"IF('Financial Model'!T5,T35)","v":false},{"$f":"IF('Financial Model'!U5,U35)","v":false}]
[null,null,"PV of Free Cash Flow",null,{"$f":"NPV(E14,E37:U37)","v":8328.0806555826839}]
[]
[null,null,"Terminal Value using Growth",null,{"$f":"IF('Financial Model'!E5,E37*(1+growth)/(wacc-growth)*'Financial Model'!E6)","v":false},{"$f":"IF('Financial Model'!F5,F37*(1+growth)/(wacc-growth)*'Financial Model'!F6)","v":false},{"$f":"IF('Financial Model'!G5,G37*(1+growth)/(wacc-growth)*'Financial Model'!G6)","v":false},{"$f":"IF('Financial Model'!H5,H37*(1+growth)/(wacc-growth)*'Financial Model'!H6)","v":false},{"$f":"IF('Financial Model'!I5,I37*(1+growth)/(wacc-growth)*'Financial Model'!I6)","v":false},{"$f":"IF('Financial Model'!J5,J37*(1+growth)/(wacc-growth)*'Financial Model'!J6)","v":false},{"$f":"IF('Financial Model'!K5,K37*(1+growth)/(wacc-growth)*'Financial Model'!K6)","v":0},{"$f":"IF('Financial Model'!L5,L37*(1+growth)/(wacc-growth)*'Financial Model'!L6)","v":0},{"$f":"IF('Financial Model'!M5,M37*(1+growth)/(wacc-growth)*'Financial Model'!M6)","v":0},{"$f":"IF('Financial Model'!N5,N37*(1+growth)/(wacc-growth)*'Financial Model'!N6)","v":0},{"$f":"IF('Financial Model'!O5,O37*(1+growth)/(wacc-growth)*'Financial Model'!O6)","v":0},{"$f":"IF('Financial Model'!P5,P37*(1+growth)/(wacc-growth)*'Financial Model'!P6)","v":0},{"$f":"IF('Financial Model'!Q5,Q37*(1+growth)/(wacc-growth)*'Financial Model'!Q6)","v":30864.986730771616},{"$f":"IF('Financial Model'!R5,R37*(1+growth)/(wacc-growth)*'Financial Model'!R6)","v":false},{"$f":"IF('Financial Model'!S5,S37*(1+growth)/(wacc-growth)*'Financial Model'!S6)","v":false},{"$f":"IF('Financial Model'!T5,T37*(1+growth)/(wacc-growth)*'Financial Model'!T6)","v":false},{"$f":"IF('Financial Model'!U5,U37*(1+growth)/(wacc-growth)*'Financial Model'!U6)","v":false}]
{"$rows_left_out":76}
{"sheet":"Audit","index":5,"n_rows":10,"n_cols":8,"rows_kept":10,"cut":false,"hidden":false,"merged":[]}
[]
[]
[]
[null,null,"Historic Balance Sheet",null,null,null,{"$f":"'Financial Model'!D98","v":true},{"$f":"IF(G4,\"\",C4)","v":""}]
[null,null,"Invested Capital Reconciliation",null,null,null,{"$f":"'Valuation and Analysis'!E111","v":true},{"$f":"IF(G5,\"\",C5)","v":""}]
[null,null,"Historic Income Statement",null,null,null,{"$f":"'Financial Model'!E561","v":true},{"$f":"IF(G6,\"\",C6)","v":""}]
[null,null,"Historic Assets",null,null,null,{"$f":"'Financial Model'!E623","v":true},{"$f":"IF(G7,\"\",C7)","v":""}]
[null,null,"Balance Sheet",null,null,null,{"$f":"'Financial Model'!E643","v":true},{"$f":"IF(G8,\"\",C8)","v":""}]
[]
[null,null,"Aggregate",null,null,null,{"$f":"AND(G4:G8)","v":true}]

{"sheet":"Sheet2","index":8,"n_rows":20,"n_cols":6,"rows_kept":20,"cut":false,"hidden":false,"merged":[]}
[]
[]
[]
[null,null,null,null,{"$f":"sheet_name('Financial Model'!E642)","v":{"$error":"#NAME?"}}]
[]
[]
[]
[null,null,null,null,"agg_dif","='Financial Model'!$E$517"]
[null,null,null,null,"EV_EBITDA","='Valuation and Analysis'!$E$53"]
[null,null,null,null,"exp_avg","='Financial Model'!$E$512:$U$512"]
[null,null,null,null,"exp_dif","='Financial Model'!$E$514:$U$514"]
[null,null,null,null,"exp_fixed","='Financial Model'!$E$513:$U$513"]
[null,null,null,null,"graph_min","='Financial Model'!$E$753"]
[null,null,null,null,"growth","='Valuation and Analysis'!$E$20"]
[null,null,null,null,"inc_avg","='Financial Model'!$E$502:$U$502"]
[null,null,null,null,"inc_dif","='Financial Model'!$E$504:$U$504"]
[null,null,null,null,"inc_fixed","='Financial Model'!$E$503:$U$503"]
[null,null,null,null,"long_term_roic","='Valuation and Analysis'!$E$22"]
[null,null,null,null,"roic_spread","='Valuation and Analysis'!$E$21"]
[null,null,null,null,"wacc","='Valuation and Analysis'!$E$19"]

{"sheet":"2015 EBITDA Forecast","index":9,"n_rows":0,"n_cols":0,"rows_kept":0,"cut":false,"hidden":false,"merged":[]}

{"sheet":"Forecst of Sustaining Cap Exp","index":10,"n_rows":0,"n_cols":0,"rows_kept":0,"cut":false,"hidden":false,"merged":[]}

{"sheet":"2012 Volumes","index":11,"n_rows":15,"n_cols":15,"rows_kept":15,"cut":false,"hidden":false,"merged":[]}
[]
[]
[]
[]
[]
[]
[]
[]
[null,null,null,null,null,null,null,null,null,null,null,null,null,null,141.1]
[]
[]
[]
[null,null,null,null,null,null,null,null,null,null,null,null,null,null,15816]
[null,null,null,null,null,null,null,null,null,null,null,null,null,null,3450]
[null,null,null,null,null,null,null,null,null,null,null,null,null,null,2440]

{"sheet":"2012 Summary Income","index":12,"n_rows":39,"n_cols":15,"rows_kept":39,"cut":false,"hidden":false,"merged":[]}
[]
[]
[]
[]
[]
[]
[]
[]
[]
[]
[]
[]
[]
[]
[]
[]
[]
[]
[]
[]
[]
[]
[]
[]
[]
[]
[]
[]
[]
[]
[]
[]
[]
[]
[]
[]
[null,null,null,null,null,null,null,null,null,null,null,null,null,null,15816]
[null,null,null,null,null,null,null,null,null,null,null,null,null,null,11945]
[null,null,null,null,null,null,null,null,null,null,null,null,null,null,1413]

{"sheet":"2013 Assumptions","index":13,"n_rows":0,"n_cols":0,"rows_kept":0,"cut":false,"hidden":false,"merged":[]}

{"sheet":"Gross Plant","index":14,"n_rows":51,"n_cols":16,"rows_kept":51,"cut":false,"hidden":false,"merged":[]}
[]
[]
[]
[]
[]
[]
[]
[]
[]
[]
[]
[]
[]
[]
[]
[]
[]
[]
[]
[]
[]
[]
[]
[]
[]
[]
[]
[]
[]
[]
[]
[]
[]
[]
[]
[]
[]
[]
[]
[]
{"$rows_left_out":11}