{"text_format":"1","workbook":"xlsx","n_sheets":7,"sheets":["Wind Study","Chart2","Financial Model","Scenario sheet","Solar P90","Term Sheet","Uncertainty (2)"],"not_rendered":{"charts":2,"images":3,"macros":1,"external_links":0,"defined_names":30,"comments":2,"pivot_tables":0},"unopened":[{"sheet":"Chart2","index":1,"reason":"not_a_worksheet"}],"bounds":{"document_bytes":16777216,"sheet_cells":100000,"rows_first":2000,"rows_last":500,"rows_between":2000,"halvings":0,"cell_chars":16384,"cell_head_chars":4096},"cells_cut":0,"cells_raw":0,"read":"whole","date_system":"1900"}

{"sheet":"Wind Study","index":0,"n_rows":56,"n_cols":14,"rows_kept":56,"cut":false,"hidden":false,"merged":[]}
["Wind Farm 1"]
[null,"Production",null,"Vestas","Gamesa","GE","Siemens"]
[null,null,"Wind Farm Rated Power MW",28.8,32,25.6,29.9]
[null,null,"Gross Energy Output GWh/annum",140.30000000000001,138.19999999999999,136.9,136.69999999999999]
[null,null,"Wake effect",94.7,94.5,95.2,95.9]
[null,null,"Availability",96.3,96.3,96.3,96.3]
[null,null,"Electrical efficiency",98.4,98.4,98.4,98.4]
[null,null,"Turbine performance",100,100,100,100]
[null,null,"Environmental",99.5,99.5,99.5,99.5]
[null,null,"Curtailment",100,100,100,100]
[null,null,"Net Energy Output GWh/annum",125.3,123.2,122.9,123.5]
[null,null,"Equivalent hours hours",4350,3849,4800,4132]
[]
[null,"Standard Deviation (uncertainty)",null,"Vestas","Gamesa","GE","Siemens",null,null,null,null,null,"Base Std 1",20.2]
[null,null,"In any one year period",20.2,21.5,17.600000000000001,21,null,null,null,null,null,"Base Std 2",51]
[null,null,"In any ten year period",14.2,15,12.7,14.7,null,null,null,null,null,"Ratio",{"$f":"std_2a/std_1a","v":2.5247524752475248}]
[]
[null,"1 year",null,null,null,null,null,null,null,"Prob"]
[null,null,"P50",{"$f":"'Wind Study'!D11","v":125.3},{"$f":"'Wind Study'!E11","v":123.2},{"$f":"'Wind Study'!F11","v":122.9},{"$f":"'Wind Study'!G11","v":123.5},null,null,0.5]
[null,null,"P99",{"$f":"_xlfn.NORM.INV($J20,D$11,D$15)","v":78.307772944375017},73.183520708121932,81.956277416881207,74.646694645142347,null,null,0.01]
[null,null,"p90",99.412658375999058,95.646641340791092,100.34469244641504,96.587417123563384,null,null,0.1]
[null,"10 year"]
[null,null,"P50",{"$f":"'Wind Study'!D11","v":125.3},{"$f":"'Wind Study'!E11","v":123.2},{"$f":"'Wind Study'!F11","v":122.9},{"$f":"'Wind Study'!G11","v":123.5}]
[null,null,"P99",{"$f":"_xlfn.NORM.INV($J20,D$11,D$16)","v":92.265860188620053},88.304781889387385,93.355381999681327,89.302686251599653]
[null,null,"p90",107.10196776926666,103.97672651683099,106.62429511758359,104.66119198649437]
[]
[null,"Downside Case -- P99/P50 1 - year",null,{"$f":"D20/D19","v":0.62496227409716698},{"$f":"E20/E19","v":0.5940220836698209},{"$f":"F20/F19","v":0.66685335571099436},{"$f":"G20/G19","v":0.604426677288602}]
[]
["Wind Farm 2"]
[null,null,null,"Vestas","Gamesa","GE","Siemens"]
[null,null,"Wind Farm Rated Power MW",77.400000000000006,88,70.400000000000006,80.5]
[null,null,"Gross Energy Output GWh/annum",370.6,377.3,370,365.5]
[null,null,"Wake effect",90.7,90,91.6,90.7]
[null,null,"Availability",96.3,96.3,96.3,96.3]
[null,null,"Electrical efficiency",98,98,98,98]
[null,null,"Turbine performance",100,100,100,100]
[null,null,"Environmental",99.5,99.5,99.5,99.5]
[null,null,"Curtailment",100,100,100,100]
[null,null,"Net Energy Output GWh/annum",315.8,318.8,318.5,311.5]
[null,null,"Equivalent hours hours",4081,3623,4524,3869]
[]
[null,null,"Standard Deviation (uncertainty)","Vestas","Gamesa","GE","Siemens"]
[null,null,"In any one year period",51,55.6,47.4,52.7]
[null,null,"In any ten year period",36.299999999999997,38.799999999999997,34.299999999999997,37]
[]
[null,"1 year"]
[null,null,"P50",{"$f":"'Wind Study'!D39","v":315.8},{"$f":"'Wind Study'!E39","v":318.8},{"$f":"'Wind Study'!F39","v":318.5},{"$f":"'Wind Study'!G39","v":311.5},null,null,0.5]
[null,null,"P99",{"$f":"_xlfn.NORM.INV($J48,D$39,D$43)","v":197.15625842391714},189.45505820332926,208.23111077046417,188.90146703804768,null,null,0.01]
[null,null,"p90",250.44087015722539,247.54573295572021,257.75445579318591,243.96223249579953,null,null,0.1]
[]
[null,"10 year"]
[null,null,"P50",{"$f":"'Wind Study'!D39","v":315.8},{"$f":"'Wind Study'!E39","v":318.8},{"$f":"'Wind Study'!F39","v":318.5},{"$f":"'Wind Study'!G39","v":311.5}]
[null,null,"P99",{"$f":"_xlfn.NORM.INV($J48,D$39,D$44)","v":231.35357217231751},228.5377024872154,238.70626792039917,225.42512866048889]
[null,null,"p90",269.27967817073102,269.07579925686952,274.54278130182018,264.0825920748498]
[]
[null,"Downside Case - P99 vs P50 1 Year",null,{"$f":"D48/D47","v":0.62430734143102318},{"$f":"E48/E47","v":0.59427559034921351},{"$f":"F48/F47","v":0.65378684700302725},{"$f":"G48/G47","v":0.60642525533883684}]

{"sheet":"Financial Model","index":2,"n_rows":740,"n_cols":68,"rows_kept":740,"cut":false,"hidden":false,"merged":[]}
[null,"Production ",null,null,"Price",{"$f":"F57","v":44},null,"Equity IRR"]
[null,"Credit Spread",null,null,"Dev Fee",{"$f":"H236","v":0},null,"Project IRR ",{"$f":"F217","v":7.4239030480384841E-2}]
[]
["Timeline"]
[null,"Period",null,null,null,null,null,null,1,2,3,4,5,6,7,8,9,10,11,12,13,14,15,16,17,18,19,20,21,22,23,24,25,26,27,28,29,30,31,32,33,34,35,36,37,38,39,40,41,42,43,44,45,46,47,48,49,50,51,52,53,54,55,56,57,58,59,60]
[null,"Construction",null,null,null,{"$f":"F19","v":18},null,null,{"$f":"I5<=$F$6","v":true},{"$f":"J5<=$F$6","v":true},true,true,true,true,true,true,true,true,true,true,true,true,true,true,true,true,false,false,false,false,false,false,false,false,false,false,false,false,false,false,false,false,false,false,false,false,false,false,false,false,false,false,false,false,false,false,false,false,false,false,false,false,false,false,false,false,false,false]
[null,"Months in Period",null,null,{"$f":"F15","v":1},{"$f":"F16","v":12},null,null,{"$f":"IF(I6,$E$7,$F$7)","v":1},{"$f":"IF(J6,$E$7,$F$7)","v":1},1,1,1,1,1,1,1,1,1,1,1,1,1,1,1,1,12,12,12,12,12,12,12,12,12,12,12,12,12,12,12,12,12,12,12,12,12,12,12,12,12,12,12,12,12,12,12,12,12,12,12,12,12,12,12,12,12,12]
[null,"Date: End of Period",null,null,null,{"$f":"F18","v":"2019-01-01"},null,null,{"$f":"F8","v":"2019-01-01"},{"$f":"EDATE(I8,J7)","v":"2019-02-01"},{"$f":"EDATE(J8,K7)","v":"2019-03-01"},"2019-04-01","2019-05-01","2019-06-01","2019-07-01","2019-08-01","2019-09-01","2019-10-01","2019-11-01","2019-12-01","2020-01-01","2020-02-01","2020-03-01","2020-04-01","2020-05-01","2020-06-01","2021-06-01","2022-06-01","2023-06-01","2024-06-01","2025-06-01","2026-06-01","2027-06-01","2028-06-01","2029-06-01","2030-06-01","2031-06-01","2032-06-01","2033-06-01","2034-06-01","2035-06-01","2036-06-01","2037-06-01","2038-06-01","2039-06-01","2040-06-01","2041-06-01","2042-06-01","2043-06-01","2044-06-01","2045-06-01","2046-06-01","2047-06-01","2048-06-01","2049-06-01","2050-06-01","2051-06-01","2052-06-01","2053-06-01","2054-06-01","2055-06-01","2056-06-01","2057-06-01","2058-06-01","2059-06-01","2060-06-01","2061-06-01","2062-06-01"]
[null,"Operation",null,null,null,{"$f":"F22","v":"2050-07-01"},{"$f":"COUNTIF(I9:BP9,TRUE)","v":30},null,{"$f":"AND(NOT(I6),I8<$F$9)","v":false},{"$f":"AND(NOT(J6),J8<$F$9)","v":false},false,false,false,false,false,false,false,false,false,false,false,false,false,false,false,false,true,true,true,true,true,true,true,true,true,true,true,true,true,true,true,true,true,true,true,true,true,true,true,true,true,true,true,true,true,true,false,false,false,false,false,false,false,false,false,false,false,false]
[null,"Project Age",null,null,null,null,null,null,{"$f":"H10+I9","v":0},{"$f":"I10+J9","v":0},0,0,0,0,0,0,0,0,0,0,0,0,0,0,0,0,1,2,3,4,5,6,7,8,9,10,11,12,13,14,15,16,17,18,19,20,21,22,23,24,25,26,27,28,29,30,30,30,30,30,30,30,30,30,30,30,30,30]
[]
["Assumptions"]
[]
[null,"Timing"]
[null,null,"Months/Period - Construction",null,"Months",1]
[null,null,"Months/Period - Operation",null,"Months",12]
[]
[null,null,"Financial Close Date",null,"Date","2019-01-01"]
[null,null,"Construction Period",null,"Months",18]
[null,null,"Commercial Operation",null,"Date",{"$f":"EDATE(F18,F19)","v":"2020-07-01"}]
[null,null,"Operation Period",null,"Years",30]
[null,null,"Decommissioning",null,"Date",{"$f":"EDATE(F20,F21*12)","v":"2050-07-01"}]
[]
[null,"Operating assumptions"]
[null,null,"Capacity"]
[null,null,null,"Farm 1","MW",{"$f":"'Wind Study'!D31","v":77.400000000000006}]
[null,null,null,"Farm 2","MW",{"$f":"'Wind Study'!D3","v":28.8}]
[null,null,null,"Total","MW",{"$f":"SUM(F26:F27)","v":106.2}]
[null,null,"P99",null,null,null,"Std Dev"]
[null,null,null,"Farm 1","GWH",{"$f":"'Wind Study'!D48","v":197.15625842391714},{"$f":"'Wind Study'!D43","v":51}]
[null,null,null,"Farm 2","GWH",{"$f":"'Wind Study'!D20","v":78.307772944375017},{"$f":"'Wind Study'!D15","v":20.2}]
[null,null,null,"Total","GWH",{"$f":"SUM(F30:F31)","v":275.46403136829213}]
[null,null,"P50"]
[null,null,null,"Farm 1","GWH",{"$f":"'Wind Study'!D39","v":315.8}]
[null,null,null,"Farm 2","GWH",{"$f":"'Wind Study'!D11","v":125.3}]
[null,null,null,"Total","GWH",{"$f":"SUM(F34:F35)","v":441.1}]
[null,null,"P90"]
[null,null,null,"Farm 1","GWH",{"$f":"'Wind Study'!D54","v":269.27967817073102}]
[null,null,null,"Farm 2","GWH",{"$f":"'Wind Study'!D23","v":125.3}]
[null,null,null,"Total","GWH",{"$f":"SUM(F38:F39)","v":394.57967817073103}]
[]
[null,"EPC Assumption"]
[null,null,"EPC Costs",null,"USD Millions",218.8]
[null,null,"Total Capacity",null,"MW",{"$f":"F28","v":106.2}]
[null,null,"Cost per KW",null,"USD/kW",{"$f":"F43/F44*1000","v":2060.2636534839926}]
[]
[null,null,"S-Curve"]
[null,null,null,"Month",null,null,null,0,1,19]
[null,null,null,"Percent",null,null,null,0,5.5555555555555552E-2,0]
[]
[null,"O&M Assumptions",null,null,null,null,{"$f":"F18","v":"2019-01-01"},{"$f":"F20","v":"2020-07-01"},{"$f":"EDATE(H51,5*12)","v":"2025-07-01"},{"$f":"EDATE(I51,5*12)","v":"2030-07-01"},{"$f":"EDATE(J51,5*12)","v":"2035-07-01"}]
[null,null,"Cost per kW",null,"USD/KWy",null,null,30,32,40,45]
[]
[null,null,"O&M Inflation",null,"% p.a.",null,1.4999999999999999E-2,0.02,2.1999999999999999E-2,2.4E-2]
[]
[null,"PPA Assumptions"]
[null,null,"Base PPA Price",null,"USD/MWH",44]
[null,null,"Annual Escalation",null,"%",0.02]
[]
[null,"Tax and depreciation"]
[null,null,"Depreciation life",null,null,12]
[null,null,"Tax rate",null,null,0.2]
[]
["Financing Assumptions"]
[null,"General Debt Parameters"]
[null,null,"Debt Sizing"]
[null,null,null,"Maximum Debt capital","%",0.8]
[null,null,null,"Minimum DSCR P50 case",null,1.5]
[null,null,null,"Minimum DSCR P99 case",null,1]
[]
[null,null,"Debt funding"]
[null,null,null,"Up-fron Equity Percent","%",0.2]
[]
[null,null,"Credit protection"]
[null,null,null,"Debt Service Account","Percent",0.5]
[null,null,null,"Cash Trap Covenent","DSCR",1.2]
[null,null,null,"Cash Sweep","% of Cash",0]
[]
[null,"Debt Issue 1 (Capturing Debt Issue)"]
[null,null,"Percent of Senior",null,"Percent",{"$f":"1-F99-F120-F141","v":0.55000000000000004}]
[]
[null,null,"Repayment"]
[null,null,null,"Tenor","years",20]
[null,null,null,"Sculpting repayment",null,true]
[null,null,null,"Level repayment",null,{"$f":"NOT(F84)","v":false}]
[null,null,null,"Debt Repayment Date",null,{"$f":"EDATE($F$20,F83*12)","v":"2040-07-01"}]
[]
[null,null,null,"Sculpt",null,true]
[]
[null,null,"Interest rate and fees"]
[null,null,null,"Up-front fee","%",1.4999999999999999E-2]
[null,null,null,"Commitment fee","%",8.0000000000000002E-3]
[]
[null,null,null,"Base interest rate","%",2.5000000000000001E-2]
[null,null,null,null,null,0,1,4,7,10,13]
[null,null,null,"Credit spread",2,{"$f":"INDEX('Scenario sheet'!B5:B7,'Financial Model'!$E$96)","v":4.2500000000000003E-2},{"$f":"INDEX('Scenario sheet'!C5:C7,'Financial Model'!$E$96)","v":0.03},{"$f":"INDEX('Scenario sheet'!D5:D7,'Financial Model'!$E$96)","v":0.03},{"$f":"INDEX('Scenario sheet'!E5:E7,'Financial Model'!$E$96)","v":0.03},{"$f":"INDEX('Scenario sheet'!F5:F7,'Financial Model'!$E$96)","v":0.03},{"$f":"INDEX('Scenario sheet'!G5:G7,'Financial Model'!$E$96)","v":0.03}]
[]
[null,"Debt Issue 2 (Non Capturing Issue)"]
[null,null,"Percent of Senior",null,"Percent",0.1]
[]
[null,null,"Repayment"]
[null,null,null,"Tenor","years",14]
[null,null,null,"Sculpting repayment",null,true]
[null,null,null,"Input Repayment",null,{"$f":"NOT(F103)","v":false}]
[null,null,null,"Debt Repayment Date",null,{"$f":"EDATE($F$20,F102*12)","v":"2034-07-01"}]
[]
[null,null,null,"Sculpting",null,true]
[null,null,null,"Input Repayment Period",null,0,1,14,15,20,30]
[null,null,null,"Input Repayment",null,0,{"$f":"1/$F$102","v":7.1428571428571425E-2},{"$f":"1/$F$102","v":7.1428571428571425E-2},0,0,0]
[]
[null,null,"Interest rate and fees"]
[null,null,null,"Up-front fee","%",1.2999999999999999E-2]
[null,null,null,"Commitment fee","%",7.0000000000000001E-3]
[]
[null,null,null,"Base interest rate","%",0.03]
[null,null,null,null,null,0,1,4,7,10,13]
[null,null,null,"Credit spread",3,{"$f":"INDEX('Scenario sheet'!B$5:B$7,'Financial Model'!$E$117)","v":4.2500000000000003E-2},{"$f":"INDEX('Scenario sheet'!C$5:C$7,'Financial Model'!$E$117)","v":0.02},{"$f":"INDEX('Scenario sheet'!D$5:D$7,'Financial Model'!$E$117)","v":0.02},{"$f":"INDEX('Scenario sheet'!E$5:E$7,'Financial Model'!$E$117)","v":0.02},{"$f":"INDEX('Scenario sheet'!F$5:F$7,'Financial Model'!$E$117)","v":0.02},{"$f":"INDEX('Scenario sheet'!G$5:G$7,'Financial Model'!$E$117)","v":0.02}]
[]
[null,"Debt Issue 3"]
[null,null,"Percent of Senior",null,"Percent",0.15]
[]
[null,null,"Repayment"]
[null,null,null,"Tenor","years",15]
[null,null,null,"Sculpting repayment",null,true]
[null,null,null,"Level repayment",null,{"$f":"NOT(F124)","v":false}]
[null,null,null,"Debt Repayment Date",null,{"$f":"EDATE($F$20,F123*12)","v":"2035-07-01"}]
[]
[null,null,null,"Sculpting",null,true]
[null,null,null,"Input Repayment Period",null,0,1,{"$f":"F123","v":15},16,20,30]
[null,null,null,"Input Repayment",null,0,{"$f":"1/$F$123","v":6.6666666666666666E-2},{"$f":"1/$F$123","v":6.6666666666666666E-2},0,0,0]
[]
[null,null,"Interest rate and fees"]
[null,null,null,"Up-front fee","%",0.01]
[null,null,null,"Commitment fee","%",0.01]
[]
[null,null,null,"Base interest rate","%",0.03]
[null,null,null,null,null,0,1,4,7,10,13]
[null,null,null,"Credit spread",2,{"$f":"INDEX('Scenario sheet'!B$5:B$7,$E$138)","v":4.2500000000000003E-2},{"$f":"INDEX('Scenario sheet'!C$5:C$7,$E$138)","v":0.03},{"$f":"INDEX('Scenario sheet'!D$5:D$7,$E$138)","v":0.03},{"$f":"INDEX('Scenario sheet'!E$5:E$7,$E$138)","v":0.03},{"$f":"INDEX('Scenario sheet'!F$5:F$7,$E$138)","v":0.03},{"$f":"INDEX('Scenario sheet'!G$5:G$7,$E$138)","v":0.03}]
[]
[null,"Debt Issue 4"]
[null,null,"Percent of Senior",null,"Percent",0.2]
[]
[null,null,"Repayment"]
[null,null,null,"Tenor","years",17]
[null,null,null,"Sculpting repayment",null,true]
[null,null,null,"Level repayment",null,{"$f":"NOT(F145)","v":false}]
[null,null,null,"Debt Repayment Date",null,{"$f":"EDATE($F$20,F144*12)","v":"2037-07-01"}]
[]
[null,null,null,"Sculpting",null,true]
[null,null,null,"Input Repayment Period",null,0,1,17,16,20,30]
[null,null,null,"Input Repayment",null,0,{"$f":"1/$F$144","v":5.8823529411764705E-2},{"$f":"1/$F$144","v":5.8823529411764705E-2},0,0,0]
[]
[null,null,"Interest rate and fees"]
[null,null,null,"Up-front fee","%",1.2E-2]
[null,null,null,"Commitment fee","%",1.0999999999999999E-2]
[]
[null,null,null,"Base interest rate","%",1.4999999999999999E-2]
[null,null,null,null,null,0,1,4,7,10,13]
[null,null,null,"Credit spread",1,{"$f":"INDEX('Scenario sheet'!B5:B7,'Financial Model'!$E$159)","v":4.2500000000000003E-2},{"$f":"INDEX('Scenario sheet'!C5:C7,'Financial Model'!$E$159)","v":4.3700000000000003E-2},{"$f":"INDEX('Scenario sheet'!D5:D7,'Financial Model'!$E$159)","v":4.4999999999999998E-2},{"$f":"INDEX('Scenario sheet'!E5:E7,'Financial Model'!$E$159)","v":4.7500000000000001E-2},{"$f":"INDEX('Scenario sheet'!F5:F7,'Financial Model'!$E$159)","v":0.05},{"$f":"INDEX('Scenario sheet'!G5:G7,'Financial Model'!$E$159)","v":5.5E-2}]
[]
[null,null,"Check of Total Debt Percent",null,null,{"$f":"F141+F120+F99+F80","v":1}]
[]
["Re-Financing Assumptions"]
[]
[null,"Re-Financing 1"]
[null,null,"DSCR for Re-financing"]
[]
[]
[]
[]
[]
[]
[]
[]
[]
[]
[]
[]
[]
[]
[]
[]
[]
[]
["Operating & Analysis"]
[null,"Capacity",null,null,"MW",{"$f":"F28","v":106.2},null,null,{"$f":"$F$186*I9","v":0},0,0,0,0,0,0,0,0,0,0,0,0,0,0,0,0,0,106.2,106.2,106.2,106.2,106.2,106.2,106.2,106.2,106.2,106.2,106.2,106.2,106.2,106.2,{"$f":"$F$186*AO9","v":106.2},106.2,106.2,106.2,106.2,106.2,106.2,106.2,106.2,106.2,106.2,106.2,106.2,106.2,106.2,106.2,0,0,0,0,0,0,0,0,0,0,0,0]
[null,"P50 Production",null,null,"GWH",{"$f":"F36","v":441.1},null,null,{"$f":"$F$187*I9","v":0},0,0,0,0,0,0,0,0,0,0,0,0,0,0,0,0,0,441.1,441.1,441.1,441.1,441.1,441.1,441.1,441.1,441.1,441.1,441.1,441.1,441.1,441.1,{"$f":"$F$187*AO9","v":441.1},441.1,441.1,441.1,441.1,441.1,441.1,441.1,441.1,441.1,441.1,441.1,441.1,441.1,441.1,441.1,0,0,0,0,0,0,0,0,0,0,0,0]
[null,"P99 Production",null,null,"GWH",{"$f":"F32","v":275.46403136829213},null,null,{"$f":"$F$188*I9","v":0},0,0,0,0,0,0,0,0,0,0,0,0,0,0,0,0,0,275.46403136829213,275.46403136829213,275.46403136829213,275.46403136829213,275.46403136829213,275.46403136829213,275.46403136829213,275.46403136829213,275.46403136829213,275.46403136829213,275.46403136829213,275.46403136829213,275.46403136829213,275.46403136829213,{"$f":"$F$188*AO9","v":275.46403136829213},275.46403136829213,275.46403136829213,275.46403136829213,275.46403136829213,275.46403136829213,275.46403136829213,275.46403136829213,275.46403136829213,275.46403136829213,275.46403136829213,275.46403136829213,275.46403136829213,275.46403136829213,275.46403136829213,275.46403136829213,0,0,0,0,0,0,0,0,0,0,0,0]
[null,"P90 Production",null,null,"GWH"]
[null,null,{"$f":"INDEX('Scenario sheet'!$A$15:$A$17,'Financial Model'!F190)","v":"P50 Base Case"},null,null,{"$f":"'Scenario sheet'!$G$16","v":1},null,null,{"$f":"INDEX(I187:I189,$F$190)","v":0},{"$f":"INDEX(J187:J189,$F$190)","v":0},0,0,0,0,0,0,0,0,0,0,0,0,0,0,0,0,441.1,441.1,441.1,441.1,441.1,441.1,441.1,441.1,441.1,441.1,441.1,441.1,441.1,441.1,441.1,441.1,441.1,441.1,441.1,441.1,441.1,441.1,441.1,441.1,441.1,441.1,441.1,441.1,441.1,441.1,0,0,0,0,0,0,0,0,0,0,0,0]
[]
[null,"EPC/O&M/PPA"]
[null,null,"EPC",null,"USD 000",{"$f":"F43*1000","v":218800},null,null,{"$f":"$F$193*I6","v":218800},218800,218800,218800,218800,218800,218800,218800,218800,218800,218800,218800,218800,218800,218800,218800,218800,218800,0,0,0,0,0,0,0,0,0,0,0,0,0,0,{"$f":"$F$193*AO6","v":0},0,0,0,0,0,0,0,0,0,0,0,0,0,0,0,0,0,0,0,0,0,0,0,0,0,0,0]
[null,null,"S-Curve",null,null,null,null,null,{"$f":"LOOKUP(I5,48:48,49:49)","v":5.5555555555555552E-2},5.5555555555555552E-2,5.5555555555555552E-2,5.5555555555555552E-2,5.5555555555555552E-2,5.5555555555555552E-2,5.5555555555555552E-2,5.5555555555555552E-2,5.5555555555555552E-2,5.5555555555555552E-2,5.5555555555555552E-2,5.5555555555555552E-2,5.5555555555555552E-2,5.5555555555555552E-2,5.5555555555555552E-2,5.5555555555555552E-2,5.5555555555555552E-2,5.5555555555555552E-2,0,0,0,0,0,0,0,0,0,0,0,0,0,0,{"$f":"LOOKUP(AO5,48:48,49:49)","v":0},0,0,0,0,0,0,0,0,0,0,0,0,0,0,0,0,0,0,0,0,0,0,0,0,0,0,0]
[null,null,null,"Capital Expenditures","USD 000",null,null,null,{"$f":"I193*I194","v":12155.555555555555},{"$f":"J193*J194","v":12155.555555555555},12155.555555555555,12155.555555555555,12155.555555555555,12155.555555555555,12155.555555555555,12155.555555555555,12155.555555555555,12155.555555555555,12155.555555555555,12155.555555555555,12155.555555555555,12155.555555555555,12155.555555555555,12155.555555555555,12155.555555555555,12155.555555555555,0,0,0,0,0,0,0,0,0,0,0,0,0,0,0,0,0,0,0,0,0,0,0,0,0,0,0,0,0,0,0,0,0,0,0,0,0,0,0,0,0,0]
[]
[null,"Revenues"]
[null,null,"PPA Price without Inflation",null,"USD/MWh",{"$f":"F57","v":44},null,null,{"$f":"$F$198","v":44},{"$f":"$F$198","v":44},44,44,44,44,44,44,44,44,44,44,44,44,44,44,44,44,44,44,44,44,44,44,44,44,44,44,44,44,44,44,44,44,44,44,44,44,44,44,44,44,44,44,44,44,44,44,44,44,44,44,44,44,44,44,44,44,44,44]
[null,null,"PPA Inflation Index",null,"Index",{"$f":"F58","v":0.02},null,1,{"$f":"H199*(1+$F$199*I9)","v":1},1,1,1,1,1,1,1,1,1,1,1,1,1,1,1,1,1,1.02,1.0404,1.0612079999999999,1.08243216,1.1040808032,1.1261624192640001,1.14868566764928,1.1716593810022657,1.1950925686223111,1.2189944199947573,1.2433743083946525,1.2682417945625455,1.2936066304537963,1.3194787630628724,{"$f":"AN199*(1+$F$199*AO9)","v":1.3458683383241299},1.3727857050906125,1.4002414191924248,1.4282462475762734,1.4568111725277988,1.4859473959783549,1.5156663438979221,1.5459796707758806,1.5768992641913981,1.6084372494752261,1.6406059944647307,1.6734181143540252,1.7068864766411058,1.7410242061739281,1.7758446902974065,1.8113615841033548,1.8113615841033548,1.8113615841033548,1.8113615841033548,1.8113615841033548,1.8113615841033548,1.8113615841033548,1.8113615841033548,1.8113615841033548,1.8113615841033548,1.8113615841033548,1.8113615841033548,1.8113615841033548]
[null,null,"PPA Price with Inflation",null,"USD/MWh",null,null,null,{"$f":"I198*I199","v":44},{"$f":"J198*J199","v":44},44,44,44,44,44,44,44,44,44,44,44,44,44,44,44,44,44.88,45.7776,46.693151999999998,47.627015039999996,48.579555340799999,49.551146447616006,50.542169376568324,51.553012764099691,52.584073019381684,53.635754479769325,54.708469569364709,55.802638960751999,56.918691739967038,58.057065574766384,59.218206886261711,60.402571023986951,61.610622444466692,62.842834893356027,64.099691591223149,65.381685423047614,66.689319131508569,68.023105514138749,69.383567624421516,70.771238976909956,72.186663756448155,73.630397031577104,75.103004972208652,76.605065071652831,78.13716637308589,79.699909700547607,79.699909700547607,79.699909700547607,79.699909700547607,79.699909700547607,79.699909700547607,79.699909700547607,79.699909700547607,79.699909700547607,79.699909700547607,79.699909700547607,79.699909700547607,79.699909700547607]
{"$rows_left_out":541}
{"sheet":"Scenario sheet","index":3,"n_rows":17,"n_cols":7,"rows_kept":17,"cut":false,"hidden":false,"merged":[]}
[]
["Code number",2]
[]
[null,0,1,4,7,10,13]
["Term sheet",4.2500000000000003E-2,4.3700000000000003E-2,4.4999999999999998E-2,4.7500000000000001E-2,0.05,5.5E-2]
["Base case",4.2500000000000003E-2,0.03,0.03,0.03,0.03,0.03]
["Upside case",4.2500000000000003E-2,0.02,0.02,0.02,0.02,0.02]
[]
[{"$f":"INDEX(A5:A7,$B$2)","v":"Base case"},{"$f":"INDEX(B5:B7,$B$2)","v":4.2500000000000003E-2},0.03,0.03,0.03,0.03,0.03]
[]
[]
[]
[]
[]
["P50 Base Case"]
["P99 Worst Case",null,null,null,null,null,1]
["P90 Downside"]

{"sheet":"Solar P90","index":4,"n_rows":0,"n_cols":0,"rows_kept":0,"cut":false,"hidden":false,"merged":[]}

{"sheet":"Term Sheet","index":5,"n_rows":0,"n_cols":0,"rows_kept":0,"cut":false,"hidden":false,"merged":[]}

{"sheet":"Uncertainty (2)","index":6,"n_rows":30,"n_cols":9,"rows_kept":30,"cut":false,"hidden":false,"merged":[]}
[]
[null,"Wind Speed",null,"Energy",null,"Square","Square Root"]
[null,"[%]","[m/s]","[%]","[GWh/yr]"]
["Anemometer",2,0.15]
["Period representative of long term",3.6,0.27]
["Cross Synthesis from Paijan",0.2,0.02]
["Overall historical wind speed",null,0.31,null,12.17,{"$f":"E7^2","v":148.10890000000001},null,null,{"$f":"_xlfn.FORMULATEXT(F7)","v":"=E7^2"}]
["Substation metering",null,null,0.3,0.43,{"$f":"E8^2","v":0.18489999999999998}]
["Wake and topographic calculation",null,null,6,8.59,73.7881]
["Energy loss factor assumptions",null,null,3,4.29,18.4041]
["Map",null,null,2,2.86,8.1795999999999989]
[]
["Future wind variability 1-year",6,0.45,null,17.7,313.28999999999996]
["Future wind variability 10-years",1.9,0.14000000000000001,null,5.6,31.359999999999996]
[]
["Overall energy uncertainty 1-year",null,null,null,23.71,{"$f":"SUM(F7:F13)","v":561.9556},{"$f":"F16^0.5","v":23.705602713282783},null,{"$f":"_xlfn.FORMULATEXT(G16)","v":"=F16^0.5"}]
["Overall energy uncertainty 10-years",null,null,null,16.73,{"$f":"SUM(F7:F11)+F14","v":280.0256},{"$f":"F17^0.5","v":16.733965459507797}]
[]
[null,null,null,null,null,{"$f":"_xlfn.FORMULATEXT(F17)","v":"=SUM(F7:F11)+F14"}]
[]
["Estimated Production",null,null,null,143.16666666666666]
["Wind Variability Percent",null,null,null,{"$f":"E13/E21","v":0.12363213038416764}]
[]
[null,null,null,null,"One-yr","10-yr"]
["Probability","P99",null,0.01,{"$f":"_xlfn.NORM.INV($D25,$E$21,$G$16)","v":88.019188191764471},{"$f":"_xlfn.NORM.INV($D25,$E$21,$G$17)","v":104.23764169566783}]
[null,null,null,0.05,{"$f":"_xlfn.NORM.INV($D26,$E$21,$G$16)","v":104.17442006465279},{"$f":"_xlfn.NORM.INV($D26,$E$21,$G$17)","v":115.64174288731459}]
[null,null,null,0.1,{"$f":"_xlfn.NORM.INV($D27,$E$21,$G$16)","v":112.78671439728078},{"$f":"_xlfn.NORM.INV($D27,$E$21,$G$17)","v":121.72122703426517}]
[null,null,null,0.5,{"$f":"_xlfn.NORM.INV($D28,$E$21,$G$16)","v":143.16666666666666},{"$f":"_xlfn.NORM.INV($D28,$E$21,$G$17)","v":143.16666666666666}]
[]
["P99 vs P50",null,null,null,{"$f":"E25/E28","v":0.6148022458097635},{"$f":"F25/F28","v":0.72808597226310479}]