{"text_format":"1","workbook":"xlsx","n_sheets":16,"sheets":["Economic Times","Money Control","Summary","Delete Break","tatamotors BS","tatamotors PL","tatamotors Ratios","tatamotors CF","htmedia BS","htmedia PL","htmedia Ratios","htmedia CF","relianceindustries BS","relianceindustries PL","relianceindustries Ratios","relianceindustries CF"],"not_rendered":{"charts":0,"images":0,"macros":1,"external_links":0,"defined_names":11,"comments":0,"pivot_tables":0},"unopened":[],"bounds":{"document_bytes":16777216,"sheet_cells":100000,"rows_first":2000,"rows_last":500,"rows_between":2000,"halvings":0,"cell_chars":16384,"cell_head_chars":4096},"cells_cut":0,"cells_raw":0,"read":"whole","date_system":"1900"}

{"sheet":"Economic Times","index":0,"n_rows":8,"n_cols":1,"rows_kept":8,"cut":false,"hidden":false,"merged":[]}
["https://economictimes.indiatimes.com/ht-media-ltd/quarterly/companyid-16087.cms"]
["https://economictimes.indiatimes.com/ht-media-ltd/profitandlose/companyid-16087.cms"]
["https://economictimes.indiatimes.com/ht-media-ltd/cashflow/companyid-16087.cms"]
["https://economictimes.indiatimes.com/ht-media-ltd/balancesheet/companyid-16087.cms"]
[]
["https://economictimes.indiatimes.com/tata-motors-ltd/profitandlose/companyid-12934.cms"]
["https://economictimes.indiatimes.com/reliance-industries-ltd/balancesheet/companyid-13215.cms"]
["https://economictimes.indiatimes.com/bharti-airtel-ltd/balancesheet/companyid-2718.cms"]

{"sheet":"Money Control","index":1,"n_rows":23,"n_cols":16,"rows_kept":23,"cut":false,"hidden":false,"merged":[]}
[null,"URL's without adjustment",null,null,"https://www.moneycontrol.com/financials/tatamotors/balance-sheet/TM03"]
[null,null,null,null,"https://www.moneycontrol.com/financials/tatamotors/profit-lossVI/TM03"]
[]
[null,null,null,null,"https://www.moneycontrol.com/financials/htmedia/balance-sheet/HT"]
[null,null,null,null,"https://www.moneycontrol.com/financials/relianceindustries/ratios/RI"]
[null,null,null,null,"https://www.moneycontrol.com/financials/relianceindustries/cash-flow/RI"]
[]
[]
[null,null,null,null,"https://www.moneycontrol.com/financials/"]
[null,null,null,null,"/balance-sheet/"]
[null,null,null,null,"/profit-lossVI/"]
[null,null,null,null,"/ratios/"]
[null,null,null,null,"/cash-flow/"]
[]
[null,null,null,null,"Financial Statement Code",null,null,4,"FS Code",null,null,null,null,null,"Company Code",3]
[]
[null,null,null,{"$f":"Company&\" BS\"","v":"relianceindustries BS"},{"$f":"$E$9&Company&E10&Symbol","v":"https://www.moneycontrol.com/financials/relianceindustries/balance-sheet/RI"},null,null,null,null,null,null,null,null,null,"Symbol","Company"]
[null,null,null,{"$f":"Company&\" PL\"","v":"relianceindustries PL"},{"$f":"$E$9&Company&E11&Symbol","v":"https://www.moneycontrol.com/financials/relianceindustries/profit-lossVI/RI"},null,null,null,null,null,null,null,null,null,"TM03","tatamotors"]
[null,null,null,{"$f":"Company&\" Ratios\"","v":"relianceindustries Ratios"},{"$f":"$E$9&Company&E12&Symbol","v":"https://www.moneycontrol.com/financials/relianceindustries/ratios/RI"},null,null,null,null,null,null,null,null,null,"HT","htmedia"]
[null,null,null,{"$f":"Company&\" CF\"","v":"relianceindustries CF"},{"$f":"$E$9&Company&E13&Symbol","v":"https://www.moneycontrol.com/financials/relianceindustries/cash-flow/RI"},null,null,null,null,null,null,null,null,null,"RI","relianceindustries"]
[]
["Applied URL",null,null,{"$f":"INDEX(D17:D20,H15)","v":"relianceindustries CF"},{"$f":"INDEX(E17:E20,H15)","v":"https://www.moneycontrol.com/financials/relianceindustries/cash-flow/RI"},null,null,null,null,null,null,null,null,null,"Symbol","Company"]
[null,null,null,null,null,null,null,null,null,null,null,null,null,null,{"$f":"INDEX(O18:O20,$P$15)","v":"RI"},{"$f":"INDEX(P18:P20,$P$15)","v":"relianceindustries"}]

{"sheet":"Summary","index":2,"n_rows":17,"n_cols":12,"rows_kept":17,"cut":false,"hidden":false,"merged":[]}
[]
[null,null,"Return On Capital Employed(%)"]
[null,null,"Return On Net Worth(%)"]
[null,null,"Investment Valuation Ratios",null,null,null,"Return On Capital Employed(%)"]
[null,null,null,null,null,null,null,"Index"]
[null,null,null,null,null,null,"Match"]
[null,null,null,null,null,null,{"$f":"MATCH($C$4,INDIRECT(\"'\"&E8&\"'!A:A\"),0)-2","v":367},{"$f":"INDEX(INDIRECT(\"'\"&$E8&\"'!B:B\"),$G7)","v":"Mar '18"},{"$f":"INDEX(INDIRECT(\"'\"&$E8&\"'!C:C\"),$G7)","v":"Mar '17"},{"$f":"INDEX(INDIRECT(\"'\"&$E8&\"'!D:D\"),$G7)","v":"Mar '16"},{"$f":"INDEX(INDIRECT(\"'\"&$E8&\"'!E:E\"),$G7)","v":"Mar '15"},{"$f":"INDEX(INDIRECT(\"'\"&$E8&\"'!F:F\"),$G7)","v":"Mar '14"}]
[null,null,{"$f":"'Money Control'!P18","v":"tatamotors"}," Ratios",{"$f":"C8&D8","v":"tatamotors Ratios"},null,{"$f":"MATCH($G$4,INDIRECT(\"'\"&E8&\"'!A:A\"),0)","v":384},{"$f":"INDEX(INDIRECT(\"'\"&$E8&\"'!B:B\"),$G8)","v":4.84},{"$f":"INDEX(INDIRECT(\"'\"&$E8&\"'!C:C\"),$G8)","v":-1.1100000000000001},{"$f":"INDEX(INDIRECT(\"'\"&$E8&\"'!D:D\"),$G8)","v":5.38},{"$f":"INDEX(INDIRECT(\"'\"&$E8&\"'!E:E\"),$G8)","v":-5.61},{"$f":"INDEX(INDIRECT(\"'\"&$E8&\"'!F:F\"),$G8)","v":2.52}]
[null,null,{"$f":"'Money Control'!P19","v":"htmedia"}," Ratios",{"$f":"C9&D9","v":"htmedia Ratios"},null,{"$f":"MATCH($G$4,INDIRECT(\"'\"&E9&\"'!A:A\"),0)","v":384},{"$f":"INDEX(INDIRECT(\"'\"&$E9&\"'!B:B\"),$G9)","v":11.25},{"$f":"INDEX(INDIRECT(\"'\"&$E9&\"'!C:C\"),$G9)","v":5.31},{"$f":"INDEX(INDIRECT(\"'\"&$E9&\"'!D:D\"),$G9)","v":6.35},{"$f":"INDEX(INDIRECT(\"'\"&$E9&\"'!E:E\"),$G9)","v":10.1},{"$f":"INDEX(INDIRECT(\"'\"&$E9&\"'!F:F\"),$G9)","v":13.73}]
[null,null,{"$f":"'Money Control'!P20","v":"relianceindustries"}," Ratios","relianceindustries Ratios",null,{"$f":"MATCH($G$4,INDIRECT(\"'\"&E10&\"'!A:A\"),0)","v":384},{"$f":"INDEX(INDIRECT(\"'\"&$E10&\"'!B:B\"),$G10)","v":12.24},{"$f":"INDEX(INDIRECT(\"'\"&$E10&\"'!C:C\"),$G10)","v":11.16},11.47,{"$f":"INDEX(INDIRECT(\"'\"&$E10&\"'!E:E\"),$G10)","v":10.42},10.97]
[]
[null,null,null,null,null,null,{"$f":"C3","v":"Return On Net Worth(%)"}]
[null,null,null,null,null,null,"Match"]
[null,null,null,null,null,null,{"$f":"MATCH($C$4,INDIRECT(\"'\"&E15&\"'!A:A\"),0)-2","v":367},{"$f":"INDEX(INDIRECT(\"'\"&$E15&\"'!B:B\"),$G14)","v":"Mar '18"},{"$f":"INDEX(INDIRECT(\"'\"&$E15&\"'!C:C\"),$G14)","v":"Mar '17"},{"$f":"INDEX(INDIRECT(\"'\"&$E15&\"'!D:D\"),$G14)","v":"Mar '16"},{"$f":"INDEX(INDIRECT(\"'\"&$E15&\"'!E:E\"),$G14)","v":"Mar '15"},{"$f":"INDEX(INDIRECT(\"'\"&$E15&\"'!F:F\"),$G14)","v":"Mar '14"}]
[null,null,{"$f":"C8","v":"tatamotors"}," Ratios",{"$f":"C15&D15","v":"tatamotors Ratios"},null,{"$f":"MATCH($G$12,INDIRECT(\"'\"&E15&\"'!A:A\"),0)","v":385},{"$f":"INDEX(INDIRECT(\"'\"&$E15&\"'!B:B\"),$G15)","v":-5.13},{"$f":"INDEX(INDIRECT(\"'\"&$E15&\"'!C:C\"),$G15)","v":-11.48},{"$f":"INDEX(INDIRECT(\"'\"&$E15&\"'!D:D\"),$G15)","v":-0.26},{"$f":"INDEX(INDIRECT(\"'\"&$E15&\"'!E:E\"),$G15)","v":-31.93},{"$f":"INDEX(INDIRECT(\"'\"&$E15&\"'!F:F\"),$G15)","v":1.74}]
[null,null,{"$f":"C9","v":"htmedia"}," Ratios",{"$f":"C16&D16","v":"htmedia Ratios"},null,{"$f":"MATCH($G$12,INDIRECT(\"'\"&E16&\"'!A:A\"),0)","v":385},{"$f":"INDEX(INDIRECT(\"'\"&$E16&\"'!B:B\"),$G16)","v":11.25},{"$f":"INDEX(INDIRECT(\"'\"&$E16&\"'!C:C\"),$G16)","v":3.62},{"$f":"INDEX(INDIRECT(\"'\"&$E16&\"'!D:D\"),$G16)","v":6.78},{"$f":"INDEX(INDIRECT(\"'\"&$E16&\"'!E:E\"),$G16)","v":7.56},{"$f":"INDEX(INDIRECT(\"'\"&$E16&\"'!F:F\"),$G16)","v":11.04}]
[null,null,"relianceindustries"," Ratios","relianceindustries Ratios",null,{"$f":"MATCH($G$12,INDIRECT(\"'\"&E17&\"'!A:A\"),0)","v":385},{"$f":"INDEX(INDIRECT(\"'\"&$E17&\"'!B:B\"),$G17)","v":10.68},{"$f":"INDEX(INDIRECT(\"'\"&$E17&\"'!C:C\"),$G17)","v":10.89},11.41,10.51,11.15]

{"sheet":"Delete Break","index":3,"n_rows":0,"n_cols":0,"rows_kept":0,"cut":false,"hidden":false,"merged":[]}

{"sheet":"tatamotors BS","index":4,"n_rows":455,"n_cols":6,"rows_kept":455,"cut":false,"hidden":false,"merged":[]}
["English"]
["Hindi"]
["Gujarati"]
[]
["App"]
[]
["Subscription"]
["Specials"]
[]
[]
[]
[]
[]
[]
[]
[]
[]
[]
[]
["Quotes "]
["NAVs"]
["Commodities "]
["Futures & Options "]
["News "]
["Forum "]
["Notices "]
["Videos "]
["Glossary "]
["All "]
[]
["Stocks"]
["Feedback"]
["Log In"]
[]
["My Profile (Unverified)"]
["My Portfolio"]
["My Watchlist"]
["My Messages"]
["My Alerts"]
[]
["Sign Up"]
["Logout"]
[]
[]
[]
[]
[]
[]
[]
["Get App"]
["Log In"]
["Sign Up"]
["My Portfolio"]
["My Watchlist"]
["My Messages"]
["Sign out"]
[]
["Quotes "]
["NAVs"]
["Commodities "]
["Futures & Options "]
["News "]
["Forum "]
["Notices "]
["Videos "]
["Glossary "]
["All "]
["Auriferous Aqua Farma , 519363"]
["View All "]
["Select Language"]
["English"]
["à¤¹à¤¿à¤‚à¤¦à¥€"]
["à¤—à¥\u0081à¤œà¤°à¤¾à¤¤à¥€"]
["Home"]
["Lok Sabha Election 2019 "]
[]
["Stock Premier League "]
[]
["News"]
["Markets"]
{"$rows_left_out":376}
{"sheet":"tatamotors PL","index":5,"n_rows":472,"n_cols":6,"rows_kept":472,"cut":false,"hidden":false,"merged":[]}
["English"]
["Hindi"]
["Gujarati"]
[]
["App"]
[]
["Subscription"]
["Specials"]
[]
[]
[]
[]
[]
[]
[]
[]
[]
[]
[]
["Quotes "]
["NAVs"]
["Commodities "]
["Futures & Options "]
["News "]
["Forum "]
["Notices "]
["Videos "]
["Glossary "]
["All "]
[]
["Stocks"]
["Feedback"]
["Log In"]
[]
["My Profile (Unverified)"]
["My Portfolio"]
["My Watchlist"]
["My Messages"]
["My Alerts"]
[]
["Sign Up"]
["Logout"]
[]
[]
[]
[]
[]
[]
[]
["Get App"]
["Log In"]
["Sign Up"]
["My Portfolio"]
["My Watchlist"]
["My Messages"]
["Sign out"]
[]
["Quotes "]
["NAVs"]
["Commodities "]
["Futures & Options "]
["News "]
["Forum "]
["Notices "]
["Videos "]
["Glossary "]
["All "]
["Auriferous Aqua Farma , 519363"]
["View All "]
["Select Language"]
["English"]
["à¤¹à¤¿à¤‚à¤¦à¥€"]
["à¤—à¥\u0081à¤œà¤°à¤¾à¤¤à¥€"]
["Home"]
["Lok Sabha Election 2019 "]
[]
["Stock Premier League "]
[]
["News"]
["Markets"]
{"$rows_left_out":393}
{"sheet":"tatamotors Ratios","index":6,"n_rows":474,"n_cols":6,"rows_kept":474,"cut":false,"hidden":false,"merged":[]}
["English"]
["Hindi"]
["Gujarati"]
[]
["App"]
[]
["Subscription"]
["Specials"]
[]
[]
[]
[]
[]
[]
[]
[]
[]
[]
[]
["Quotes "]
["NAVs"]
["Commodities "]
["Futures & Options "]
["News "]
["Forum "]
["Notices "]
["Videos "]
["Glossary "]
["All "]
[]
["Stocks"]
["Feedback"]
["Log In"]
[]
["My Profile (Unverified)"]
["My Portfolio"]
["My Watchlist"]
["My Messages"]
["My Alerts"]
[]
["Sign Up"]
["Logout"]
[]
[]
[]
[]
[]
[]
[]
["Get App"]
["Log In"]
["Sign Up"]
["My Portfolio"]
["My Watchlist"]
["My Messages"]
["Sign out"]
[]
["Quotes "]
["NAVs"]
["Commodities "]
["Futures & Options "]
["News "]
["Forum "]
["Notices "]
["Videos "]
["Glossary "]
["All "]
["Auriferous Aqua Farma , 519363"]
["View All "]
["Select Language"]
["English"]
["à¤¹à¤¿à¤‚à¤¦à¥€"]
["à¤—à¥\u0081à¤œà¤°à¤¾à¤¤à¥€"]
["Home"]
["Lok Sabha Election 2019 "]
[]
["Stock Premier League "]
[]
["News"]
["Markets"]
{"$rows_left_out":395}
{"sheet":"tatamotors CF","index":7,"n_rows":429,"n_cols":6,"rows_kept":429,"cut":false,"hidden":false,"merged":[]}
["English"]
["Hindi"]
["Gujarati"]
[]
["App"]
[]
["Subscription"]
["Specials"]
[]
[]
[]
[]
[]
[]
[]
[]
[]
[]
[]
["Quotes "]
["NAVs"]
["Commodities "]
["Futures & Options "]
["News "]
["Forum "]
["Notices "]
["Videos "]
["Glossary "]
["All "]
[]
["Stocks"]
["Feedback"]
["Log In"]
[]
["My Profile (Unverified)"]
["My Portfolio"]
["My Watchlist"]
["My Messages"]
["My Alerts"]
[]
["Sign Up"]
["Logout"]
[]
[]
[]
[]
[]
[]
[]
["Get App"]
["Log In"]
["Sign Up"]
["My Portfolio"]
["My Watchlist"]
["My Messages"]
["Sign out"]
[]
["Quotes "]
["NAVs"]
["Commodities "]
["Futures & Options "]
["News "]
["Forum "]
["Notices "]
["Videos "]
["Glossary "]
["All "]
["Auriferous Aqua Farma , 519363"]
["View All "]
["Select Language"]
["English"]
["à¤¹à¤¿à¤‚à¤¦à¥€"]
["à¤—à¥\u0081à¤œà¤°à¤¾à¤¤à¥€"]
["Home"]
["Lok Sabha Election 2019 "]
[]
["Stock Premier League "]
[]
["News"]
["Markets"]
{"$rows_left_out":350}
{"sheet":"htmedia BS","index":8,"n_rows":448,"n_cols":6,"rows_kept":448,"cut":false,"hidden":false,"merged":[]}
["English"]
["Hindi"]
["Gujarati"]
[]
["App"]
[]
["Subscription"]
["Specials"]
[]
[]
[]
[]
[]
[]
[]
[]
[]
[]
[]
["Quotes "]
["NAVs"]
["Commodities "]
["Futures & Options "]
["News "]
["Forum "]
["Notices "]
["Videos "]
["Glossary "]
["All "]
[]
["Stocks"]
["Feedback"]
["Log In"]
[]
["My Profile (Unverified)"]
["My Portfolio"]
["My Watchlist"]
["My Messages"]
["My Alerts"]
[]
["Sign Up"]
["Logout"]
[]
[]
[]
[]
[]
[]
[]
["Get App"]
["Log In"]
["Sign Up"]
["My Portfolio"]
["My Watchlist"]
["My Messages"]
["Sign out"]
[]
["Quotes "]
["NAVs"]
["Commodities "]
["Futures & Options "]
["News "]
["Forum "]
["Notices "]
["Videos "]
["Glossary "]
["All "]
["Auriferous Aqua Farma , 519363"]
["View All "]
["Select Language"]
["English"]
["à¤¹à¤¿à¤‚à¤¦à¥€"]
["à¤—à¥\u0081à¤œà¤°à¤¾à¤¤à¥€"]
["Home"]
["Lok Sabha Election 2019 "]
[]
["Stock Premier League "]
[]
["News"]
["Markets"]
{"$rows_left_out":369}
{"sheet":"htmedia PL","index":9,"n_rows":466,"n_cols":6,"rows_kept":466,"cut":false,"hidden":false,"merged":[]}
["English"]
["Hindi"]
["Gujarati"]
[]
["App"]
[]
["Subscription"]
["Specials"]
[]
[]
[]
[]
[]
[]
[]
[]
[]
[]
[]
["Quotes "]
["NAVs"]
["Commodities "]
["Futures & Options "]
["News "]
["Forum "]
["Notices "]
["Videos "]
["Glossary "]
["All "]
[]
["Stocks"]
["Feedback"]
["Log In"]
[]
["My Profile (Unverified)"]
["My Portfolio"]
["My Watchlist"]
["My Messages"]
["My Alerts"]
[]
["Sign Up"]
["Logout"]
[]
[]
[]
[]
[]
[]
[]
["Get App"]
["Log In"]
["Sign Up"]
["My Portfolio"]
["My Watchlist"]
["My Messages"]
["Sign out"]
[]
["Quotes "]
["NAVs"]
["Commodities "]
["Futures & Options "]
["News "]
["Forum "]
["Notices "]
["Videos "]
["Glossary "]
["All "]
["Auriferous Aqua Farma , 519363"]
["View All "]
["Select Language"]
["English"]
["à¤¹à¤¿à¤‚à¤¦à¥€"]
["à¤—à¥\u0081à¤œà¤°à¤¾à¤¤à¥€"]
["Home"]
["Lok Sabha Election 2019 "]
[]
["Stock Premier League "]
[]
["News"]
["Markets"]
{"$rows_left_out":387}
{"sheet":"htmedia Ratios","index":10,"n_rows":468,"n_cols":6,"rows_kept":468,"cut":false,"hidden":false,"merged":[]}
["English"]
["Hindi"]
["Gujarati"]
[]
["App"]
[]
["Subscription"]
["Specials"]
[]
[]
[]
[]
[]
[]
[]
[]
[]
[]
[]
["Quotes "]
["NAVs"]
["Commodities "]
["Futures & Options "]
["News "]
["Forum "]
["Notices "]
["Videos "]
["Glossary "]
["All "]
[]
["Stocks"]
["Feedback"]
["Log In"]
[]
["My Profile (Unverified)"]
["My Portfolio"]
["My Watchlist"]
["My Messages"]
["My Alerts"]
[]
["Sign Up"]
["Logout"]
[]
[]
[]
[]
[]
[]
[]
["Get App"]
["Log In"]
["Sign Up"]
["My Portfolio"]
["My Watchlist"]
["My Messages"]
["Sign out"]
[]
["Quotes "]
["NAVs"]
["Commodities "]
["Futures & Options "]
["News "]
["Forum "]
["Notices "]
["Videos "]
["Glossary "]
["All "]
["Auriferous Aqua Farma , 519363"]
["View All "]
["Select Language"]
["English"]
["à¤¹à¤¿à¤‚à¤¦à¥€"]
["à¤—à¥\u0081à¤œà¤°à¤¾à¤¤à¥€"]
["Home"]
["Lok Sabha Election 2019 "]
[]
["Stock Premier League "]
[]
["News"]
["Markets"]
{"$rows_left_out":389}
{"sheet":"htmedia CF","index":11,"n_rows":423,"n_cols":6,"rows_kept":423,"cut":false,"hidden":false,"merged":[]}
["English"]
["Hindi"]
["Gujarati"]
[]
["App"]
[]
["Subscription"]
["Specials"]
[]
[]
[]
[]
[]
[]
[]
[]
[]
[]
[]
["Quotes "]
["NAVs"]
["Commodities "]
["Futures & Options "]
["News "]
["Forum "]
["Notices "]
["Videos "]
["Glossary "]
["All "]
[]
["Stocks"]
["Feedback"]
["Log In"]
[]
["My Profile (Unverified)"]
["My Portfolio"]
["My Watchlist"]
["My Messages"]
["My Alerts"]
[]
["Sign Up"]
["Logout"]
[]
[]
[]
[]
[]
[]
[]
["Get App"]
["Log In"]
["Sign Up"]
["My Portfolio"]
["My Watchlist"]
["My Messages"]
["Sign out"]
[]
["Quotes "]
["NAVs"]
["Commodities "]
["Futures & Options "]
["News "]
["Forum "]
["Notices "]
["Videos "]
["Glossary "]
["All "]
["Auriferous Aqua Farma , 519363"]
["View All "]
["Select Language"]
["English"]
["à¤¹à¤¿à¤‚à¤¦à¥€"]
["à¤—à¥\u0081à¤œà¤°à¤¾à¤¤à¥€"]
["Home"]
["Lok Sabha Election 2019 "]
[]
["Stock Premier League "]
[]
["News"]
["Markets"]
{"$rows_left_out":344}
{"sheet":"relianceindustries BS","index":12,"n_rows":463,"n_cols":6,"rows_kept":463,"cut":false,"hidden":false,"merged":[]}
["English"]
["Hindi"]
["Gujarati"]
[]
["App"]
[]
["Subscription"]
["Specials"]
[]
[]
[]
[]
[]
[]
[]
[]
[]
[]
[]
["Quotes "]
["NAVs"]
["Commodities "]
["Futures & Options "]
["News "]
["Forum "]
["Notices "]
["Videos "]
["Glossary "]
["All "]
[]
["Stocks"]
["Feedback"]
["Log In"]
[]
["My Profile (Unverified)"]
["My Portfolio"]
["My Watchlist"]
["My Messages"]
["My Alerts"]
[]
["Sign Up"]
["Logout"]
[]
[]
[]
[]
[]
[]
[]
["Get App"]
["Log In"]
["Sign Up"]
["My Portfolio"]
["My Watchlist"]
["My Messages"]
["Sign out"]
[]
["Quotes "]
["NAVs"]
["Commodities "]
["Futures & Options "]
["News "]
["Forum "]
["Notices "]
["Videos "]
["Glossary "]
["All "]
["Auriferous Aqua Farma , 519363"]
["View All "]
["Select Language"]
["English"]
["à¤¹à¤¿à¤‚à¤¦à¥€"]
["à¤—à¥\u0081à¤œà¤°à¤¾à¤¤à¥€"]
["Home"]
["Lok Sabha Election 2019 "]
[]
["Stock Premier League "]
[]
["News"]
["Markets"]
{"$rows_left_out":384}
{"sheet":"relianceindustries PL","index":13,"n_rows":478,"n_cols":6,"rows_kept":478,"cut":false,"hidden":false,"merged":[]}
["English"]
["Hindi"]
["Gujarati"]
[]
["App"]
[]
["Subscription"]
["Specials"]
[]
[]
[]
[]
[]
[]
[]
[]
[]
[]
[]
["Quotes "]
["NAVs"]
["Commodities "]
["Futures & Options "]
["News "]
["Forum "]
["Notices "]
["Videos "]
["Glossary "]
["All "]
[]
["Stocks"]
["Feedback"]
["Log In"]
[]
["My Profile (Unverified)"]
["My Portfolio"]
["My Watchlist"]
["My Messages"]
["My Alerts"]
[]
["Sign Up"]
["Logout"]
[]
[]
[]
[]
[]
[]
[]
["Get App"]
["Log In"]
["Sign Up"]
["My Portfolio"]
["My Watchlist"]
["My Messages"]
["Sign out"]
[]
["Quotes "]
["NAVs"]
["Commodities "]
["Futures & Options "]
["News "]
["Forum "]
["Notices "]
["Videos "]
["Glossary "]
["All "]
["Auriferous Aqua Farma , 519363"]
["View All "]
["Select Language"]
["English"]
["à¤¹à¤¿à¤‚à¤¦à¥€"]
["à¤—à¥\u0081à¤œà¤°à¤¾à¤¤à¥€"]
["Home"]
["Lok Sabha Election 2019 "]
[]
["Stock Premier League "]
[]
["News"]
["Markets"]
{"$rows_left_out":399}
{"sheet":"relianceindustries Ratios","index":14,"n_rows":482,"n_cols":6,"rows_kept":482,"cut":false,"hidden":false,"merged":[]}
["English"]
["Hindi"]
["Gujarati"]
[]
["App"]
[]
["Subscription"]
["Specials"]
[]
[]
[]
[]
[]
[]
[]
[]
[]
[]
[]
["Quotes "]
["NAVs"]
["Commodities "]
["Futures & Options "]
["News "]
["Forum "]
["Notices "]
["Videos "]
["Glossary "]
["All "]
[]
["Stocks"]
["Feedback"]
["Log In"]
[]
["My Profile (Unverified)"]
["My Portfolio"]
["My Watchlist"]
["My Messages"]
["My Alerts"]
[]
["Sign Up"]
["Logout"]
[]
[]
[]
[]
[]
[]
[]
["Get App"]
["Log In"]
["Sign Up"]
["My Portfolio"]
["My Watchlist"]
["My Messages"]
["Sign out"]
[]
["Quotes "]
["NAVs"]
["Commodities "]
["Futures & Options "]
["News "]
["Forum "]
["Notices "]
["Videos "]
["Glossary "]
["All "]
["Auriferous Aqua Farma , 519363"]
["View All "]
["Select Language"]
["English"]
["à¤¹à¤¿à¤‚à¤¦à¥€"]
["à¤—à¥\u0081à¤œà¤°à¤¾à¤¤à¥€"]
["Home"]
["Lok Sabha Election 2019 "]
[]
["Stock Premier League "]
[]
["News"]
["Markets"]
{"$rows_left_out":403}
{"sheet":"relianceindustries CF","index":15,"n_rows":437,"n_cols":6,"rows_kept":437,"cut":false,"hidden":false,"merged":[]}
["English"]
["Hindi"]
["Gujarati"]
[]
["App"]
[]
["Subscription"]
["Specials"]
[]
[]
[]
[]
[]
[]
[]
[]
[]
[]
[]
["Quotes "]
["NAVs"]
["Commodities "]
["Futures & Options "]
["News "]
["Forum "]
["Notices "]
["Videos "]
["Glossary "]
["All "]
[]
["Stocks"]
["Feedback"]
["Log In"]
[]
["My Profile (Unverified)"]
["My Portfolio"]
["My Watchlist"]
["My Messages"]
["My Alerts"]
[]
["Sign Up"]
["Logout"]
[]
[]
[]
[]
[]
[]
[]
["Get App"]
["Log In"]
["Sign Up"]
["My Portfolio"]
["My Watchlist"]
["My Messages"]
["Sign out"]
[]
["Quotes "]
["NAVs"]
["Commodities "]
["Futures & Options "]
["News "]
["Forum "]
["Notices "]
["Videos "]
["Glossary "]
["All "]
["Auriferous Aqua Farma , 519363"]
["View All "]
["Select Language"]
["English"]
["à¤¹à¤¿à¤‚à¤¦à¥€"]
["à¤—à¥\u0081à¤œà¤°à¤¾à¤¤à¥€"]
["Home"]
["Lok Sabha Election 2019 "]
[]
["Stock Premier League "]
[]
["News"]
["Markets"]
{"$rows_left_out":357}