{"text_format":"1","workbook":"xlsx","n_sheets":8,"sheets":["Introduction","Contents","Financial Model","Valuation Summary","Acquisition Assumptions","Acquistion Model","Sensitivity","Scenario Output"],"not_rendered":{"charts":2,"images":5,"macros":1,"external_links":1,"defined_names":11,"comments":1,"pivot_tables":0},"unopened":[],"bounds":{"document_bytes":16777216,"sheet_cells":100000,"rows_first":2000,"rows_last":500,"rows_between":2000,"halvings":0,"cell_chars":16384,"cell_head_chars":4096},"cells_cut":0,"cells_raw":0,"read":"whole","date_system":"1900"}

{"sheet":"Introduction","index":0,"n_rows":0,"n_cols":0,"rows_kept":0,"cut":false,"hidden":false,"merged":[]}

{"sheet":"Contents","index":1,"n_rows":18,"n_cols":5,"rows_kept":18,"cut":false,"hidden":false,"merged":[]}
[null,null,"Go to Charts by Pressing Shift and Enter on Menu Item "]
[]
[null,"Contents","Sheet Tab","Description","Author"]
[null,1,"Introduction"]
[null,2,"Contents"]
[null,3,"Financial Model"]
[null,4,"Valuation Summary"]
[null,5,"Acquisition Assumptions"]
[null,6,"Acquistion Model"]
[null,7,"Sensitivity"]
{"$rows_left_out":9}
{"sheet":"Financial Model","index":2,"n_rows":276,"n_cols":131,"rows_kept":276,"cut":false,"hidden":false,"merged":[]}
["Contents"]
[null,"Quarter",null,null,null,null,null,null,"2004-01-01",{"$f":"EDATE(I2,3)","v":"2004-04-01"},{"$f":"EDATE(J2,3)","v":"2004-07-01"},"2004-10-01","2005-01-01","2005-04-01","2005-07-01","2005-10-01","2006-01-01","2006-04-01","2006-07-01","2006-10-01","2007-01-01","2007-04-01","2007-07-01","2007-10-01","2008-01-01","2008-04-01","2008-07-01","2008-10-01","2009-01-01","2009-04-01","2009-07-01","2009-10-01","2010-01-01","2010-04-01","2010-07-01","2010-10-01","2011-01-01","2011-04-01","2011-07-01","2011-10-01","2012-01-01","2012-04-01","2012-07-01","2012-10-01","2013-01-01","2013-04-01","2013-07-01","2013-10-01","2014-01-01","2014-04-01","2014-07-01","2014-10-01","2015-01-01","2015-04-01","2015-07-01","2015-10-01","2016-01-01","2016-04-01","2016-07-01","2016-10-01","2017-01-01","2017-04-01","2017-07-01","2017-10-01","2018-01-01","2018-04-01","2018-07-01","2018-10-01","2019-01-01","2019-04-01","2019-07-01","2019-10-01","2020-01-01","2020-04-01",{"$f":"EDATE(BV2,3)","v":"2020-07-01"},"2020-10-01","2021-01-01","2021-04-01","2021-07-01","2021-10-01","2022-01-01","2022-04-01","2022-07-01","2022-10-01","2023-01-01","2023-04-01","2023-07-01","2023-10-01","2024-01-01","2024-04-01","2024-07-01","2024-10-01","2025-01-01",{"$f":"EDATE(CO2,3)","v":"2025-04-01"},{"$f":"EDATE(CP2,3)","v":"2025-07-01"},{"$f":"EDATE(CQ2,3)","v":"2025-10-01"},{"$f":"EDATE(CR2,3)","v":"2026-01-01"},{"$f":"EDATE(CS2,3)","v":"2026-04-01"},{"$f":"EDATE(CT2,3)","v":"2026-07-01"},{"$f":"EDATE(CU2,3)","v":"2026-10-01"},{"$f":"EDATE(CV2,3)","v":"2027-01-01"},{"$f":"EDATE(CW2,3)","v":"2027-04-01"},{"$f":"EDATE(CX2,3)","v":"2027-07-01"},{"$f":"EDATE(CY2,3)","v":"2027-10-01"},{"$f":"EDATE(CZ2,3)","v":"2028-01-01"},{"$f":"EDATE(DA2,3)","v":"2028-04-01"},{"$f":"EDATE(DB2,3)","v":"2028-07-01"},{"$f":"EDATE(DC2,3)","v":"2028-10-01"},{"$f":"EDATE(DD2,3)","v":"2029-01-01"},{"$f":"EDATE(DE2,3)","v":"2029-04-01"},{"$f":"EDATE(DF2,3)","v":"2029-07-01"},{"$f":"EDATE(DG2,3)","v":"2029-10-01"},{"$f":"EDATE(DH2,3)","v":"2030-01-01"},{"$f":"EDATE(DI2,3)","v":"2030-04-01"},{"$f":"EDATE(DJ2,3)","v":"2030-07-01"},{"$f":"EDATE(DK2,3)","v":"2030-10-01"},{"$f":"EDATE(DL2,3)","v":"2031-01-01"},{"$f":"EDATE(DM2,3)","v":"2031-04-01"},{"$f":"EDATE(DN2,3)","v":"2031-07-01"},{"$f":"EDATE(DO2,3)","v":"2031-10-01"},{"$f":"EDATE(DP2,3)","v":"2032-01-01"},{"$f":"EDATE(DQ2,3)","v":"2032-04-01"},{"$f":"EDATE(DR2,3)","v":"2032-07-01"},{"$f":"EDATE(DS2,3)","v":"2032-10-01"},{"$f":"EDATE(DT2,3)","v":"2033-01-01"},{"$f":"EDATE(DU2,3)","v":"2033-04-01"},{"$f":"EDATE(DV2,3)","v":"2033-07-01"},{"$f":"EDATE(DW2,3)","v":"2033-10-01"},{"$f":"EDATE(DX2,3)","v":"2034-01-01"},{"$f":"EDATE(DY2,3)","v":"2034-04-01"},{"$f":"EDATE(DZ2,3)","v":"2034-07-01"}]
[null,"History",null,null,"Switch",null,"2019-04-01",null,{"$f":"I2<=$G$3","v":true},{"$f":"J2<=$G$3","v":true},true,true,true,true,true,true,true,true,true,true,true,true,true,true,true,true,true,true,true,true,true,true,true,true,true,true,true,true,true,true,true,true,true,true,true,true,true,true,true,true,true,true,true,true,true,true,true,true,true,true,true,true,true,true,true,true,true,true,true,true,false,false,false,{"$f":"BV2<=$G$3","v":false},false,false,false,false,false,false,false,false,false,false,false,false,false,false,false,false,false,false,false,{"$f":"CP2<=$G$3","v":false},false,false,false,false,false,false,false,false,false,false,false,false,false,false,false,false,false,false,false,false,false,false,false,false,false,false,false,false,false,false,false,false,false,false,false,false,false]
[null,"History Evaluation Period",null,null,"Switch",null,"2014-01-01",null,{"$f":"AND(I2>=$G$4,I2<=$G$3)","v":false},{"$f":"AND(J2>=$G$4,J2<=$G$3)","v":false},false,false,false,false,false,false,false,false,false,false,false,false,false,false,false,false,false,false,false,false,false,false,false,false,false,false,false,false,false,false,false,false,false,false,false,false,false,false,true,true,true,true,true,true,true,true,true,true,true,true,true,true,true,true,true,true,true,true,true,true,false,false,false,{"$f":"AND(BV2>=$G$4,BV2<=$G$3)","v":false},false,false,false,false,false,false,false,false,false,false,false,false,false,false,false,false,false,false,false,{"$f":"AND(CP2>=$G$4,CP2<=$G$3)","v":false},false,false,false,false,false,false,false,false,false,false,false,false,false,false,false,false,false,false,false,false,false,false,false,false,false,false,false,false,false,false,false,false,false,false,false,false,false]
[null,"Explicit Valuation ",null,null,"Switch",null,{"$f":"G9","v":"2019-10-01"},{"$f":"G11","v":"2024-10-01"},{"$f":"AND(I2>=$G$5,I2<=$H$5)","v":false},{"$f":"AND(J2>=$G$5,J2<=$H$5)","v":false},false,false,false,false,false,false,false,false,false,false,false,false,false,false,false,false,false,false,false,false,false,false,false,false,false,false,false,false,false,false,false,false,false,false,false,false,false,false,false,false,false,false,false,false,false,false,false,false,false,false,false,false,false,false,false,false,false,false,false,false,false,true,true,{"$f":"AND(BV2>=$G$5,BV2<=$H$5)","v":true},true,true,true,true,true,true,true,true,true,true,true,true,true,true,true,true,true,true,false,{"$f":"AND(CP2>=$G$5,CP2<=$H$5)","v":false},false,false,false,false,false,false,false,false,false,false,false,false,false,false,false,false,false,false,false,false,false,false,false,false,false,false,false,false,false,false,false,false,false,false,false,false,false]
[null,"Terminal Period",null,null,"Switch",null,{"$f":"G11","v":"2024-10-01"},null,{"$f":"I2=$G$6","v":false},{"$f":"J2=$G$6","v":false},false,false,false,false,false,false,false,false,false,false,false,false,false,false,false,false,false,false,false,false,false,false,false,false,false,false,false,false,false,false,false,false,false,false,false,false,false,false,false,false,false,false,false,false,false,false,false,false,false,false,false,false,false,false,false,false,false,false,false,false,false,false,false,{"$f":"BV2=$G$6","v":false},false,false,false,false,false,false,false,false,false,false,false,false,false,false,false,false,false,true,false,{"$f":"CP2=$G$6","v":false},false,false,false,false,false,false,false,false,false,false,false,false,false,false,false,false,false,false,false,false,false,false,false,false,false,false,false,false,false,false,false,false,false,false,false,false,false]
[]
["Valuation Assumptions"]
[null,"Start of Valuation",null,null,"Date",null,"2019-10-01"]
[null,"Holding Period",null,null,"Years",null,5]
{"$rows_left_out":267}
{"sheet":"Valuation Summary","index":3,"n_rows":46,"n_cols":130,"rows_kept":46,"cut":false,"hidden":false,"merged":[]}
["Contents","Valuation Summary"]
[null,null,null,null,null,null,null,"Explict, Qtl","Annual"]
[null,null,"WACC",{"$f":"'Financial Model'!F13","v":0.1},null,null,"Sales Gr",{"$f":"'Financial Model'!H56","v":0.03},{"$f":"(1+H3)^4-1","v":0.12550880999999992},null,null,null,null,null,null,null,null,null,null,{"$f":"spinner","v":68}]
[null,null,"Terminal Growth",{"$f":"'Financial Model'!F14","v":0.06},null,null,"COGS %",{"$f":"'Financial Model'!H59","v":0.53}]
[null,null,"EV/EBITDA",{"$f":"'Financial Model'!F15","v":7}]
[null,null,"ROIC/WACC Spread",{"$f":"'Financial Model'!F16","v":0.04}]
[null,null,null,null,null,null,null,null,"McKinsey","Immediate","Interpolated"]
[null,null,"Alternative Valuations",null,null,null,"Growth","EV/EBITDA","Value Dr","Value Dr","Value Dr"]
[]
[null,null,"Explictit Value",null,null,null,{"$f":"'Financial Model'!F222","v":28542.751224618514},{"$f":"G10","v":28542.751224618514},{"$f":"H10","v":28542.751224618514},{"$f":"I10","v":28542.751224618514},{"$f":"'Financial Model'!J222","v":0}]
{"$rows_left_out":37}
{"sheet":"Acquisition Assumptions","index":4,"n_rows":140,"n_cols":15,"rows_kept":140,"cut":false,"hidden":false,"merged":[]}
["Contents","Acquisition Assumptions"]
["Transaction Assumptions"]
[null,null,"Timing"]
[null,null,null,"Transaction Date",null,"2020-04-01"]
[null,null,null,"Holding Period","Years",6]
[null,null,null,"Exit Date",null,{"$f":"EDATE(F4,F5*12)","v":"2026-04-01"}]
[null,null,null,null,null,null,null,"Exit Mult"]
[null,null,"Entry and Exit Multiples"]
[null,null,null,"Entry Multiple","x",9]
[null,null,null,"Exit Multiple","x",12]
{"$rows_left_out":131}
{"sheet":"Acquistion Model","index":5,"n_rows":112,"n_cols":47,"rows_kept":112,"cut":false,"hidden":false,"merged":[]}
["Contents",null,null,null,null,null,null,1,2,3,4,5,6,7,8,9,10,11,12,13,14,15,16,17,18,19,20,21,22,23,24,25,26,27,28,29,30,31,32,33,34,35,36,37,38,39,40]
[null,"Quarter",null,null,null,null,null,{"$f":"'Acquisition Assumptions'!F4","v":"2020-04-01"},{"$f":"EDATE(H2,3)","v":"2020-07-01"},{"$f":"EDATE(I2,3)","v":"2020-10-01"},"2021-01-01","2021-04-01","2021-07-01","2021-10-01","2022-01-01","2022-04-01","2022-07-01","2022-10-01","2023-01-01","2023-04-01","2023-07-01","2023-10-01","2024-01-01","2024-04-01","2024-07-01","2024-10-01","2025-01-01","2025-04-01","2025-07-01","2025-10-01","2026-01-01","2026-04-01","2026-07-01","2026-10-01","2027-01-01","2027-04-01","2027-07-01","2027-10-01","2028-01-01","2028-04-01","2028-07-01","2028-10-01","2029-01-01","2029-04-01","2029-07-01","2029-10-01","2030-01-01"]
[null,"Holding ",null,null,{"$f":"'Acquisition Assumptions'!F4","v":"2020-04-01"},{"$f":"'Acquisition Assumptions'!F6","v":"2026-04-01"},{"$f":"'Acquisition Assumptions'!$F$5","v":6},{"$f":"AND(H2>$E$3,H2<=$F$3)","v":false},{"$f":"AND(I2>$E$3,I2<=$F$3)","v":true},true,true,true,true,true,true,true,true,true,true,true,true,true,true,true,true,true,true,true,true,true,true,true,false,false,false,false,false,false,false,false,false,false,false,false,false,false,false]
[null,"Exit Switch",null,null,null,{"$f":"'Acquisition Assumptions'!F6","v":"2026-04-01"},null,{"$f":"H2=$F$4","v":false},{"$f":"I2=$F$4","v":false},false,false,false,false,false,false,false,false,false,false,false,false,false,false,false,false,false,false,false,false,false,false,true,false,false,false,false,false,false,false,false,false,false,false,false,false,false,false]
[]
[]
["Transferred Data with Lookup"]
[null,"Pre-tax Cash Flow Transferred"]
[null,null,null,"Revenues",null,null,null,{"$f":"LOOKUP(H$2,'Financial Model'!$2:$2,'Financial Model'!95:95)*H$3","v":0},{"$f":"LOOKUP(I$2,'Financial Model'!$2:$2,'Financial Model'!95:95)*I$3","v":34812.913084574357},{"$f":"LOOKUP(J$2,'Financial Model'!$2:$2,'Financial Model'!95:95)*J$3","v":35857.300477111588},{"$f":"LOOKUP(K$2,'Financial Model'!$2:$2,'Financial Model'!95:95)*K$3","v":36933.019491424937},{"$f":"LOOKUP(L$2,'Financial Model'!$2:$2,'Financial Model'!95:95)*L$3","v":38041.010076167688},{"$f":"LOOKUP(M$2,'Financial Model'!$2:$2,'Financial Model'!95:95)*M$3","v":39182.24037845272},{"$f":"LOOKUP(N$2,'Financial Model'!$2:$2,'Financial Model'!95:95)*N$3","v":40357.707589806305},{"$f":"LOOKUP(O$2,'Financial Model'!$2:$2,'Financial Model'!95:95)*O$3","v":41568.438817500493},{"$f":"LOOKUP(P$2,'Financial Model'!$2:$2,'Financial Model'!95:95)*P$3","v":42815.491982025509},{"$f":"LOOKUP(Q$2,'Financial Model'!$2:$2,'Financial Model'!95:95)*Q$3","v":44099.956741486276},{"$f":"LOOKUP(R$2,'Financial Model'!$2:$2,'Financial Model'!95:95)*R$3","v":45422.955443730869},{"$f":"LOOKUP(S$2,'Financial Model'!$2:$2,'Financial Model'!95:95)*S$3","v":46785.644107042797},{"$f":"LOOKUP(T$2,'Financial Model'!$2:$2,'Financial Model'!95:95)*T$3","v":48189.21343025408},{"$f":"LOOKUP(U$2,'Financial Model'!$2:$2,'Financial Model'!95:95)*U$3","v":49634.889833161702},{"$f":"LOOKUP(V$2,'Financial Model'!$2:$2,'Financial Model'!95:95)*V$3","v":51123.936528156555},{"$f":"LOOKUP(W$2,'Financial Model'!$2:$2,'Financial Model'!95:95)*W$3","v":52657.654624001254},{"$f":"LOOKUP(X$2,'Financial Model'!$2:$2,'Financial Model'!95:95)*X$3","v":54237.384262721294},{"$f":"LOOKUP(Y$2,'Financial Model'!$2:$2,'Financial Model'!95:95)*Y$3","v":55864.505790602932},{"$f":"LOOKUP(Z$2,'Financial Model'!$2:$2,'Financial Model'!95:95)*Z$3","v":57540.440964321024},{"$f":"LOOKUP(AA$2,'Financial Model'!$2:$2,'Financial Model'!95:95)*AA$3","v":59266.654193250659},{"$f":"LOOKUP(AB$2,'Financial Model'!$2:$2,'Financial Model'!95:95)*AB$3","v":61044.653819048181},{"$f":"LOOKUP(AC$2,'Financial Model'!$2:$2,'Financial Model'!95:95)*AC$3","v":62875.993433619631},{"$f":"LOOKUP(AD$2,'Financial Model'!$2:$2,'Financial Model'!95:95)*AD$3","v":64762.273236628222},{"$f":"LOOKUP(AE$2,'Financial Model'!$2:$2,'Financial Model'!95:95)*AE$3","v":66705.141433727069},{"$f":"LOOKUP(AF$2,'Financial Model'!$2:$2,'Financial Model'!95:95)*AF$3","v":68706.295676738882},{"$f":"LOOKUP(AG$2,'Financial Model'!$2:$2,'Financial Model'!95:95)*AG$3","v":0},{"$f":"LOOKUP(AH$2,'Financial Model'!$2:$2,'Financial Model'!95:95)*AH$3","v":0},{"$f":"LOOKUP(AI$2,'Financial Model'!$2:$2,'Financial Model'!95:95)*AI$3","v":0},{"$f":"LOOKUP(AJ$2,'Financial Model'!$2:$2,'Financial Model'!95:95)*AJ$3","v":0},{"$f":"LOOKUP(AK$2,'Financial Model'!$2:$2,'Financial Model'!95:95)*AK$3","v":0},{"$f":"LOOKUP(AL$2,'Financial Model'!$2:$2,'Financial Model'!95:95)*AL$3","v":0},{"$f":"LOOKUP(AM$2,'Financial Model'!$2:$2,'Financial Model'!95:95)*AM$3","v":0},{"$f":"LOOKUP(AN$2,'Financial Model'!$2:$2,'Financial Model'!95:95)*AN$3","v":0},{"$f":"LOOKUP(AO$2,'Financial Model'!$2:$2,'Financial Model'!95:95)*AO$3","v":0},{"$f":"LOOKUP(AP$2,'Financial Model'!$2:$2,'Financial Model'!95:95)*AP$3","v":0},{"$f":"LOOKUP(AQ$2,'Financial Model'!$2:$2,'Financial Model'!95:95)*AQ$3","v":0},{"$f":"LOOKUP(AR$2,'Financial Model'!$2:$2,'Financial Model'!95:95)*AR$3","v":0},{"$f":"LOOKUP(AS$2,'Financial Model'!$2:$2,'Financial Model'!95:95)*AS$3","v":0},{"$f":"LOOKUP(AT$2,'Financial Model'!$2:$2,'Financial Model'!95:95)*AT$3","v":0},{"$f":"LOOKUP(AU$2,'Financial Model'!$2:$2,'Financial Model'!95:95)*AU$3","v":0}]
[null,null,null,"COGS",null,null,null,{"$f":"LOOKUP(H$2,'Financial Model'!$2:$2,'Financial Model'!96:96)*H$3","v":0},{"$f":"LOOKUP(I$2,'Financial Model'!$2:$2,'Financial Model'!96:96)*I$3","v":18450.84393482441},{"$f":"LOOKUP(J$2,'Financial Model'!$2:$2,'Financial Model'!96:96)*J$3","v":19004.369252869143},{"$f":"LOOKUP(K$2,'Financial Model'!$2:$2,'Financial Model'!96:96)*K$3","v":19574.500330455219},{"$f":"LOOKUP(L$2,'Financial Model'!$2:$2,'Financial Model'!96:96)*L$3","v":20161.735340368876},{"$f":"LOOKUP(M$2,'Financial Model'!$2:$2,'Financial Model'!96:96)*M$3","v":20766.587400579941},{"$f":"LOOKUP(N$2,'Financial Model'!$2:$2,'Financial Model'!96:96)*N$3","v":21389.585022597341},{"$f":"LOOKUP(O$2,'Financial Model'!$2:$2,'Financial Model'!96:96)*O$3","v":22031.272573275262},{"$f":"LOOKUP(P$2,'Financial Model'!$2:$2,'Financial Model'!96:96)*P$3","v":22692.210750473521},{"$f":"LOOKUP(Q$2,'Financial Model'!$2:$2,'Financial Model'!96:96)*Q$3","v":23372.977072987727},{"$f":"LOOKUP(R$2,'Financial Model'!$2:$2,'Financial Model'!96:96)*R$3","v":24074.166385177363},{"$f":"LOOKUP(S$2,'Financial Model'!$2:$2,'Financial Model'!96:96)*S$3","v":24796.391376732685},{"$f":"LOOKUP(T$2,'Financial Model'!$2:$2,'Financial Model'!96:96)*T$3","v":25540.283118034662},{"$f":"LOOKUP(U$2,'Financial Model'!$2:$2,'Financial Model'!96:96)*U$3","v":26306.491611575704},{"$f":"LOOKUP(V$2,'Financial Model'!$2:$2,'Financial Model'!96:96)*V$3","v":27095.686359922976},{"$f":"LOOKUP(W$2,'Financial Model'!$2:$2,'Financial Model'!96:96)*W$3","v":27908.556950720667},{"$f":"LOOKUP(X$2,'Financial Model'!$2:$2,'Financial Model'!96:96)*X$3","v":28745.813659242289},{"$f":"LOOKUP(Y$2,'Financial Model'!$2:$2,'Financial Model'!96:96)*Y$3","v":29608.188069019554},{"$f":"LOOKUP(Z$2,'Financial Model'!$2:$2,'Financial Model'!96:96)*Z$3","v":30496.433711090143},{"$f":"LOOKUP(AA$2,'Financial Model'!$2:$2,'Financial Model'!96:96)*AA$3","v":31411.326722422851},{"$f":"LOOKUP(AB$2,'Financial Model'!$2:$2,'Financial Model'!96:96)*AB$3","v":32353.666524095537},{"$f":"LOOKUP(AC$2,'Financial Model'!$2:$2,'Financial Model'!96:96)*AC$3","v":33324.276519818406},{"$f":"LOOKUP(AD$2,'Financial Model'!$2:$2,'Financial Model'!96:96)*AD$3","v":34324.004815412962},{"$f":"LOOKUP(AE$2,'Financial Model'!$2:$2,'Financial Model'!96:96)*AE$3","v":35353.724959875348},{"$f":"LOOKUP(AF$2,'Financial Model'!$2:$2,'Financial Model'!96:96)*AF$3","v":36414.33670867161},{"$f":"LOOKUP(AG$2,'Financial Model'!$2:$2,'Financial Model'!96:96)*AG$3","v":0},{"$f":"LOOKUP(AH$2,'Financial Model'!$2:$2,'Financial Model'!96:96)*AH$3","v":0},{"$f":"LOOKUP(AI$2,'Financial Model'!$2:$2,'Financial Model'!96:96)*AI$3","v":0},{"$f":"LOOKUP(AJ$2,'Financial Model'!$2:$2,'Financial Model'!96:96)*AJ$3","v":0},{"$f":"LOOKUP(AK$2,'Financial Model'!$2:$2,'Financial Model'!96:96)*AK$3","v":0},{"$f":"LOOKUP(AL$2,'Financial Model'!$2:$2,'Financial Model'!96:96)*AL$3","v":0},{"$f":"LOOKUP(AM$2,'Financial Model'!$2:$2,'Financial Model'!96:96)*AM$3","v":0},{"$f":"LOOKUP(AN$2,'Financial Model'!$2:$2,'Financial Model'!96:96)*AN$3","v":0},{"$f":"LOOKUP(AO$2,'Financial Model'!$2:$2,'Financial Model'!96:96)*AO$3","v":0},{"$f":"LOOKUP(AP$2,'Financial Model'!$2:$2,'Financial Model'!96:96)*AP$3","v":0},{"$f":"LOOKUP(AQ$2,'Financial Model'!$2:$2,'Financial Model'!96:96)*AQ$3","v":0},{"$f":"LOOKUP(AR$2,'Financial Model'!$2:$2,'Financial Model'!96:96)*AR$3","v":0},{"$f":"LOOKUP(AS$2,'Financial Model'!$2:$2,'Financial Model'!96:96)*AS$3","v":0},{"$f":"LOOKUP(AT$2,'Financial Model'!$2:$2,'Financial Model'!96:96)*AT$3","v":0},{"$f":"LOOKUP(AU$2,'Financial Model'!$2:$2,'Financial Model'!96:96)*AU$3","v":0}]
{"$rows_left_out":103}
{"sheet":"Sensitivity","index":6,"n_rows":22,"n_cols":12,"rows_kept":22,"cut":false,"hidden":false,"merged":[]}
["Contents","Sensitivity"]
[]
[null,null,"Scenario Code",null,1]
[]
[]
[null,null,null,null,"Sales Growth","Margin","Employee Growth","Variable Expenses","Capital Expenditures to Sales","A/R to Revenues","Inventories to COGS","Current Liabilities to Expense"]
[null,null,"Base",null,0.03,0.53,2.75E-2,0.09,0.16,0.156,0.83,0.25]
[null,null,"Bull Case",null,0.05,0.5,2.5000000000000001E-2,8.5000000000000006E-2,0.15,0.2,0.88,0.25]
[null,null,"Bear Case",null,0.02,0.55000000000000004,0.03,9.5000000000000001E-2,0.17,0.12,0.83,0.25]
[null,null,"Custom Case",null,0.01,0.53,2.75E-2,0.09,0.16,0.156,0.83,0.25]
{"$rows_left_out":13}
{"sheet":"Scenario Output","index":7,"n_rows":98,"n_cols":13,"rows_kept":98,"cut":false,"hidden":false,"merged":[]}
["Contents","Scenario Output"]
[]
[null,null,"No","Name","Sales Growth","COGS Margin","Employee Growth","DCF Value Growth","EV/EBITDA Terminal","Value Driver","Value Driver","<---------------","Replace these titles and Links in Next Row"]
[null,null,null,null,{"$f":"Sensitivity!E12","v":0.03},{"$f":"Sensitivity!F12","v":0.53},{"$f":"Sensitivity!G12","v":2.75E-2},{"$f":"'Valuation Summary'!G14","v":363096.37199708802},{"$f":"'Valuation Summary'!H14","v":240593.17978952845},{"$f":"'Valuation Summary'!I14","v":254270.05761442761}]
[]
[]
[]
[]
[]
[]
{"$rows_left_out":88}