{"text_format":"1","workbook":"xlsx","n_sheets":6,"sheets":["TOC","Diagram","Scenario","Assumptions","Financial Model","Annual Model"],"not_rendered":{"charts":0,"images":1,"macros":1,"external_links":0,"defined_names":36,"comments":0,"pivot_tables":0},"unopened":[],"bounds":{"document_bytes":16777216,"sheet_cells":100000,"rows_first":2000,"rows_last":500,"rows_between":2000,"halvings":0,"cell_chars":16384,"cell_head_chars":4096},"cells_cut":0,"cells_raw":0,"read":"whole","date_system":"1900"}

{"sheet":"TOC","index":0,"n_rows":45,"n_cols":13,"rows_kept":45,"cut":false,"hidden":false,"merged":[]}
[]
[null,null,"TOC"]
[null,null,null,null,null," Colour Codes ",null,null,null,null," File Name: ",null,{"$f":"IFERROR(File_name(),\"\")","v":""}]
[null,null,"Diagram",null,null,null," Inputs ",null,"1234567890"]
[null,null,null,null,null,null," Section Titles ",null,"TITLE ROW",null," Last Save Date ",null,{"$f":"IFERROR(lastsaved(),\"\")","v":""}]
[null,null,"Scenario",null,null,null," Sum Column ",null,"1000000000"]
{"$rows_left_out":40}
{"sheet":"Diagram","index":1,"n_rows":29,"n_cols":25,"rows_kept":29,"cut":false,"hidden":false,"merged":[]}
[]
[null,null,null,null,null,null,null,null,null,null,"Plant Operation"]
[null,null,"Purchased Power Agreement",null,null,null,null,null,null,null,"Capacity",null,{"$f":"Capacity","v":300},null,null,null,null,null,null,"Off-taker - Barisma",null,"Levelised Cost of Electricity",null,null,{"$f":"'Financial Model'!G88","v":54.385611538309753}]
[null,null,"Capacity Charge",null,{"$f":"Assumptions!E52","v":25},null,null,null,null,null,null,null,null,null,null,null,null,null,null,{"$f":"T3&CHAR(10)&V3&TEXT(Y3,\" ##.00\")","v":"Off-taker - Barisma\nLevelised Cost of Electricity 54.39"}]
[null,null,"Target Heat Rate",null,{"$f":"Assumptions!E31","v":6.5},null,null,null,null,null,"Actual Heat Rate",null,{"$f":"Assumptions!E30","v":6.5}]
[null,null,"Target Availability",null,{"$f":"Assumptions!E28","v":0.95}]
{"$rows_left_out":24}
{"sheet":"Scenario","index":2,"n_rows":63,"n_cols":10,"rows_kept":63,"cut":false,"hidden":false,"merged":[]}
[]
[]
["Master Scenario"]
[null,null,"Scenario Code",1]
[null,null,null,null,null,null,null,1,2,3]
[null,null,null,null,null,{"$f":"INDEX(H6:M6,$D$4)","v":"Base Case"},null,"Base Case","Low Case","High Case"]
{"$rows_left_out":58}
{"sheet":"Assumptions","index":3,"n_rows":119,"n_cols":40,"rows_kept":119,"cut":false,"hidden":false,"merged":[]}
[null,"Assumptions"]
[]
[null,null,"Scenario","Code",{"$f":"Scenario!D4","v":1},{"$f":"Scenario!$F$6","v":"Base Case"}]
[]
["Timminig Input"]
[]
{"$rows_left_out":114}
{"sheet":"Financial Model","index":4,"n_rows":155,"n_cols":209,"rows_kept":155,"cut":false,"hidden":false,"merged":[]}
[null,null,null,null,null,null,"driver","driver","sum"]
[null,"Period",null,null,null,null,null,null,null,1,2,3,4,5,6,7,8,9,10,11,12,13,14,15,16,17,18,19,20,21,22,23,24,25,26,27,28,29,30,31,32,33,34,35,36,37,38,39,40,41,42,43,44,45,46,47,48,49,50,51,52,53,54,55,56,57,58,59,60,61,62,63,64,65,66,67,68,69,70,71,72,73,74,75,76,77,78,79,80,81,82,83,84,85,86,87,88,89,90,91,92,93,94,95,96,97,98,99,100,101,102,103,104,105,106,107,108,109,110,111,112,113,114,115,116,117,118,119,120,121,122,123,124,125,126,127,128,129,130,131,132,133,134,135,136,137,138,139,140,141,142,143,144,145,146,147,148,149,150,151,152,153,154,155,156,157,158,159,160,161,162,163,164,165,166,167,168,169,170,171,172,173,174,175,176,177,178,179,180,181,182,183,184,185,186,187,188,189,190,191,192,193,194,195,196,197,198,199,200]
[null,"Pre-COD",null,null,null,null,{"$f":"Assumptions!E8","v":35},null,{"$f":"SUM(J3:HA3)","v":35},{"$f":"(J2<=$G$3)*1","v":1},{"$f":"(K2<=$G$3)*1","v":1},{"$f":"(L2<=$G$3)*1","v":1},{"$f":"(M2<=$G$3)*1","v":1},{"$f":"(N2<=$G$3)*1","v":1},{"$f":"(O2<=$G$3)*1","v":1},{"$f":"(P2<=$G$3)*1","v":1},{"$f":"(Q2<=$G$3)*1","v":1},{"$f":"(R2<=$G$3)*1","v":1},{"$f":"(S2<=$G$3)*1","v":1},{"$f":"(T2<=$G$3)*1","v":1},{"$f":"(U2<=$G$3)*1","v":1},{"$f":"(V2<=$G$3)*1","v":1},{"$f":"(W2<=$G$3)*1","v":1},{"$f":"(X2<=$G$3)*1","v":1},{"$f":"(Y2<=$G$3)*1","v":1},{"$f":"(Z2<=$G$3)*1","v":1},{"$f":"(AA2<=$G$3)*1","v":1},{"$f":"(AB2<=$G$3)*1","v":1},{"$f":"(AC2<=$G$3)*1","v":1},{"$f":"(AD2<=$G$3)*1","v":1},{"$f":"(AE2<=$G$3)*1","v":1},{"$f":"(AF2<=$G$3)*1","v":1},{"$f":"(AG2<=$G$3)*1","v":1},{"$f":"(AH2<=$G$3)*1","v":1},{"$f":"(AI2<=$G$3)*1","v":1},{"$f":"(AJ2<=$G$3)*1","v":1},{"$f":"(AK2<=$G$3)*1","v":1},{"$f":"(AL2<=$G$3)*1","v":1},{"$f":"(AM2<=$G$3)*1","v":1},{"$f":"(AN2<=$G$3)*1","v":1},{"$f":"(AO2<=$G$3)*1","v":1},{"$f":"(AP2<=$G$3)*1","v":1},{"$f":"(AQ2<=$G$3)*1","v":1},{"$f":"(AR2<=$G$3)*1","v":1},{"$f":"(AS2<=$G$3)*1","v":0},{"$f":"(AT2<=$G$3)*1","v":0},{"$f":"(AU2<=$G$3)*1","v":0},{"$f":"(AV2<=$G$3)*1","v":0},{"$f":"(AW2<=$G$3)*1","v":0},{"$f":"(AX2<=$G$3)*1","v":0},{"$f":"(AY2<=$G$3)*1","v":0},{"$f":"(AZ2<=$G$3)*1","v":0},{"$f":"(BA2<=$G$3)*1","v":0},{"$f":"(BB2<=$G$3)*1","v":0},{"$f":"(BC2<=$G$3)*1","v":0},{"$f":"(BD2<=$G$3)*1","v":0},{"$f":"(BE2<=$G$3)*1","v":0},{"$f":"(BF2<=$G$3)*1","v":0},{"$f":"(BG2<=$G$3)*1","v":0},{"$f":"(BH2<=$G$3)*1","v":0},{"$f":"(BI2<=$G$3)*1","v":0},{"$f":"(BJ2<=$G$3)*1","v":0},{"$f":"(BK2<=$G$3)*1","v":0},{"$f":"(BL2<=$G$3)*1","v":0},{"$f":"(BM2<=$G$3)*1","v":0},{"$f":"(BN2<=$G$3)*1","v":0},{"$f":"(BO2<=$G$3)*1","v":0},{"$f":"(BP2<=$G$3)*1","v":0},{"$f":"(BQ2<=$G$3)*1","v":0},{"$f":"(BR2<=$G$3)*1","v":0},{"$f":"(BS2<=$G$3)*1","v":0},{"$f":"(BT2<=$G$3)*1","v":0},{"$f":"(BU2<=$G$3)*1","v":0},{"$f":"(BV2<=$G$3)*1","v":0},{"$f":"(BW2<=$G$3)*1","v":0},{"$f":"(BX2<=$G$3)*1","v":0},{"$f":"(BY2<=$G$3)*1","v":0},{"$f":"(BZ2<=$G$3)*1","v":0},{"$f":"(CA2<=$G$3)*1","v":0},{"$f":"(CB2<=$G$3)*1","v":0},{"$f":"(CC2<=$G$3)*1","v":0},{"$f":"(CD2<=$G$3)*1","v":0},{"$f":"(CE2<=$G$3)*1","v":0},{"$f":"(CF2<=$G$3)*1","v":0},{"$f":"(CG2<=$G$3)*1","v":0},{"$f":"(CH2<=$G$3)*1","v":0},{"$f":"(CI2<=$G$3)*1","v":0},{"$f":"(CJ2<=$G$3)*1","v":0},{"$f":"(CK2<=$G$3)*1","v":0},{"$f":"(CL2<=$G$3)*1","v":0},{"$f":"(CM2<=$G$3)*1","v":0},{"$f":"(CN2<=$G$3)*1","v":0},{"$f":"(CO2<=$G$3)*1","v":0},{"$f":"(CP2<=$G$3)*1","v":0},{"$f":"(CQ2<=$G$3)*1","v":0},{"$f":"(CR2<=$G$3)*1","v":0},{"$f":"(CS2<=$G$3)*1","v":0},{"$f":"(CT2<=$G$3)*1","v":0},{"$f":"(CU2<=$G$3)*1","v":0},{"$f":"(CV2<=$G$3)*1","v":0},{"$f":"(CW2<=$G$3)*1","v":0},{"$f":"(CX2<=$G$3)*1","v":0},{"$f":"(CY2<=$G$3)*1","v":0},{"$f":"(CZ2<=$G$3)*1","v":0},{"$f":"(DA2<=$G$3)*1","v":0},{"$f":"(DB2<=$G$3)*1","v":0},{"$f":"(DC2<=$G$3)*1","v":0},{"$f":"(DD2<=$G$3)*1","v":0},{"$f":"(DE2<=$G$3)*1","v":0},{"$f":"(DF2<=$G$3)*1","v":0},{"$f":"(DG2<=$G$3)*1","v":0},{"$f":"(DH2<=$G$3)*1","v":0},{"$f":"(DI2<=$G$3)*1","v":0},{"$f":"(DJ2<=$G$3)*1","v":0},{"$f":"(DK2<=$G$3)*1","v":0},{"$f":"(DL2<=$G$3)*1","v":0},{"$f":"(DM2<=$G$3)*1","v":0},{"$f":"(DN2<=$G$3)*1","v":0},{"$f":"(DO2<=$G$3)*1","v":0},{"$f":"(DP2<=$G$3)*1","v":0},{"$f":"(DQ2<=$G$3)*1","v":0},{"$f":"(DR2<=$G$3)*1","v":0},{"$f":"(DS2<=$G$3)*1","v":0},{"$f":"(DT2<=$G$3)*1","v":0},{"$f":"(DU2<=$G$3)*1","v":0},{"$f":"(DV2<=$G$3)*1","v":0},{"$f":"(DW2<=$G$3)*1","v":0},{"$f":"(DX2<=$G$3)*1","v":0},{"$f":"(DY2<=$G$3)*1","v":0},{"$f":"(DZ2<=$G$3)*1","v":0},{"$f":"(EA2<=$G$3)*1","v":0},{"$f":"(EB2<=$G$3)*1","v":0},{"$f":"(EC2<=$G$3)*1","v":0},{"$f":"(ED2<=$G$3)*1","v":0},{"$f":"(EE2<=$G$3)*1","v":0},{"$f":"(EF2<=$G$3)*1","v":0},{"$f":"(EG2<=$G$3)*1","v":0},{"$f":"(EH2<=$G$3)*1","v":0},{"$f":"(EI2<=$G$3)*1","v":0},{"$f":"(EJ2<=$G$3)*1","v":0},{"$f":"(EK2<=$G$3)*1","v":0},{"$f":"(EL2<=$G$3)*1","v":0},{"$f":"(EM2<=$G$3)*1","v":0},{"$f":"(EN2<=$G$3)*1","v":0},{"$f":"(EO2<=$G$3)*1","v":0},{"$f":"(EP2<=$G$3)*1","v":0},{"$f":"(EQ2<=$G$3)*1","v":0},{"$f":"(ER2<=$G$3)*1","v":0},{"$f":"(ES2<=$G$3)*1","v":0},{"$f":"(ET2<=$G$3)*1","v":0},{"$f":"(EU2<=$G$3)*1","v":0},{"$f":"(EV2<=$G$3)*1","v":0},{"$f":"(EW2<=$G$3)*1","v":0},{"$f":"(EX2<=$G$3)*1","v":0},{"$f":"(EY2<=$G$3)*1","v":0},{"$f":"(EZ2<=$G$3)*1","v":0},{"$f":"(FA2<=$G$3)*1","v":0},{"$f":"(FB2<=$G$3)*1","v":0},{"$f":"(FC2<=$G$3)*1","v":0},{"$f":"(FD2<=$G$3)*1","v":0},{"$f":"(FE2<=$G$3)*1","v":0},{"$f":"(FF2<=$G$3)*1","v":0},{"$f":"(FG2<=$G$3)*1","v":0},{"$f":"(FH2<=$G$3)*1","v":0},{"$f":"(FI2<=$G$3)*1","v":0},{"$f":"(FJ2<=$G$3)*1","v":0},{"$f":"(FK2<=$G$3)*1","v":0},{"$f":"(FL2<=$G$3)*1","v":0},{"$f":"(FM2<=$G$3)*1","v":0},{"$f":"(FN2<=$G$3)*1","v":0},{"$f":"(FO2<=$G$3)*1","v":0},{"$f":"(FP2<=$G$3)*1","v":0},{"$f":"(FQ2<=$G$3)*1","v":0},{"$f":"(FR2<=$G$3)*1","v":0},{"$f":"(FS2<=$G$3)*1","v":0},{"$f":"(FT2<=$G$3)*1","v":0},{"$f":"(FU2<=$G$3)*1","v":0},{"$f":"(FV2<=$G$3)*1","v":0},{"$f":"(FW2<=$G$3)*1","v":0},{"$f":"(FX2<=$G$3)*1","v":0},{"$f":"(FY2<=$G$3)*1","v":0},{"$f":"(FZ2<=$G$3)*1","v":0},{"$f":"(GA2<=$G$3)*1","v":0},{"$f":"(GB2<=$G$3)*1","v":0},{"$f":"(GC2<=$G$3)*1","v":0},{"$f":"(GD2<=$G$3)*1","v":0},{"$f":"(GE2<=$G$3)*1","v":0},{"$f":"(GF2<=$G$3)*1","v":0},{"$f":"(GG2<=$G$3)*1","v":0},{"$f":"(GH2<=$G$3)*1","v":0},{"$f":"(GI2<=$G$3)*1","v":0},{"$f":"(GJ2<=$G$3)*1","v":0},{"$f":"(GK2<=$G$3)*1","v":0},{"$f":"(GL2<=$G$3)*1","v":0},{"$f":"(GM2<=$G$3)*1","v":0},{"$f":"(GN2<=$G$3)*1","v":0},{"$f":"(GO2<=$G$3)*1","v":0},{"$f":"(GP2<=$G$3)*1","v":0},{"$f":"(GQ2<=$G$3)*1","v":0},{"$f":"(GR2<=$G$3)*1","v":0},{"$f":"(GS2<=$G$3)*1","v":0},{"$f":"(GT2<=$G$3)*1","v":0},{"$f":"(GU2<=$G$3)*1","v":0},{"$f":"(GV2<=$G$3)*1","v":0},{"$f":"(GW2<=$G$3)*1","v":0},{"$f":"(GX2<=$G$3)*1","v":0},{"$f":"(GY2<=$G$3)*1","v":0},{"$f":"(GZ2<=$G$3)*1","v":0},{"$f":"(HA2<=$G$3)*1","v":0}]
[null,"Months per period",null,null,null,null,{"$f":"Assumptions!E13","v":1},{"$f":"Assumptions!E14","v":3},null,{"$f":"IF(J3,$G$4,$H$4)","v":1},{"$f":"IF(K3,$G$4,$H$4)","v":1},{"$f":"IF(L3,$G$4,$H$4)","v":1},{"$f":"IF(M3,$G$4,$H$4)","v":1},{"$f":"IF(N3,$G$4,$H$4)","v":1},{"$f":"IF(O3,$G$4,$H$4)","v":1},{"$f":"IF(P3,$G$4,$H$4)","v":1},{"$f":"IF(Q3,$G$4,$H$4)","v":1},{"$f":"IF(R3,$G$4,$H$4)","v":1},{"$f":"IF(S3,$G$4,$H$4)","v":1},{"$f":"IF(T3,$G$4,$H$4)","v":1},{"$f":"IF(U3,$G$4,$H$4)","v":1},{"$f":"IF(V3,$G$4,$H$4)","v":1},{"$f":"IF(W3,$G$4,$H$4)","v":1},{"$f":"IF(X3,$G$4,$H$4)","v":1},{"$f":"IF(Y3,$G$4,$H$4)","v":1},{"$f":"IF(Z3,$G$4,$H$4)","v":1},{"$f":"IF(AA3,$G$4,$H$4)","v":1},{"$f":"IF(AB3,$G$4,$H$4)","v":1},{"$f":"IF(AC3,$G$4,$H$4)","v":1},{"$f":"IF(AD3,$G$4,$H$4)","v":1},{"$f":"IF(AE3,$G$4,$H$4)","v":1},{"$f":"IF(AF3,$G$4,$H$4)","v":1},{"$f":"IF(AG3,$G$4,$H$4)","v":1},{"$f":"IF(AH3,$G$4,$H$4)","v":1},{"$f":"IF(AI3,$G$4,$H$4)","v":1},{"$f":"IF(AJ3,$G$4,$H$4)","v":1},{"$f":"IF(AK3,$G$4,$H$4)","v":1},{"$f":"IF(AL3,$G$4,$H$4)","v":1},{"$f":"IF(AM3,$G$4,$H$4)","v":1},{"$f":"IF(AN3,$G$4,$H$4)","v":1},{"$f":"IF(AO3,$G$4,$H$4)","v":1},{"$f":"IF(AP3,$G$4,$H$4)","v":1},{"$f":"IF(AQ3,$G$4,$H$4)","v":1},{"$f":"IF(AR3,$G$4,$H$4)","v":1},{"$f":"IF(AS3,$G$4,$H$4)","v":3},{"$f":"IF(AT3,$G$4,$H$4)","v":3},{"$f":"IF(AU3,$G$4,$H$4)","v":3},{"$f":"IF(AV3,$G$4,$H$4)","v":3},{"$f":"IF(AW3,$G$4,$H$4)","v":3},{"$f":"IF(AX3,$G$4,$H$4)","v":3},{"$f":"IF(AY3,$G$4,$H$4)","v":3},{"$f":"IF(AZ3,$G$4,$H$4)","v":3},{"$f":"IF(BA3,$G$4,$H$4)","v":3},{"$f":"IF(BB3,$G$4,$H$4)","v":3},{"$f":"IF(BC3,$G$4,$H$4)","v":3},{"$f":"IF(BD3,$G$4,$H$4)","v":3},{"$f":"IF(BE3,$G$4,$H$4)","v":3},{"$f":"IF(BF3,$G$4,$H$4)","v":3},{"$f":"IF(BG3,$G$4,$H$4)","v":3},{"$f":"IF(BH3,$G$4,$H$4)","v":3},{"$f":"IF(BI3,$G$4,$H$4)","v":3},{"$f":"IF(BJ3,$G$4,$H$4)","v":3},{"$f":"IF(BK3,$G$4,$H$4)","v":3},{"$f":"IF(BL3,$G$4,$H$4)","v":3},{"$f":"IF(BM3,$G$4,$H$4)","v":3},{"$f":"IF(BN3,$G$4,$H$4)","v":3},{"$f":"IF(BO3,$G$4,$H$4)","v":3},{"$f":"IF(BP3,$G$4,$H$4)","v":3},{"$f":"IF(BQ3,$G$4,$H$4)","v":3},{"$f":"IF(BR3,$G$4,$H$4)","v":3},{"$f":"IF(BS3,$G$4,$H$4)","v":3},{"$f":"IF(BT3,$G$4,$H$4)","v":3},{"$f":"IF(BU3,$G$4,$H$4)","v":3},{"$f":"IF(BV3,$G$4,$H$4)","v":3},{"$f":"IF(BW3,$G$4,$H$4)","v":3},{"$f":"IF(BX3,$G$4,$H$4)","v":3},{"$f":"IF(BY3,$G$4,$H$4)","v":3},{"$f":"IF(BZ3,$G$4,$H$4)","v":3},{"$f":"IF(CA3,$G$4,$H$4)","v":3},{"$f":"IF(CB3,$G$4,$H$4)","v":3},{"$f":"IF(CC3,$G$4,$H$4)","v":3},{"$f":"IF(CD3,$G$4,$H$4)","v":3},{"$f":"IF(CE3,$G$4,$H$4)","v":3},{"$f":"IF(CF3,$G$4,$H$4)","v":3},{"$f":"IF(CG3,$G$4,$H$4)","v":3},{"$f":"IF(CH3,$G$4,$H$4)","v":3},{"$f":"IF(CI3,$G$4,$H$4)","v":3},{"$f":"IF(CJ3,$G$4,$H$4)","v":3},{"$f":"IF(CK3,$G$4,$H$4)","v":3},{"$f":"IF(CL3,$G$4,$H$4)","v":3},{"$f":"IF(CM3,$G$4,$H$4)","v":3},{"$f":"IF(CN3,$G$4,$H$4)","v":3},{"$f":"IF(CO3,$G$4,$H$4)","v":3},{"$f":"IF(CP3,$G$4,$H$4)","v":3},{"$f":"IF(CQ3,$G$4,$H$4)","v":3},{"$f":"IF(CR3,$G$4,$H$4)","v":3},{"$f":"IF(CS3,$G$4,$H$4)","v":3},{"$f":"IF(CT3,$G$4,$H$4)","v":3},{"$f":"IF(CU3,$G$4,$H$4)","v":3},{"$f":"IF(CV3,$G$4,$H$4)","v":3},{"$f":"IF(CW3,$G$4,$H$4)","v":3},{"$f":"IF(CX3,$G$4,$H$4)","v":3},{"$f":"IF(CY3,$G$4,$H$4)","v":3},{"$f":"IF(CZ3,$G$4,$H$4)","v":3},{"$f":"IF(DA3,$G$4,$H$4)","v":3},{"$f":"IF(DB3,$G$4,$H$4)","v":3},{"$f":"IF(DC3,$G$4,$H$4)","v":3},{"$f":"IF(DD3,$G$4,$H$4)","v":3},{"$f":"IF(DE3,$G$4,$H$4)","v":3},{"$f":"IF(DF3,$G$4,$H$4)","v":3},{"$f":"IF(DG3,$G$4,$H$4)","v":3},{"$f":"IF(DH3,$G$4,$H$4)","v":3},{"$f":"IF(DI3,$G$4,$H$4)","v":3},{"$f":"IF(DJ3,$G$4,$H$4)","v":3},{"$f":"IF(DK3,$G$4,$H$4)","v":3},{"$f":"IF(DL3,$G$4,$H$4)","v":3},{"$f":"IF(DM3,$G$4,$H$4)","v":3},{"$f":"IF(DN3,$G$4,$H$4)","v":3},{"$f":"IF(DO3,$G$4,$H$4)","v":3},{"$f":"IF(DP3,$G$4,$H$4)","v":3},{"$f":"IF(DQ3,$G$4,$H$4)","v":3},{"$f":"IF(DR3,$G$4,$H$4)","v":3},{"$f":"IF(DS3,$G$4,$H$4)","v":3},{"$f":"IF(DT3,$G$4,$H$4)","v":3},{"$f":"IF(DU3,$G$4,$H$4)","v":3},{"$f":"IF(DV3,$G$4,$H$4)","v":3},{"$f":"IF(DW3,$G$4,$H$4)","v":3},{"$f":"IF(DX3,$G$4,$H$4)","v":3},{"$f":"IF(DY3,$G$4,$H$4)","v":3},{"$f":"IF(DZ3,$G$4,$H$4)","v":3},{"$f":"IF(EA3,$G$4,$H$4)","v":3},{"$f":"IF(EB3,$G$4,$H$4)","v":3},{"$f":"IF(EC3,$G$4,$H$4)","v":3},{"$f":"IF(ED3,$G$4,$H$4)","v":3},{"$f":"IF(EE3,$G$4,$H$4)","v":3},{"$f":"IF(EF3,$G$4,$H$4)","v":3},{"$f":"IF(EG3,$G$4,$H$4)","v":3},{"$f":"IF(EH3,$G$4,$H$4)","v":3},{"$f":"IF(EI3,$G$4,$H$4)","v":3},{"$f":"IF(EJ3,$G$4,$H$4)","v":3},{"$f":"IF(EK3,$G$4,$H$4)","v":3},{"$f":"IF(EL3,$G$4,$H$4)","v":3},{"$f":"IF(EM3,$G$4,$H$4)","v":3},{"$f":"IF(EN3,$G$4,$H$4)","v":3},{"$f":"IF(EO3,$G$4,$H$4)","v":3},{"$f":"IF(EP3,$G$4,$H$4)","v":3},{"$f":"IF(EQ3,$G$4,$H$4)","v":3},{"$f":"IF(ER3,$G$4,$H$4)","v":3},{"$f":"IF(ES3,$G$4,$H$4)","v":3},{"$f":"IF(ET3,$G$4,$H$4)","v":3},{"$f":"IF(EU3,$G$4,$H$4)","v":3},{"$f":"IF(EV3,$G$4,$H$4)","v":3},{"$f":"IF(EW3,$G$4,$H$4)","v":3},{"$f":"IF(EX3,$G$4,$H$4)","v":3},{"$f":"IF(EY3,$G$4,$H$4)","v":3},{"$f":"IF(EZ3,$G$4,$H$4)","v":3},{"$f":"IF(FA3,$G$4,$H$4)","v":3},{"$f":"IF(FB3,$G$4,$H$4)","v":3},{"$f":"IF(FC3,$G$4,$H$4)","v":3},{"$f":"IF(FD3,$G$4,$H$4)","v":3},{"$f":"IF(FE3,$G$4,$H$4)","v":3},{"$f":"IF(FF3,$G$4,$H$4)","v":3},{"$f":"IF(FG3,$G$4,$H$4)","v":3},{"$f":"IF(FH3,$G$4,$H$4)","v":3},{"$f":"IF(FI3,$G$4,$H$4)","v":3},{"$f":"IF(FJ3,$G$4,$H$4)","v":3},{"$f":"IF(FK3,$G$4,$H$4)","v":3},{"$f":"IF(FL3,$G$4,$H$4)","v":3},{"$f":"IF(FM3,$G$4,$H$4)","v":3},{"$f":"IF(FN3,$G$4,$H$4)","v":3},{"$f":"IF(FO3,$G$4,$H$4)","v":3},{"$f":"IF(FP3,$G$4,$H$4)","v":3},{"$f":"IF(FQ3,$G$4,$H$4)","v":3},{"$f":"IF(FR3,$G$4,$H$4)","v":3},{"$f":"IF(FS3,$G$4,$H$4)","v":3},{"$f":"IF(FT3,$G$4,$H$4)","v":3},{"$f":"IF(FU3,$G$4,$H$4)","v":3},{"$f":"IF(FV3,$G$4,$H$4)","v":3},{"$f":"IF(FW3,$G$4,$H$4)","v":3},{"$f":"IF(FX3,$G$4,$H$4)","v":3},{"$f":"IF(FY3,$G$4,$H$4)","v":3},{"$f":"IF(FZ3,$G$4,$H$4)","v":3},{"$f":"IF(GA3,$G$4,$H$4)","v":3},{"$f":"IF(GB3,$G$4,$H$4)","v":3},{"$f":"IF(GC3,$G$4,$H$4)","v":3},{"$f":"IF(GD3,$G$4,$H$4)","v":3},{"$f":"IF(GE3,$G$4,$H$4)","v":3},{"$f":"IF(GF3,$G$4,$H$4)","v":3},{"$f":"IF(GG3,$G$4,$H$4)","v":3},{"$f":"IF(GH3,$G$4,$H$4)","v":3},{"$f":"IF(GI3,$G$4,$H$4)","v":3},{"$f":"IF(GJ3,$G$4,$H$4)","v":3},{"$f":"IF(GK3,$G$4,$H$4)","v":3},{"$f":"IF(GL3,$G$4,$H$4)","v":3},{"$f":"IF(GM3,$G$4,$H$4)","v":3},{"$f":"IF(GN3,$G$4,$H$4)","v":3},{"$f":"IF(GO3,$G$4,$H$4)","v":3},{"$f":"IF(GP3,$G$4,$H$4)","v":3},{"$f":"IF(GQ3,$G$4,$H$4)","v":3},{"$f":"IF(GR3,$G$4,$H$4)","v":3},{"$f":"IF(GS3,$G$4,$H$4)","v":3},{"$f":"IF(GT3,$G$4,$H$4)","v":3},{"$f":"IF(GU3,$G$4,$H$4)","v":3},{"$f":"IF(GV3,$G$4,$H$4)","v":3},{"$f":"IF(GW3,$G$4,$H$4)","v":3},{"$f":"IF(GX3,$G$4,$H$4)","v":3},{"$f":"IF(GY3,$G$4,$H$4)","v":3},{"$f":"IF(GZ3,$G$4,$H$4)","v":3},{"$f":"IF(HA3,$G$4,$H$4)","v":3}]
[null,"Start per period",null,null,null,null,null,null,null,{"$f":"I6+1","v":"2020-04-01"},"2020-05-01","2020-06-01","2020-07-01","2020-08-01","2020-09-01","2020-10-01","2020-11-01","2020-12-01","2021-01-01","2021-02-01","2021-03-01","2021-04-01","2021-05-01","2021-06-01","2021-07-01","2021-08-01","2021-09-01","2021-10-01","2021-11-01","2021-12-01","2022-01-01","2022-02-01","2022-03-01","2022-04-01","2022-05-01","2022-06-01","2022-07-01","2022-08-01","2022-09-01","2022-10-01","2022-11-01",{"$f":"AO6+1","v":"2022-12-01"},"2023-01-01","2023-02-01","2023-03-01","2023-06-01","2023-09-01","2023-12-01","2024-03-01","2024-06-01","2024-09-01","2024-12-01","2025-03-01","2025-06-01","2025-09-01","2025-12-01","2026-03-01","2026-06-01","2026-09-01","2026-12-01","2027-03-01","2027-06-01","2027-09-01","2027-12-01","2028-03-01","2028-06-01","2028-09-01","2028-12-01","2029-03-01","2029-06-01","2029-09-01","2029-12-01","2030-03-01",{"$f":"BU6+1","v":"2030-06-01"},"2030-09-01","2030-12-01","2031-03-01","2031-06-01","2031-09-01","2031-12-01","2032-03-01","2032-06-01","2032-09-01","2032-12-01","2033-03-01","2033-06-01","2033-09-01","2033-12-01","2034-03-01","2034-06-01","2034-09-01","2034-12-01","2035-03-01","2035-06-01","2035-09-01","2035-12-01","2036-03-01","2036-06-01","2036-09-01","2036-12-01","2037-03-01","2037-06-01","2037-09-01","2037-12-01","2038-03-01",{"$f":"DA6+1","v":"2038-06-01"},"2038-09-01","2038-12-01","2039-03-01","2039-06-01","2039-09-01","2039-12-01","2040-03-01","2040-06-01","2040-09-01","2040-12-01","2041-03-01","2041-06-01","2041-09-01","2041-12-01","2042-03-01","2042-06-01","2042-09-01","2042-12-01","2043-03-01","2043-06-01","2043-09-01","2043-12-01","2044-03-01","2044-06-01","2044-09-01","2044-12-01","2045-03-01","2045-06-01","2045-09-01","2045-12-01","2046-03-01",{"$f":"EG6+1","v":"2046-06-01"},"2046-09-01","2046-12-01","2047-03-01","2047-06-01","2047-09-01","2047-12-01","2048-03-01","2048-06-01","2048-09-01","2048-12-01","2049-03-01","2049-06-01","2049-09-01","2049-12-01","2050-03-01","2050-06-01","2050-09-01","2050-12-01","2051-03-01","2051-06-01","2051-09-01","2051-12-01","2052-03-01","2052-06-01","2052-09-01","2052-12-01","2053-03-01","2053-06-01","2053-09-01","2053-12-01","2054-03-01",{"$f":"FM6+1","v":"2054-06-01"},"2054-09-01","2054-12-01","2055-03-01","2055-06-01","2055-09-01","2055-12-01","2056-03-01","2056-06-01","2056-09-01","2056-12-01","2057-03-01","2057-06-01","2057-09-01","2057-12-01","2058-03-01","2058-06-01","2058-09-01","2058-12-01","2059-03-01","2059-06-01","2059-09-01","2059-12-01","2060-03-01","2060-06-01","2060-09-01","2060-12-01","2061-03-01","2061-06-01","2061-09-01","2061-12-01","2062-03-01",{"$f":"GS6+1","v":"2062-06-01"},"2062-09-01","2062-12-01","2063-03-01","2063-06-01","2063-09-01","2063-12-01","2064-03-01"]
[null,"End per period",null,null,null,null,null,null,{"$f":"Assumptions!E7-1","v":"2020-03-31"},{"$f":"EDATE(J5,J4)-1","v":"2020-04-30"},"2020-05-31","2020-06-30","2020-07-31","2020-08-31","2020-09-30","2020-10-31","2020-11-30","2020-12-31","2021-01-31","2021-02-28","2021-03-31","2021-04-30","2021-05-31","2021-06-30","2021-07-31","2021-08-31","2021-09-30","2021-10-31","2021-11-30","2021-12-31","2022-01-31","2022-02-28","2022-03-31","2022-04-30","2022-05-31","2022-06-30","2022-07-31","2022-08-31","2022-09-30","2022-10-31","2022-11-30",{"$f":"EDATE(AP5,AP4)-1","v":"2022-12-31"},"2023-01-31","2023-02-28","2023-05-31","2023-08-31","2023-11-30","2024-02-29","2024-05-31","2024-08-31","2024-11-30","2025-02-28","2025-05-31","2025-08-31","2025-11-30","2026-02-28","2026-05-31","2026-08-31","2026-11-30","2027-02-28","2027-05-31","2027-08-31","2027-11-30","2028-02-29","2028-05-31","2028-08-31","2028-11-30","2029-02-28","2029-05-31","2029-08-31","2029-11-30","2030-02-28","2030-05-31",{"$f":"EDATE(BV5,BV4)-1","v":"2030-08-31"},"2030-11-30","2031-02-28","2031-05-31","2031-08-31","2031-11-30","2032-02-29","2032-05-31","2032-08-31","2032-11-30","2033-02-28","2033-05-31","2033-08-31","2033-11-30","2034-02-28","2034-05-31","2034-08-31","2034-11-30","2035-02-28","2035-05-31","2035-08-31","2035-11-30","2036-02-29","2036-05-31","2036-08-31","2036-11-30","2037-02-28","2037-05-31","2037-08-31","2037-11-30","2038-02-28","2038-05-31",{"$f":"EDATE(DB5,DB4)-1","v":"2038-08-31"},"2038-11-30","2039-02-28","2039-05-31","2039-08-31","2039-11-30","2040-02-29","2040-05-31","2040-08-31","2040-11-30","2041-02-28","2041-05-31","2041-08-31","2041-11-30","2042-02-28","2042-05-31","2042-08-31","2042-11-30","2043-02-28","2043-05-31","2043-08-31","2043-11-30","2044-02-29","2044-05-31","2044-08-31","2044-11-30","2045-02-28","2045-05-31","2045-08-31","2045-11-30","2046-02-28","2046-05-31",{"$f":"EDATE(EH5,EH4)-1","v":"2046-08-31"},"2046-11-30","2047-02-28","2047-05-31","2047-08-31","2047-11-30","2048-02-29","2048-05-31","2048-08-31","2048-11-30","2049-02-28","2049-05-31","2049-08-31","2049-11-30","2050-02-28","2050-05-31","2050-08-31","2050-11-30","2051-02-28","2051-05-31","2051-08-31","2051-11-30","2052-02-29","2052-05-31","2052-08-31","2052-11-30","2053-02-28","2053-05-31","2053-08-31","2053-11-30","2054-02-28","2054-05-31",{"$f":"EDATE(FN5,FN4)-1","v":"2054-08-31"},"2054-11-30","2055-02-28","2055-05-31","2055-08-31","2055-11-30","2056-02-29","2056-05-31","2056-08-31","2056-11-30","2057-02-28","2057-05-31","2057-08-31","2057-11-30","2058-02-28","2058-05-31","2058-08-31","2058-11-30","2059-02-28","2059-05-31","2059-08-31","2059-11-30","2060-02-29","2060-05-31","2060-08-31","2060-11-30","2061-02-28","2061-05-31","2061-08-31","2061-11-30","2062-02-28","2062-05-31",{"$f":"EDATE(GT5,GT4)-1","v":"2062-08-31"},"2062-11-30","2063-02-28","2063-05-31","2063-08-31","2063-11-30","2064-02-29","2064-05-31"]
{"$rows_left_out":150}
{"sheet":"Annual Model","index":5,"n_rows":136,"n_cols":36,"rows_kept":136,"cut":false,"hidden":false,"merged":[]}
["TOC","Annual Model",null,null,null,null,1,2,3,4,5,6,7,8,9,10,11,12,13,14,15,16,17,18,19,20,21,22,23,24,25,26,27,28,29,30]
[null,null,null,null,null,null,2020,{"$f":"G2+1","v":2021},{"$f":"H2+1","v":2022},2023,2024,2025,2026,2027,2028,2029,2030,2031,2032,2033,2034,2035,2036,2037,2038,2039,2040,2041,2042,2043,2044,2045,2046,2047,2048,2049]
[]
[]
["Plant Operations:"]
[null,"Capacity",null,null,"MW",null,{"$f":"SUMIF('Financial Model'!$10:$10,'Annual Model'!G$2,'Financial Model'!13:13)/12","v":0},{"$f":"SUMIF('Financial Model'!$10:$10,'Annual Model'!H$2,'Financial Model'!13:13)/12","v":0},{"$f":"SUMIF('Financial Model'!$10:$10,'Annual Model'!I$2,'Financial Model'!13:13)/12","v":0},{"$f":"SUMIF('Financial Model'!$10:$10,'Annual Model'!J$2,'Financial Model'!13:13)/12","v":75},{"$f":"SUMIF('Financial Model'!$10:$10,'Annual Model'!K$2,'Financial Model'!13:13)/12","v":100},{"$f":"SUMIF('Financial Model'!$10:$10,'Annual Model'!L$2,'Financial Model'!13:13)/12","v":100},{"$f":"SUMIF('Financial Model'!$10:$10,'Annual Model'!M$2,'Financial Model'!13:13)/12","v":100},{"$f":"SUMIF('Financial Model'!$10:$10,'Annual Model'!N$2,'Financial Model'!13:13)/12","v":100},{"$f":"SUMIF('Financial Model'!$10:$10,'Annual Model'!O$2,'Financial Model'!13:13)/12","v":100},{"$f":"SUMIF('Financial Model'!$10:$10,'Annual Model'!P$2,'Financial Model'!13:13)/12","v":100},{"$f":"SUMIF('Financial Model'!$10:$10,'Annual Model'!Q$2,'Financial Model'!13:13)/12","v":100},{"$f":"SUMIF('Financial Model'!$10:$10,'Annual Model'!R$2,'Financial Model'!13:13)/12","v":100},{"$f":"SUMIF('Financial Model'!$10:$10,'Annual Model'!S$2,'Financial Model'!13:13)/12","v":100},{"$f":"SUMIF('Financial Model'!$10:$10,'Annual Model'!T$2,'Financial Model'!13:13)/12","v":100},{"$f":"SUMIF('Financial Model'!$10:$10,'Annual Model'!U$2,'Financial Model'!13:13)/12","v":100},{"$f":"SUMIF('Financial Model'!$10:$10,'Annual Model'!V$2,'Financial Model'!13:13)/12","v":100},{"$f":"SUMIF('Financial Model'!$10:$10,'Annual Model'!W$2,'Financial Model'!13:13)/12","v":100},{"$f":"SUMIF('Financial Model'!$10:$10,'Annual Model'!X$2,'Financial Model'!13:13)/12","v":100},{"$f":"SUMIF('Financial Model'!$10:$10,'Annual Model'!Y$2,'Financial Model'!13:13)/12","v":100},{"$f":"SUMIF('Financial Model'!$10:$10,'Annual Model'!Z$2,'Financial Model'!13:13)/12","v":100},{"$f":"SUMIF('Financial Model'!$10:$10,'Annual Model'!AA$2,'Financial Model'!13:13)/12","v":100},{"$f":"SUMIF('Financial Model'!$10:$10,'Annual Model'!AB$2,'Financial Model'!13:13)/12","v":100},{"$f":"SUMIF('Financial Model'!$10:$10,'Annual Model'!AC$2,'Financial Model'!13:13)/12","v":100},{"$f":"SUMIF('Financial Model'!$10:$10,'Annual Model'!AD$2,'Financial Model'!13:13)/12","v":25},{"$f":"SUMIF('Financial Model'!$10:$10,'Annual Model'!AE$2,'Financial Model'!13:13)/12","v":0},{"$f":"SUMIF('Financial Model'!$10:$10,'Annual Model'!AF$2,'Financial Model'!13:13)/12","v":0},{"$f":"SUMIF('Financial Model'!$10:$10,'Annual Model'!AG$2,'Financial Model'!13:13)/12","v":0},{"$f":"SUMIF('Financial Model'!$10:$10,'Annual Model'!AH$2,'Financial Model'!13:13)/12","v":0},{"$f":"SUMIF('Financial Model'!$10:$10,'Annual Model'!AI$2,'Financial Model'!13:13)/12","v":0},{"$f":"SUMIF('Financial Model'!$10:$10,'Annual Model'!AJ$2,'Financial Model'!13:13)/12","v":0}]
{"$rows_left_out":130}