{"text_format":"1","workbook":"xlsx","n_sheets":8,"sheets":["Summary","Control","Scenarios","Amazon Financial Model","Valuation","Cap Exp and Depreciation","Equations","AMZN Stock Price"],"not_rendered":{"charts":5,"images":0,"macros":1,"external_links":1,"defined_names":29,"comments":0,"pivot_tables":0},"unopened":[],"bounds":{"document_bytes":16777216,"sheet_cells":100000,"rows_first":2000,"rows_last":500,"rows_between":2000,"halvings":0,"cell_chars":16384,"cell_head_chars":4096},"cells_cut":0,"cells_raw":0,"read":"whole","date_system":"1900"}

{"sheet":"Summary","index":0,"n_rows":31,"n_cols":8,"rows_kept":31,"cut":false,"hidden":false,"merged":[]}
[]
[null,null,"Revenue Growth"]
[null,null,"COGS Percent"]
[null,null,null,null,null,null,"Period","Growth"]
[null,null,null,null,null,null,"2020-2024",{"$f":"Scenarios!F28","v":0}]
[null,null,"Explict Year",null,{"$f":"Valuation!E3","v":2026},null,"2025-2029",{"$f":"Scenarios!G28","v":0}]
[null,null,"Cap Exp Factor",null,{"$f":"'Amazon Financial Model'!F236","v":1},null,"2030-2034",{"$f":"Scenarios!H28","v":0}]
[null,null,"Growth in Constant Case",null,{"$f":"Scenarios!$F$24","v":0.14000000000000001},null,"2030-Term",{"$f":"Scenarios!I28","v":0}]
[null,null,"COGS in Constant Case",null,{"$f":"Scenarios!$F$60","v":0.52031714568880083}]
[null,null,null,null,null,null,"Period","Margin"]
[null,null,"WACC",null,{"$f":"Scenarios!F7","v":0.09},null,"2020-2024",{"$f":"1-Scenarios!F64","v":0.47968285431119917}]
[null,null,"Terminal Growth",null,{"$f":"Scenarios!F8","v":0.04},null,"2025-2029",{"$f":"1-Scenarios!G64","v":0.47968285431119917}]
[null,null,"Terminal ROIC",null,{"$f":"Scenarios!F9","v":0.18},null,"2030-2034",{"$f":"1-Scenarios!H64","v":0.47968285431119917}]
[null,null,"Terminal EV/EBITDA",null,{"$f":"Scenarios!F11","v":12},null,"2030-Term",{"$f":"1-Scenarios!I64","v":0.47968285431119917}]
[]
[null,null,null,null,"Growth","EV/EBITDA","Value Driver","Value Driver"]
[null,null,null,null,null,null,"Incremental","Direct"]
[null,null,"Value per Share",null,{"$f":"Valuation!E103","v":{"$error":"#DIV/0!"}},{"$f":"Valuation!E121","v":{"$error":"#DIV/0!"}},{"$f":"Valuation!E139","v":{"$error":"#DIV/0!"}},{"$f":"Valuation!E157","v":{"$error":"#DIV/0!"}}]
[null,null,"Current Market ",null,{"$f":"Valuation!E93","v":2410.219971},{"$f":"E19","v":2410.219971},{"$f":"F19","v":2410.219971},2410.219971]
[]
{"$rows_left_out":12}
{"sheet":"Control","index":1,"n_rows":15,"n_cols":11,"rows_kept":15,"cut":false,"hidden":false,"merged":[]}
[]
[]
[null,null,"Scenario",1]
[]
[null,null,null,"Revenue Growth","Margin","Cap Exp to Depreciation","COGS Constant","WACC","Growth","ROIC"]
[null,null,"Base Case",1,4,1,0.52500000000000002,6.5000000000000002E-2,0.04,0.18]
[null,null,"Low Case",3,4,1,0.54,6.5000000000000002E-2,0.04,0.18]
[null,null,"High Case",2,4,1,0.5,6.5000000000000002E-2,0.04,0.18]
[null,null,"Revenue Sensitivity",3,4,1,0.52500000000000002,6.5000000000000002E-2,0.04,0.18]
[null,null,"Low Valuation",1,4,1,0.52500000000000002,0.08,0.02,0.15]
[null,null,"High Valuation",1,4,1,0.52500000000000002,0.06,0.05,0.2]
[]
[null,null,{"$f":"INDEX(C6:C11,$D$3)","v":"Base Case"},{"$f":"INDEX(D6:D11,$D$3)","v":1},{"$f":"INDEX(E6:E11,$D$3)","v":4},{"$f":"INDEX(F6:F11,$D$3)","v":1},{"$f":"INDEX(G6:G11,$D$3)","v":0.52500000000000002},{"$f":"INDEX(H6:H11,$D$3)","v":6.5000000000000002E-2},{"$f":"INDEX(I6:I11,$D$3)","v":0.04},{"$f":"INDEX(J6:J11,$D$3)","v":0.18},"Index"]
[]
[null,null,"Base Case",1,4,100,525,65,40,18,"Applied"]

{"sheet":"Scenarios","index":2,"n_rows":120,"n_cols":37,"rows_kept":120,"cut":false,"hidden":false,"merged":[]}
[]
[null,"Valuation Assumptions"]
[null,null,"Terminal Period",null,"Years",6,null,12]
[null,null,"Valuation Year",null,"Years",2020]
[null,null,"Terminal Year",null,"Years",{"$f":"F3+F4","v":2026}]
[]
[null,null,"WACC",null,"%",{"$f":"H7/1000","v":0.09},null,90]
[null,null,"Terminal Growth",null,"%",{"$f":"H8/1000","v":0.04},null,{"$f":"Control!I15","v":40}]
[null,null,"Terminal ROIC",null,"%",{"$f":"H9/100","v":0.18},null,18]
[]
[null,null,"Terminal EV/EBITDA Ratio",null,"x",{"$f":"H11","v":12},null,12]
[]
[null,null,"Apply Normalised Terminal Value",null,"Flag",true]
[null,null,"Stable Capital Expenditures to Depreciation",null,"%",{"$f":"LOOKUP(F8,'Cap Exp and Depreciation'!35:35,'Cap Exp and Depreciation'!36:36)","v":false}]
[null,null,"Working Capital to EBITDA Ratio",null,"%",-1.5]
[null,null,"WC Change Factor",null,"Factor",{"$f":"F15*F8/(1+F8)","v":-5.7692307692307689E-2},null,{"$f":"Equations!B13","v":"WC Change Factor =  [WC/EBITDA * Growth]/[1+Growth]"}]
[]
[null,"Revenue Assumptions"]
[null,null,"Revenue Scenario",null,1]
[null,null,null,null,2008,2020,2025,2030,2035]
{"$rows_left_out":101}
{"sheet":"Amazon Financial Model","index":3,"n_rows":352,"n_cols":40,"rows_kept":352,"cut":false,"hidden":false,"merged":[]}
[null,"Year",null,null,"Units","Driver","Sum/Test",2008,2009,2010,2011,2012,2013,2014,2015,2016,2017,2018,2019,2020,2021,2022,2023,2024,2025,2026,2027,2028,2029,2030,2031,2032,2033,2034,2035,2036,2037,2038,2039,2040]
[null,null,"Historic Period",null,null,2019,null,{"$f":"H1<=$F$2","v":true},{"$f":"I1<=$F$2","v":true},true,true,true,true,true,true,true,true,true,true,false,false,false,false,false,false,false,false,false,false,false,false,false,false,false,false,false,false,false,false,false]
[null,null,"Months per Period",null,null,12,3]
[null,"Income Statement"]
[null,null,null,"Net product sales",null,null,null,null,22273,30792,42000,51733,60903,70080,79268,0,0,0,0]
[null,null,null,"Net service sales",null,null,null,null,2236,3412,6077,9360,13549,18908,27738,0,0,0,0]
[null,null,null,"Total net sales",null,null,null,null,24509,34204,48077,61093,74452,88988,107006,135987,177866,232887,280522]
[]
[null,null,null,"Cost of sales",null,null,null,null,18978,26561,37288,45971,54181,62752,71651,88265,111934,139156,165536]
[null,null,null,"Gross profit",null,null,null,null,{"$f":"I7-I9","v":5531},7643,10789,15122,20271,26236,35355,47722,65932,93731,114986]
[null,null,null,"Operating expenses:"]
[null,null,null,"Fulfillment",null,null,null,null,2052,2898,4576,6419,8585,10766,13410,17619,25249,34027,40232]
[null,null,null,"Marketing",null,null,null,null,680,1029,1630,2408,3133,4332,5254,7233,10069,13814,18878]
[null,null,null,"General and administrative",null,null,null,null,328,470,658,896,1129,1552,1747,2432,3674,4336,5203]
[null,null,null,"Technology and content",null,null,null,null,1240,1734,2909,4564,6565,9275,12540,16085,22620,28837,35931]
[null,null,null,"Other operating expense (income), net",null,null,null,null,102,106,154,159,114,133,171,167,214,296,201]
[null,null,null,"Total operating expenses",null,null,null,null,23380,32798,47215,60417,73707,88810,104773,131801,173760,220466,265981]
[null,null,null,"Operating income",null,null,null,null,{"$f":"I7-I17","v":1129},1406,862,676,745,178,2233,4186,4106,12421,14541]
[null,null,null,"Other income (expense), net",null,null,null,null,29,79,76,-80,-136,-118,-256,90,346,-183,203]
[null,null,null,"Interest expense",null,null,null,null,-34,-39,-65,-92,-141,-210,-459,-484,-848,-1417,-1600]
{"$rows_left_out":333}
{"sheet":"Valuation","index":4,"n_rows":166,"n_cols":26,"rows_kept":166,"cut":false,"hidden":false,"merged":[]}
[null,"Timeline"]
[null,null,"Year",null,"Cap Exp",{"$f":"Summary!E7","v":1},null,null,2020,2021,2022,2023,2024,2025,2026,2027,2028,2029,2030,2031,2032,2033,2034,2035,2036,2037]
[null,null,"Explicit Period",null,{"$f":"Scenarios!F5","v":2026},null,null,null,{"$f":"I2<=$E$3","v":true},{"$f":"J2<=$E$3","v":true},true,true,true,true,true,false,false,false,false,false,false,false,false,false,false,false]
[null,null,"Terminal Period",null,{"$f":"Scenarios!F5","v":2026},null,null,null,{"$f":"I2=$E$4","v":false},{"$f":"J2=$E$4","v":false},false,false,false,false,true,false,false,false,false,false,false,false,false,false,false,false]
[]
[null,null,"WACC",null,{"$f":"Scenarios!$F$7","v":0.09}]
[null,null,"Growth Rate",null,{"$f":"Scenarios!$F$8","v":0.04}]
[null,null,"Terminal EV/EBITDA",null,{"$f":"Scenarios!F11","v":12}]
[]
[null,null,"Terminal ROIC",null,{"$f":"Scenarios!F9","v":0.18}]
[]
[null,"Transferred Variables"]
[null,null,"EBITDA",null,null,null,null,null,{"$f":"LOOKUP(I2,'Amazon Financial Model'!1:1,'Amazon Financial Model'!306:306)","v":0},{"$f":"LOOKUP(J2,'Amazon Financial Model'!1:1,'Amazon Financial Model'!306:306)","v":0},{"$f":"LOOKUP(K2,'Amazon Financial Model'!1:1,'Amazon Financial Model'!306:306)","v":0},{"$f":"LOOKUP(L2,'Amazon Financial Model'!1:1,'Amazon Financial Model'!306:306)","v":0},{"$f":"LOOKUP(M2,'Amazon Financial Model'!1:1,'Amazon Financial Model'!306:306)","v":0},{"$f":"LOOKUP(N2,'Amazon Financial Model'!1:1,'Amazon Financial Model'!306:306)","v":0},{"$f":"LOOKUP(O2,'Amazon Financial Model'!1:1,'Amazon Financial Model'!306:306)","v":0},{"$f":"LOOKUP(P2,'Amazon Financial Model'!1:1,'Amazon Financial Model'!306:306)","v":0},{"$f":"LOOKUP(Q2,'Amazon Financial Model'!1:1,'Amazon Financial Model'!306:306)","v":0},{"$f":"LOOKUP(R2,'Amazon Financial Model'!1:1,'Amazon Financial Model'!306:306)","v":0},{"$f":"LOOKUP(S2,'Amazon Financial Model'!1:1,'Amazon Financial Model'!306:306)","v":0},{"$f":"LOOKUP(T2,'Amazon Financial Model'!1:1,'Amazon Financial Model'!306:306)","v":0},{"$f":"LOOKUP(U2,'Amazon Financial Model'!1:1,'Amazon Financial Model'!306:306)","v":0},{"$f":"LOOKUP(V2,'Amazon Financial Model'!1:1,'Amazon Financial Model'!306:306)","v":0},{"$f":"LOOKUP(W2,'Amazon Financial Model'!1:1,'Amazon Financial Model'!306:306)","v":0},{"$f":"LOOKUP(X2,'Amazon Financial Model'!1:1,'Amazon Financial Model'!306:306)","v":0},{"$f":"LOOKUP(Y2,'Amazon Financial Model'!1:1,'Amazon Financial Model'!306:306)","v":0},{"$f":"LOOKUP(Z2,'Amazon Financial Model'!1:1,'Amazon Financial Model'!306:306)","v":0}]
[null,null,"Capital Expenditures",null,null,null,null,null,{"$f":"LOOKUP(I2,'Amazon Financial Model'!1:1,'Amazon Financial Model'!307:307)","v":0},{"$f":"LOOKUP(J2,'Amazon Financial Model'!1:1,'Amazon Financial Model'!307:307)","v":0},{"$f":"LOOKUP(K2,'Amazon Financial Model'!1:1,'Amazon Financial Model'!307:307)","v":0},{"$f":"LOOKUP(L2,'Amazon Financial Model'!1:1,'Amazon Financial Model'!307:307)","v":0},{"$f":"LOOKUP(M2,'Amazon Financial Model'!1:1,'Amazon Financial Model'!307:307)","v":0},{"$f":"LOOKUP(N2,'Amazon Financial Model'!1:1,'Amazon Financial Model'!307:307)","v":0},{"$f":"LOOKUP(O2,'Amazon Financial Model'!1:1,'Amazon Financial Model'!307:307)","v":0},{"$f":"LOOKUP(P2,'Amazon Financial Model'!1:1,'Amazon Financial Model'!307:307)","v":0},{"$f":"LOOKUP(Q2,'Amazon Financial Model'!1:1,'Amazon Financial Model'!307:307)","v":0},{"$f":"LOOKUP(R2,'Amazon Financial Model'!1:1,'Amazon Financial Model'!307:307)","v":0},{"$f":"LOOKUP(S2,'Amazon Financial Model'!1:1,'Amazon Financial Model'!307:307)","v":0},{"$f":"LOOKUP(T2,'Amazon Financial Model'!1:1,'Amazon Financial Model'!307:307)","v":0},{"$f":"LOOKUP(U2,'Amazon Financial Model'!1:1,'Amazon Financial Model'!307:307)","v":0},{"$f":"LOOKUP(V2,'Amazon Financial Model'!1:1,'Amazon Financial Model'!307:307)","v":0},{"$f":"LOOKUP(W2,'Amazon Financial Model'!1:1,'Amazon Financial Model'!307:307)","v":0},{"$f":"LOOKUP(X2,'Amazon Financial Model'!1:1,'Amazon Financial Model'!307:307)","v":0},{"$f":"LOOKUP(Y2,'Amazon Financial Model'!1:1,'Amazon Financial Model'!307:307)","v":0},{"$f":"LOOKUP(Z2,'Amazon Financial Model'!1:1,'Amazon Financial Model'!307:307)","v":0}]
[null,null,"Working Capital Changes",null,null,null,null,null,{"$f":"LOOKUP(I2,'Amazon Financial Model'!1:1,'Amazon Financial Model'!308:308)","v":0},{"$f":"LOOKUP(J2,'Amazon Financial Model'!1:1,'Amazon Financial Model'!308:308)","v":0},{"$f":"LOOKUP(K2,'Amazon Financial Model'!1:1,'Amazon Financial Model'!308:308)","v":0},{"$f":"LOOKUP(L2,'Amazon Financial Model'!1:1,'Amazon Financial Model'!308:308)","v":0},{"$f":"LOOKUP(M2,'Amazon Financial Model'!1:1,'Amazon Financial Model'!308:308)","v":0},{"$f":"LOOKUP(N2,'Amazon Financial Model'!1:1,'Amazon Financial Model'!308:308)","v":0},{"$f":"LOOKUP(O2,'Amazon Financial Model'!1:1,'Amazon Financial Model'!308:308)","v":0},{"$f":"LOOKUP(P2,'Amazon Financial Model'!1:1,'Amazon Financial Model'!308:308)","v":0},{"$f":"LOOKUP(Q2,'Amazon Financial Model'!1:1,'Amazon Financial Model'!308:308)","v":0},{"$f":"LOOKUP(R2,'Amazon Financial Model'!1:1,'Amazon Financial Model'!308:308)","v":0},{"$f":"LOOKUP(S2,'Amazon Financial Model'!1:1,'Amazon Financial Model'!308:308)","v":0},{"$f":"LOOKUP(T2,'Amazon Financial Model'!1:1,'Amazon Financial Model'!308:308)","v":0},{"$f":"LOOKUP(U2,'Amazon Financial Model'!1:1,'Amazon Financial Model'!308:308)","v":0},{"$f":"LOOKUP(V2,'Amazon Financial Model'!1:1,'Amazon Financial Model'!308:308)","v":0},{"$f":"LOOKUP(W2,'Amazon Financial Model'!1:1,'Amazon Financial Model'!308:308)","v":0},{"$f":"LOOKUP(X2,'Amazon Financial Model'!1:1,'Amazon Financial Model'!308:308)","v":0},{"$f":"LOOKUP(Y2,'Amazon Financial Model'!1:1,'Amazon Financial Model'!308:308)","v":0},{"$f":"LOOKUP(Z2,'Amazon Financial Model'!1:1,'Amazon Financial Model'!308:308)","v":0}]
[null,null,"Increase in Other Assets",null,null,null,null,null,{"$f":"LOOKUP(I2,'Amazon Financial Model'!1:1,'Amazon Financial Model'!310:310)","v":0},{"$f":"LOOKUP(J2,'Amazon Financial Model'!1:1,'Amazon Financial Model'!310:310)","v":0},{"$f":"LOOKUP(K2,'Amazon Financial Model'!1:1,'Amazon Financial Model'!310:310)","v":0},{"$f":"LOOKUP(L2,'Amazon Financial Model'!1:1,'Amazon Financial Model'!310:310)","v":0},{"$f":"LOOKUP(M2,'Amazon Financial Model'!1:1,'Amazon Financial Model'!310:310)","v":0},{"$f":"LOOKUP(N2,'Amazon Financial Model'!1:1,'Amazon Financial Model'!310:310)","v":0},{"$f":"LOOKUP(O2,'Amazon Financial Model'!1:1,'Amazon Financial Model'!310:310)","v":0},{"$f":"LOOKUP(P2,'Amazon Financial Model'!1:1,'Amazon Financial Model'!310:310)","v":0},{"$f":"LOOKUP(Q2,'Amazon Financial Model'!1:1,'Amazon Financial Model'!310:310)","v":0},{"$f":"LOOKUP(R2,'Amazon Financial Model'!1:1,'Amazon Financial Model'!310:310)","v":0},{"$f":"LOOKUP(S2,'Amazon Financial Model'!1:1,'Amazon Financial Model'!310:310)","v":0},{"$f":"LOOKUP(T2,'Amazon Financial Model'!1:1,'Amazon Financial Model'!310:310)","v":0},{"$f":"LOOKUP(U2,'Amazon Financial Model'!1:1,'Amazon Financial Model'!310:310)","v":0},{"$f":"LOOKUP(V2,'Amazon Financial Model'!1:1,'Amazon Financial Model'!310:310)","v":0},{"$f":"LOOKUP(W2,'Amazon Financial Model'!1:1,'Amazon Financial Model'!310:310)","v":0},{"$f":"LOOKUP(X2,'Amazon Financial Model'!1:1,'Amazon Financial Model'!310:310)","v":0},{"$f":"LOOKUP(Y2,'Amazon Financial Model'!1:1,'Amazon Financial Model'!310:310)","v":0},{"$f":"LOOKUP(Z2,'Amazon Financial Model'!1:1,'Amazon Financial Model'!310:310)","v":0}]
[null,null,"Depreciation",null,null,null,null,null,{"$f":"LOOKUP(I2,'Amazon Financial Model'!1:1,'Amazon Financial Model'!301:301)","v":0},{"$f":"LOOKUP(J2,'Amazon Financial Model'!1:1,'Amazon Financial Model'!301:301)","v":0},{"$f":"LOOKUP(K2,'Amazon Financial Model'!1:1,'Amazon Financial Model'!301:301)","v":0},{"$f":"LOOKUP(L2,'Amazon Financial Model'!1:1,'Amazon Financial Model'!301:301)","v":0},{"$f":"LOOKUP(M2,'Amazon Financial Model'!1:1,'Amazon Financial Model'!301:301)","v":0},{"$f":"LOOKUP(N2,'Amazon Financial Model'!1:1,'Amazon Financial Model'!301:301)","v":0},{"$f":"LOOKUP(O2,'Amazon Financial Model'!1:1,'Amazon Financial Model'!301:301)","v":0},{"$f":"LOOKUP(P2,'Amazon Financial Model'!1:1,'Amazon Financial Model'!301:301)","v":0},{"$f":"LOOKUP(Q2,'Amazon Financial Model'!1:1,'Amazon Financial Model'!301:301)","v":0},{"$f":"LOOKUP(R2,'Amazon Financial Model'!1:1,'Amazon Financial Model'!301:301)","v":0},{"$f":"LOOKUP(S2,'Amazon Financial Model'!1:1,'Amazon Financial Model'!301:301)","v":0},{"$f":"LOOKUP(T2,'Amazon Financial Model'!1:1,'Amazon Financial Model'!301:301)","v":0},{"$f":"LOOKUP(U2,'Amazon Financial Model'!1:1,'Amazon Financial Model'!301:301)","v":0},{"$f":"LOOKUP(V2,'Amazon Financial Model'!1:1,'Amazon Financial Model'!301:301)","v":0},{"$f":"LOOKUP(W2,'Amazon Financial Model'!1:1,'Amazon Financial Model'!301:301)","v":0},{"$f":"LOOKUP(X2,'Amazon Financial Model'!1:1,'Amazon Financial Model'!301:301)","v":0},{"$f":"LOOKUP(Y2,'Amazon Financial Model'!1:1,'Amazon Financial Model'!301:301)","v":0},{"$f":"LOOKUP(Z2,'Amazon Financial Model'!1:1,'Amazon Financial Model'!301:301)","v":0}]
[null,null,"Invested Capital"]
[null,null,"Tax Rate",null,null,null,null,null,{"$f":"LOOKUP(I2,'Amazon Financial Model'!1:1,'Amazon Financial Model'!299:299)","v":0.21},{"$f":"LOOKUP(J2,'Amazon Financial Model'!1:1,'Amazon Financial Model'!299:299)","v":0.21},{"$f":"LOOKUP(K2,'Amazon Financial Model'!1:1,'Amazon Financial Model'!299:299)","v":0.21},{"$f":"LOOKUP(L2,'Amazon Financial Model'!1:1,'Amazon Financial Model'!299:299)","v":0.21},{"$f":"LOOKUP(M2,'Amazon Financial Model'!1:1,'Amazon Financial Model'!299:299)","v":0.21},{"$f":"LOOKUP(N2,'Amazon Financial Model'!1:1,'Amazon Financial Model'!299:299)","v":0.21},{"$f":"LOOKUP(O2,'Amazon Financial Model'!1:1,'Amazon Financial Model'!299:299)","v":0.21},{"$f":"LOOKUP(P2,'Amazon Financial Model'!1:1,'Amazon Financial Model'!299:299)","v":0.21},{"$f":"LOOKUP(Q2,'Amazon Financial Model'!1:1,'Amazon Financial Model'!299:299)","v":0.21},{"$f":"LOOKUP(R2,'Amazon Financial Model'!1:1,'Amazon Financial Model'!299:299)","v":0.21},{"$f":"LOOKUP(S2,'Amazon Financial Model'!1:1,'Amazon Financial Model'!299:299)","v":0.21},{"$f":"LOOKUP(T2,'Amazon Financial Model'!1:1,'Amazon Financial Model'!299:299)","v":0.21},{"$f":"LOOKUP(U2,'Amazon Financial Model'!1:1,'Amazon Financial Model'!299:299)","v":0.21},{"$f":"LOOKUP(V2,'Amazon Financial Model'!1:1,'Amazon Financial Model'!299:299)","v":0.21},{"$f":"LOOKUP(W2,'Amazon Financial Model'!1:1,'Amazon Financial Model'!299:299)","v":0.21},{"$f":"LOOKUP(X2,'Amazon Financial Model'!1:1,'Amazon Financial Model'!299:299)","v":0.21},{"$f":"LOOKUP(Y2,'Amazon Financial Model'!1:1,'Amazon Financial Model'!299:299)","v":0.21},{"$f":"LOOKUP(Z2,'Amazon Financial Model'!1:1,'Amazon Financial Model'!299:299)","v":0.21}]
[null,null,"EBIT",null,null,null,null,null,{"$f":"I13-I17","v":0},{"$f":"J13-J17","v":0},0,0,0,0,0,0,0,0,0,0,0,0,0,0,0,0]
{"$rows_left_out":147}
{"sheet":"Cap Exp and Depreciation","index":5,"n_rows":39,"n_cols":37,"rows_kept":39,"cut":false,"hidden":false,"merged":[]}
[null,"Timeline"]
[null,null,"Period",null,null,null,null,1,2,3,4,5,6,7,8,9,10,11,12,13,14,15,16,17,18,19,20,21,22,23,24,25,26,27,28,29,30]
[null,null,"Exceeds Book Life",null,null,{"$f":"F6","v":5},null,{"$f":"H2>$F$3","v":false},{"$f":"I2>$F$3","v":false},false,false,false,true,true,true,true,true,true,true,true,true,true,true,true,true,true,true,true,true,true,true,true,true,true,true,true,true]
[]
[null,"Assumptions"]
[null,null,"Book Life",null,null,5,null,null,"Cap Exp to Depreciation",null,null,{"$f":"LOOKUP(F6+1,2:2,18:18)","v":false}]
[null,null,"Growth Rate",null,null,0.25,null,null,"Net Plant Depreciation Rate",null,null,{"$f":"LOOKUP(F6+1,2:2,32:32)","v":false}]
[null,null,"Starting Cap Exp",null,null,100]
[]
[null,"Gross Plant"]
[null,null,"Plant Balance"]
[null,null,null,"Opening Balance"]
[null,null,null,"Add: Capital Expenditures",null,{"$f":"F7","v":0.25}]
[null,null,null,"Less: Retirements",null,{"$f":"F6","v":5}]
[null,null,null,"Closing Balance"]
[]
[null,null,null,"Depreciation ",null,{"$f":"1/F14","v":0.2}]
[null,null,null,"Cap Exp to Depreciation",null,null,null,{"$f":"IF(H17,H13/H17)","v":false},{"$f":"IF(I17,I13/I17)","v":false},false,false,false,false,false,false,false,false,false,false,false,false,false,false,false,false,false,false,false,false,false,false,false,false,false,false,false,false]
[]
[null,null,"Accumulated Depreciation"]
{"$rows_left_out":20}
{"sheet":"Equations","index":6,"n_rows":14,"n_cols":5,"rows_kept":14,"cut":false,"hidden":false,"merged":[]}
[]
[]
[]
[null,"Value Driver",null,null,"Value = Income * (1-Growth/Return)/(Cost of Capital - Growth)"]
[]
[null,"Sudden Value Drive",null,null,"Income = ROIC * Invested Capital"]
[null,null,null,null,"Value = ROIC * Invested Capital * (1-Growth/Return)/(Cost of Capital - Growth)"]
[]
[null,"Change in NOPAT"]
[null,"Change in Capital Expenditure"]
[]
[null,"Stable WC Change =  [EBITDA x WC/EBITDA * Growth]/[1+Growth]"]
[null,"WC Change Factor =  [WC/EBITDA * Growth]/[1+Growth]"]
[null,"Stable WC Change =  EBITDA x WC Change Factor"]

{"sheet":"AMZN Stock Price","index":7,"n_rows":1200,"n_cols":13,"rows_kept":1200,"cut":false,"hidden":false,"merged":[]}
["Date","Open","High","Low","Close","Adj Close","Volume",null,"Close",{"$f":"Summary!E16","v":"Growth"},{"$f":"Summary!F16","v":"EV/EBITDA"},{"$f":"Summary!G17","v":"Incremental"},{"$f":"Summary!H17","v":"Direct"}]
["1997-05-12",2.4375,2.5,1.7083330000000001,1.7291669999999999,1.7291669999999999,86856000,{"$f":"A2","v":"1997-05-12"},{"$f":"E2","v":1.7291669999999999},{"$f":"Summary!E18","v":{"$error":"#DIV/0!"}},{"$f":"Summary!F18","v":{"$error":"#DIV/0!"}},{"$f":"Summary!G18","v":{"$error":"#DIV/0!"}},{"$f":"Summary!H18","v":{"$error":"#DIV/0!"}}]
["1997-05-19",1.7604169999999999,1.7708330000000001,1.3125,1.5,1.5,58141200,{"$f":"A3","v":"1997-05-19"},{"$f":"E3","v":1.5},{"$f":"J$2","v":{"$error":"#DIV/0!"}},{"$f":"K$2","v":{"$error":"#DIV/0!"}},{"$error":"#DIV/0!"},{"$error":"#DIV/0!"}]
["1997-05-26",1.5104169999999999,1.6458330000000001,1.4583330000000001,1.5,1.5,19339200,"1997-05-26",1.5,{"$f":"J$2","v":{"$error":"#DIV/0!"}},{"$error":"#DIV/0!"},{"$error":"#DIV/0!"},{"$error":"#DIV/0!"}]
["1997-06-02",1.5104169999999999,1.7083330000000001,1.375,1.65625,1.65625,18334800,"1997-06-02",1.65625,{"$error":"#DIV/0!"},{"$error":"#DIV/0!"},{"$error":"#DIV/0!"},{"$error":"#DIV/0!"}]
["1997-06-09",1.65625,1.7083330000000001,1.53125,1.5833330000000001,1.5833330000000001,11324400,"1997-06-09",1.5833330000000001,{"$error":"#DIV/0!"},{"$error":"#DIV/0!"},{"$error":"#DIV/0!"},{"$error":"#DIV/0!"}]
["1997-06-16",1.6041669999999999,1.6041669999999999,1.4947919999999999,1.5260419999999999,1.5260419999999999,12475200,"1997-06-16",1.5260419999999999,{"$error":"#DIV/0!"},{"$error":"#DIV/0!"},{"$error":"#DIV/0!"},{"$error":"#DIV/0!"}]
["1997-06-23",1.5416669999999999,1.5416669999999999,1.4791669999999999,1.4895830000000001,1.4895830000000001,8282400,"1997-06-23",1.4895830000000001,{"$error":"#DIV/0!"},{"$error":"#DIV/0!"},{"$error":"#DIV/0!"},{"$error":"#DIV/0!"}]
["1997-06-30",1.5104169999999999,1.9166669999999999,1.4791669999999999,1.9114580000000001,1.9114580000000001,20498400,"1997-06-30",1.9114580000000001,{"$error":"#DIV/0!"},{"$error":"#DIV/0!"},{"$error":"#DIV/0!"},{"$error":"#DIV/0!"}]
["1997-07-07",1.8333330000000001,2.5729169999999999,1.8333330000000001,2.2916669999999999,2.2916669999999999,51415200,"1997-07-07",2.2916669999999999,{"$error":"#DIV/0!"},{"$error":"#DIV/0!"},{"$error":"#DIV/0!"},{"$error":"#DIV/0!"}]
["1997-07-14",2.3229169999999999,2.4947919999999999,2.1145830000000001,2.15625,2.15625,20852400,"1997-07-14",2.15625,{"$error":"#DIV/0!"},{"$error":"#DIV/0!"},{"$error":"#DIV/0!"},{"$error":"#DIV/0!"}]
["1997-07-21",2.1770830000000001,2.3333330000000001,2.0625,2.2291669999999999,2.2291669999999999,7234800,"1997-07-21",2.2291669999999999,{"$error":"#DIV/0!"},{"$error":"#DIV/0!"},{"$error":"#DIV/0!"},{"$error":"#DIV/0!"}]
["1997-07-28",2.2291669999999999,2.5052080000000001,2.21875,2.4166669999999999,2.4166669999999999,14948400,"1997-07-28",2.4166669999999999,{"$error":"#DIV/0!"},{"$error":"#DIV/0!"},{"$error":"#DIV/0!"},{"$error":"#DIV/0!"}]
["1997-08-04",2.375,2.4114580000000001,2.1041669999999999,2.2916669999999999,2.2916669999999999,11192400,"1997-08-04",2.2916669999999999,{"$error":"#DIV/0!"},{"$error":"#DIV/0!"},{"$error":"#DIV/0!"},{"$error":"#DIV/0!"}]
["1997-08-11",2.2916669999999999,2.3333330000000001,1.9375,2.1145830000000001,2.1145830000000001,5040000,"1997-08-11",2.1145830000000001,{"$error":"#DIV/0!"},{"$error":"#DIV/0!"},{"$error":"#DIV/0!"},{"$error":"#DIV/0!"}]
["1997-08-18",2.0520830000000001,2.2083330000000001,1.96875,2.125,2.125,5124000,"1997-08-18",2.125,{"$error":"#DIV/0!"},{"$error":"#DIV/0!"},{"$error":"#DIV/0!"},{"$error":"#DIV/0!"}]
["1997-08-25",2.1041669999999999,2.3958330000000001,2.1041669999999999,2.3385419999999999,2.3385419999999999,6962400,"1997-08-25",2.3385419999999999,{"$error":"#DIV/0!"},{"$error":"#DIV/0!"},{"$error":"#DIV/0!"},{"$error":"#DIV/0!"}]
["1997-09-01",2.34375,2.6666669999999999,2.3125,2.5,2.5,7952400,"1997-09-01",2.5,{"$error":"#DIV/0!"},{"$error":"#DIV/0!"},{"$error":"#DIV/0!"},{"$error":"#DIV/0!"}]
["1997-09-08",2.53125,3.6979169999999999,2.5,3.6875,3.6875,26082000,"1997-09-08",3.6875,{"$error":"#DIV/0!"},{"$error":"#DIV/0!"},{"$error":"#DIV/0!"},{"$error":"#DIV/0!"}]
["1997-09-15",3.6666669999999999,4.0833329999999997,3.0520830000000001,3.9479169999999999,3.9479169999999999,25681200,"1997-09-15",3.9479169999999999,{"$error":"#DIV/0!"},{"$error":"#DIV/0!"},{"$error":"#DIV/0!"},{"$error":"#DIV/0!"}]
{"$rows_left_out":1180}