{"text_format":"1","workbook":"xlsx","n_sheets":3,"sheets":["Input","Chart1","Model"],"not_rendered":{"charts":4,"images":0,"macros":1,"external_links":0,"defined_names":5,"comments":0,"pivot_tables":0},"unopened":[{"sheet":"Chart1","index":1,"reason":"not_a_worksheet"}],"bounds":{"document_bytes":16777216,"sheet_cells":100000,"rows_first":2000,"rows_last":500,"rows_between":2000,"halvings":0,"cell_chars":16384,"cell_head_chars":4096},"cells_cut":0,"cells_raw":0,"read":"whole","date_system":"1900"}

{"sheet":"Input","index":0,"n_rows":53,"n_cols":58,"rows_kept":53,"cut":false,"hidden":false,"merged":[]}
["          "]
[null,null,null,"INSERT GRAPH","PLCR",{"$f":"Model!F186","v":1.6903309714371746},null,"Project IRR",null,{"$f":"Model!F26","v":5.6303742527961748E-2},"Average Debt Life",null,{"$f":"Model!F194","v":12.700735881299142}]
[null,null,null,null,"DSCR",{"$f":"Model!F173","v":1.4000000000000001},null,"Equity IRR",null,{"$f":"Model!F169","v":7.3539373278617856E-2}]
[null,null,null,null,"LLCR",{"$f":"Model!F181","v":1.4000000000000006},null,"Debt IRR",null,{"$f":"Model!F196","v":4.056900441646577E-2}]
[null,"Timing Inputs"]
[null,null,null,"Financial Close","Date","2020-01-01"]
[null,null,null,"Construction Period","Months",36]
[null,null,null,"Commercial Operation","Date",{"$f":"EDATE(F6,F7)","v":"2023-01-01"}]
[null,null,null,"Operation Period","Years",30]
[null,null,null,"Decommissioning","Date",{"$f":"EDATE(F8,F9*12)","v":"2053-01-01"}]
[]
[null,null,null,"Pre-COD Periods","Periods",{"$f":"F7","v":36}]
[null,null,null,"Months in Period Pre-COD","Months",1]
[null,null,null,"Months in Period Post-COD","Months",6]
[]
{"$rows_left_out":39}
{"sheet":"Model","index":2,"n_rows":203,"n_cols":159,"rows_kept":203,"cut":false,"hidden":false,"merged":[]}
["          ",null,null,null,"Units","Driver 1","Driver 2","Sum","Test/Start"]
[null,"Timing"]
[null,null,"Period",null,"#",null,null,null,null,1,2,3,4,5,6,7,8,9,10,11,12,13,14,15,16,17,18,19,20,21,22,23,24,25,26,27,28,29,30,31,32,33,34,35,36,37,38,39,40,41,42,43,44,45,46,47,48,49,50,51,52,53,54,55,56,57,58,59,60,61,62,63,64,65,66,67,68,69,70,71,72,73,74,75,76,77,78,79,80,81,82,83,84,85,86,87,88,89,90,91,92,93,94,95,96,97,98,99,100,101,102,103,104,105,106,107,108,109,110,111,112,113,114,115,116,117,118,119,120,121,122,123,124,125,126,127,128,129,130,131,132,133,134,135,136,137,138,139,140,141,142,143,144,145,146,147,148,149,150]
[null,null,"Pre-COD Flag",null,null,{"$f":"Input!F12","v":36},null,{"$f":"SUM(J4:FC4)","v":36},null,{"$f":"(J3<=$F$4)*1","v":1},{"$f":"(K3<=$F$4)*1","v":1},1,1,1,1,1,1,1,1,1,1,1,1,1,1,1,1,1,1,1,1,1,1,1,1,1,1,1,1,1,1,1,1,1,1,0,0,0,0,0,0,0,0,0,0,0,0,0,0,0,0,0,0,0,0,0,0,0,0,0,0,0,0,0,{"$f":"(BW3<=$F$4)*1","v":0},0,0,0,0,0,0,0,0,0,0,0,0,0,0,0,0,0,0,0,0,0,0,0,0,0,0,0,0,0,0,0,0,0,0,0,0,0,0,0,0,0,0,0,0,0,0,0,0,0,0,0,0,0,0,0,0,0,0,0,0,0,0,0,{"$f":"(EI3<=$F$4)*1","v":0},0,0,0,0,0,0,0,0,0,0,0,0,0,0,0,0,0,0,0,0]
[null,null,"Months per Period",null,null,{"$f":"Input!F13","v":1},{"$f":"Input!F14","v":6},null,null,{"$f":"IF(J4,$F$5,$G$5)","v":1},{"$f":"IF(K4,$F$5,$G$5)","v":1},1,1,1,1,1,1,1,1,1,1,1,1,1,1,1,1,1,1,1,1,1,1,1,1,1,1,1,1,1,1,1,1,1,1,6,6,6,6,6,6,6,6,6,6,6,6,6,6,6,6,6,6,6,6,6,6,6,6,6,6,6,6,6,{"$f":"IF(BW4,$F$5,$G$5)","v":6},6,6,6,6,6,6,6,6,6,6,6,6,6,6,6,6,6,6,6,6,6,6,6,6,6,6,6,6,6,6,6,6,6,6,6,6,6,6,6,6,6,6,6,6,6,6,6,6,6,6,6,6,6,6,6,6,6,6,6,6,6,6,6,{"$f":"IF(EI4,$F$5,$G$5)","v":6},6,6,6,6,6,6,6,6,6,6,6,6,6,6,6,6,6,6,6,6]
[null,null,"Start of Period",null,null,null,null,null,null,{"$f":"I7+1","v":"2020-01-01"},{"$f":"J7+1","v":"2020-02-01"},"2020-03-01","2020-04-01","2020-05-01","2020-06-01","2020-07-01","2020-08-01","2020-09-01","2020-10-01","2020-11-01","2020-12-01","2021-01-01","2021-02-01","2021-03-01","2021-04-01","2021-05-01","2021-06-01","2021-07-01","2021-08-01","2021-09-01","2021-10-01","2021-11-01","2021-12-01","2022-01-01","2022-02-01","2022-03-01","2022-04-01","2022-05-01","2022-06-01","2022-07-01","2022-08-01","2022-09-01","2022-10-01","2022-11-01","2022-12-01","2023-01-01","2023-07-01","2024-01-01","2024-07-01","2025-01-01","2025-07-01","2026-01-01","2026-07-01","2027-01-01","2027-07-01","2028-01-01","2028-07-01","2029-01-01","2029-07-01","2030-01-01","2030-07-01","2031-01-01","2031-07-01","2032-01-01","2032-07-01","2033-01-01","2033-07-01","2034-01-01","2034-07-01","2035-01-01","2035-07-01","2036-01-01","2036-07-01","2037-01-01",{"$f":"BV7+1","v":"2037-07-01"},"2038-01-01","2038-07-01","2039-01-01","2039-07-01","2040-01-01","2040-07-01","2041-01-01","2041-07-01","2042-01-01","2042-07-01","2043-01-01","2043-07-01","2044-01-01","2044-07-01","2045-01-01","2045-07-01","2046-01-01","2046-07-01","2047-01-01","2047-07-01","2048-01-01","2048-07-01","2049-01-01","2049-07-01","2050-01-01","2050-07-01","2051-01-01","2051-07-01","2052-01-01","2052-07-01","2053-01-01","2053-07-01","2054-01-01","2054-07-01","2055-01-01","2055-07-01","2056-01-01","2056-07-01","2057-01-01","2057-07-01","2058-01-01","2058-07-01","2059-01-01","2059-07-01","2060-01-01","2060-07-01","2061-01-01","2061-07-01","2062-01-01","2062-07-01","2063-01-01","2063-07-01","2064-01-01","2064-07-01","2065-01-01","2065-07-01","2066-01-01","2066-07-01","2067-01-01","2067-07-01","2068-01-01","2068-07-01","2069-01-01",{"$f":"EH7+1","v":"2069-07-01"},"2070-01-01","2070-07-01","2071-01-01","2071-07-01","2072-01-01","2072-07-01","2073-01-01","2073-07-01","2074-01-01","2074-07-01","2075-01-01","2075-07-01","2076-01-01","2076-07-01","2077-01-01","2077-07-01","2078-01-01","2078-07-01","2079-01-01","2079-07-01"]
[null,null,"End of Period",null,null,null,null,null,{"$f":"Input!F6-1","v":"2019-12-31"},{"$f":"EDATE(J6,J5)-1","v":"2020-01-31"},{"$f":"EDATE(K6,K5)-1","v":"2020-02-29"},"2020-03-31","2020-04-30","2020-05-31","2020-06-30","2020-07-31","2020-08-31","2020-09-30","2020-10-31","2020-11-30","2020-12-31","2021-01-31","2021-02-28","2021-03-31","2021-04-30","2021-05-31","2021-06-30","2021-07-31","2021-08-31","2021-09-30","2021-10-31","2021-11-30","2021-12-31","2022-01-31","2022-02-28","2022-03-31","2022-04-30","2022-05-31","2022-06-30","2022-07-31","2022-08-31","2022-09-30","2022-10-31","2022-11-30","2022-12-31","2023-06-30","2023-12-31","2024-06-30","2024-12-31","2025-06-30","2025-12-31","2026-06-30","2026-12-31","2027-06-30","2027-12-31","2028-06-30","2028-12-31","2029-06-30","2029-12-31","2030-06-30","2030-12-31","2031-06-30","2031-12-31","2032-06-30","2032-12-31","2033-06-30","2033-12-31","2034-06-30","2034-12-31","2035-06-30","2035-12-31","2036-06-30","2036-12-31","2037-06-30",{"$f":"EDATE(BW6,BW5)-1","v":"2037-12-31"},"2038-06-30","2038-12-31","2039-06-30","2039-12-31","2040-06-30","2040-12-31","2041-06-30","2041-12-31","2042-06-30","2042-12-31","2043-06-30","2043-12-31","2044-06-30","2044-12-31","2045-06-30","2045-12-31","2046-06-30","2046-12-31","2047-06-30","2047-12-31","2048-06-30","2048-12-31","2049-06-30","2049-12-31","2050-06-30","2050-12-31","2051-06-30","2051-12-31","2052-06-30","2052-12-31","2053-06-30","2053-12-31","2054-06-30","2054-12-31","2055-06-30","2055-12-31","2056-06-30","2056-12-31","2057-06-30","2057-12-31","2058-06-30","2058-12-31","2059-06-30","2059-12-31","2060-06-30","2060-12-31","2061-06-30","2061-12-31","2062-06-30","2062-12-31","2063-06-30","2063-12-31","2064-06-30","2064-12-31","2065-06-30","2065-12-31","2066-06-30","2066-12-31","2067-06-30","2067-12-31","2068-06-30","2068-12-31","2069-06-30",{"$f":"EDATE(EI6,EI5)-1","v":"2069-12-31"},"2070-06-30","2070-12-31","2071-06-30","2071-12-31","2072-06-30","2072-12-31","2073-06-30","2073-12-31","2074-06-30","2074-12-31","2075-06-30","2075-12-31","2076-06-30","2076-12-31","2077-06-30","2077-12-31","2078-06-30","2078-12-31","2079-06-30","2079-12-31"]
[null,null,"Operating Period",null,null,{"$f":"Input!F8","v":"2023-01-01"},{"$f":"Input!F10","v":"2053-01-01"},{"$f":"SUM(J8:FC8)","v":60},null,{"$f":"AND(J6>=$F$8,J6<$G$8)*1","v":0},{"$f":"AND(K6>=$F$8,K6<$G$8)*1","v":0},0,0,0,0,0,0,0,0,0,0,0,0,0,0,0,0,0,0,0,0,0,0,0,0,0,0,0,0,0,0,0,0,0,0,1,1,1,1,1,1,1,1,1,1,1,1,1,1,1,1,1,1,1,1,1,1,1,1,1,1,1,1,1,{"$f":"AND(BW6>=$F$8,BW6<$G$8)*1","v":1},1,1,1,1,1,1,1,1,1,1,1,1,1,1,1,1,1,1,1,1,1,1,1,1,1,1,1,1,1,1,0,0,0,0,0,0,0,0,0,0,0,0,0,0,0,0,0,0,0,0,0,0,0,0,0,0,0,0,0,0,0,0,0,{"$f":"AND(EI6>=$F$8,EI6<$G$8)*1","v":0},0,0,0,0,0,0,0,0,0,0,0,0,0,0,0,0,0,0,0,0]
[]
[null,"Operations "]
[null,null,"Total Cost",null,"EUR",{"$f":"Input!F17","v":2500},null,null,null,{"$f":"$F$11*J4","v":2500},{"$f":"$F$11*K4","v":2500},2500,2500,2500,2500,2500,2500,2500,2500,2500,2500,2500,2500,2500,2500,2500,2500,2500,2500,2500,2500,2500,2500,2500,2500,2500,2500,2500,2500,2500,2500,2500,2500,2500,2500,0,0,0,0,0,0,0,0,0,0,0,0,0,0,0,0,0,0,0,0,0,0,0,0,0,0,0,0,0,{"$f":"$F$11*BW4","v":0},0,0,0,0,0,0,0,0,0,0,0,0,0,0,0,0,0,0,0,0,0,0,0,0,0,0,0,0,0,0,0,0,0,0,0,0,0,0,0,0,0,0,0,0,0,0,0,0,0,0,0,0,0,0,0,0,0,0,0,0,0,0,0,{"$f":"$F$11*EI4","v":0},0,0,0,0,0,0,0,0,0,0,0,0,0,0,0,0,0,0,0,0]
[null,null,"S-Curve",null,"%",null,null,null,null,{"$f":"LOOKUP(J3,Input!18:18,Input!22:22)","v":5.2909162715320647E-3},{"$f":"LOOKUP(K3,Input!18:18,Input!22:22)","v":6.8469543920219225E-3},{"$f":"LOOKUP(L3,Input!18:18,Input!22:22)","v":8.7232461983683292E-3},{"$f":"LOOKUP(M3,Input!18:18,Input!22:22)","v":1.0941401964470538E-2},{"$f":"LOOKUP(N3,Input!18:18,Input!22:22)","v":1.3510828014477887E-2},{"$f":"LOOKUP(O3,Input!18:18,Input!22:22)","v":1.64249897299409E-2},{"$f":"LOOKUP(P3,Input!18:18,Input!22:22)","v":1.9658138765448405E-2},{"$f":"LOOKUP(Q3,Input!18:18,Input!22:22)","v":2.3162948140550074E-2},{"$f":"LOOKUP(R3,Input!18:18,Input!22:22)","v":2.6869489917474291E-2},{"$f":"LOOKUP(S3,Input!18:18,Input!22:22)","v":3.0685920663827856E-2},{"$f":"LOOKUP(T3,Input!18:18,Input!22:22)","v":3.4501107987471996E-2},{"$f":"LOOKUP(U3,Input!18:18,Input!22:22)","v":3.8189245291448889E-2},{"$f":"LOOKUP(V3,Input!18:18,Input!22:22)","v":4.1616280093028535E-2},{"$f":"LOOKUP(W3,Input!18:18,Input!22:22)","v":4.4647751115524791E-2},{"$f":"LOOKUP(X3,Input!18:18,Input!22:22)","v":4.7157423409811043E-2},{"$f":"LOOKUP(Y3,Input!18:18,Input!22:22)","v":4.9035961598343031E-2},{"$f":"LOOKUP(Z3,Input!18:18,Input!22:22)","v":5.0198815916587203E-2},{"$f":"LOOKUP(AA3,Input!18:18,Input!22:22)","v":5.0592530109469583E-2},{"$f":"LOOKUP(AB3,Input!18:18,Input!22:22)","v":5.0198815916587203E-2},{"$f":"LOOKUP(AC3,Input!18:18,Input!22:22)","v":4.9035961598343031E-2},{"$f":"LOOKUP(AD3,Input!18:18,Input!22:22)","v":4.7157423409811043E-2},{"$f":"LOOKUP(AE3,Input!18:18,Input!22:22)","v":4.4647751115524791E-2},{"$f":"LOOKUP(AF3,Input!18:18,Input!22:22)","v":4.1616280093028535E-2},{"$f":"LOOKUP(AG3,Input!18:18,Input!22:22)","v":3.8189245291448889E-2},{"$f":"LOOKUP(AH3,Input!18:18,Input!22:22)","v":3.4501107987471996E-2},{"$f":"LOOKUP(AI3,Input!18:18,Input!22:22)","v":3.0685920663827856E-2},{"$f":"LOOKUP(AJ3,Input!18:18,Input!22:22)","v":2.6869489917474291E-2},{"$f":"LOOKUP(AK3,Input!18:18,Input!22:22)","v":2.3162948140550074E-2},{"$f":"LOOKUP(AL3,Input!18:18,Input!22:22)","v":1.9658138765448405E-2},{"$f":"LOOKUP(AM3,Input!18:18,Input!22:22)","v":1.64249897299409E-2},{"$f":"LOOKUP(AN3,Input!18:18,Input!22:22)","v":1.3510828014477887E-2},{"$f":"LOOKUP(AO3,Input!18:18,Input!22:22)","v":1.0941401964470538E-2},{"$f":"LOOKUP(AP3,Input!18:18,Input!22:22)","v":8.7232461983683292E-3},{"$f":"LOOKUP(AQ3,Input!18:18,Input!22:22)","v":6.8469543920219225E-3},{"$f":"LOOKUP(AR3,Input!18:18,Input!22:22)","v":5.2909162715320647E-3},{"$f":"LOOKUP(AS3,Input!18:18,Input!22:22)","v":4.025116840321542E-3},{"$f":"LOOKUP(AT3,Input!18:18,Input!22:22)","v":3.0146732186083431E-3},{"$f":"LOOKUP(AU3,Input!18:18,Input!22:22)","v":2.2228806372600065E-3},{"$f":"LOOKUP(AV3,Input!18:18,Input!22:22)","v":1.6136382935102438E-3},{"$f":"LOOKUP(AW3,Input!18:18,Input!22:22)","v":1.1532152826748535E-3},{"$f":"LOOKUP(AX3,Input!18:18,Input!22:22)","v":8.1138828940009223E-4},{"$f":"LOOKUP(AY3,Input!18:18,Input!22:22)","v":5.6203224184701731E-4},{"$f":"LOOKUP(AZ3,Input!18:18,Input!22:22)","v":3.8327268919835034E-4},{"$f":"LOOKUP(BA3,Input!18:18,Input!22:22)","v":2.5731711070885687E-4},{"$f":"LOOKUP(BB3,Input!18:18,Input!22:22)","v":1.7007622485930974E-4},{"$f":"LOOKUP(BC3,Input!18:18,Input!22:22)","v":1.106707102608649E-4},{"$f":"LOOKUP(BD3,Input!18:18,Input!22:22)","v":7.0898318594147996E-5},{"$f":"LOOKUP(BE3,Input!18:18,Input!22:22)","v":4.4715009045152818E-5},{"$f":"LOOKUP(BF3,Input!18:18,Input!22:22)","v":2.7764180483392677E-5},{"$f":"LOOKUP(BG3,Input!18:18,Input!22:22)","v":1.6971903102759622E-5},{"$f":"LOOKUP(BH3,Input!18:18,Input!22:22)","v":1.6971903102759622E-5},{"$f":"LOOKUP(BI3,Input!18:18,Input!22:22)","v":1.6971903102759622E-5},{"$f":"LOOKUP(BJ3,Input!18:18,Input!22:22)","v":1.6971903102759622E-5},{"$f":"LOOKUP(BK3,Input!18:18,Input!22:22)","v":1.6971903102759622E-5},{"$f":"LOOKUP(BL3,Input!18:18,Input!22:22)","v":1.6971903102759622E-5},{"$f":"LOOKUP(BM3,Input!18:18,Input!22:22)","v":1.6971903102759622E-5},{"$f":"LOOKUP(BN3,Input!18:18,Input!22:22)","v":1.6971903102759622E-5},{"$f":"LOOKUP(BO3,Input!18:18,Input!22:22)","v":1.6971903102759622E-5},{"$f":"LOOKUP(BP3,Input!18:18,Input!22:22)","v":1.6971903102759622E-5},{"$f":"LOOKUP(BQ3,Input!18:18,Input!22:22)","v":1.6971903102759622E-5},{"$f":"LOOKUP(BR3,Input!18:18,Input!22:22)","v":1.6971903102759622E-5},{"$f":"LOOKUP(BS3,Input!18:18,Input!22:22)","v":1.6971903102759622E-5},{"$f":"LOOKUP(BT3,Input!18:18,Input!22:22)","v":1.6971903102759622E-5},{"$f":"LOOKUP(BU3,Input!18:18,Input!22:22)","v":1.6971903102759622E-5},{"$f":"LOOKUP(BV3,Input!18:18,Input!22:22)","v":1.6971903102759622E-5},{"$f":"LOOKUP(BW3,Input!18:18,Input!22:22)","v":1.6971903102759622E-5},{"$f":"LOOKUP(BX3,Input!18:18,Input!22:22)","v":1.6971903102759622E-5},{"$f":"LOOKUP(BY3,Input!18:18,Input!22:22)","v":1.6971903102759622E-5},{"$f":"LOOKUP(BZ3,Input!18:18,Input!22:22)","v":1.6971903102759622E-5},{"$f":"LOOKUP(CA3,Input!18:18,Input!22:22)","v":1.6971903102759622E-5},{"$f":"LOOKUP(CB3,Input!18:18,Input!22:22)","v":1.6971903102759622E-5},{"$f":"LOOKUP(CC3,Input!18:18,Input!22:22)","v":1.6971903102759622E-5},{"$f":"LOOKUP(CD3,Input!18:18,Input!22:22)","v":1.6971903102759622E-5},{"$f":"LOOKUP(CE3,Input!18:18,Input!22:22)","v":1.6971903102759622E-5},{"$f":"LOOKUP(CF3,Input!18:18,Input!22:22)","v":1.6971903102759622E-5},{"$f":"LOOKUP(CG3,Input!18:18,Input!22:22)","v":1.6971903102759622E-5},{"$f":"LOOKUP(CH3,Input!18:18,Input!22:22)","v":1.6971903102759622E-5},{"$f":"LOOKUP(CI3,Input!18:18,Input!22:22)","v":1.6971903102759622E-5},{"$f":"LOOKUP(CJ3,Input!18:18,Input!22:22)","v":1.6971903102759622E-5},{"$f":"LOOKUP(CK3,Input!18:18,Input!22:22)","v":1.6971903102759622E-5},{"$f":"LOOKUP(CL3,Input!18:18,Input!22:22)","v":1.6971903102759622E-5},{"$f":"LOOKUP(CM3,Input!18:18,Input!22:22)","v":1.6971903102759622E-5},{"$f":"LOOKUP(CN3,Input!18:18,Input!22:22)","v":1.6971903102759622E-5},{"$f":"LOOKUP(CO3,Input!18:18,Input!22:22)","v":1.6971903102759622E-5},{"$f":"LOOKUP(CP3,Input!18:18,Input!22:22)","v":1.6971903102759622E-5},{"$f":"LOOKUP(CQ3,Input!18:18,Input!22:22)","v":1.6971903102759622E-5},{"$f":"LOOKUP(CR3,Input!18:18,Input!22:22)","v":1.6971903102759622E-5},{"$f":"LOOKUP(CS3,Input!18:18,Input!22:22)","v":1.6971903102759622E-5},{"$f":"LOOKUP(CT3,Input!18:18,Input!22:22)","v":1.6971903102759622E-5},{"$f":"LOOKUP(CU3,Input!18:18,Input!22:22)","v":1.6971903102759622E-5},{"$f":"LOOKUP(CV3,Input!18:18,Input!22:22)","v":1.6971903102759622E-5},{"$f":"LOOKUP(CW3,Input!18:18,Input!22:22)","v":1.6971903102759622E-5},{"$f":"LOOKUP(CX3,Input!18:18,Input!22:22)","v":1.6971903102759622E-5},{"$f":"LOOKUP(CY3,Input!18:18,Input!22:22)","v":1.6971903102759622E-5},{"$f":"LOOKUP(CZ3,Input!18:18,Input!22:22)","v":1.6971903102759622E-5},{"$f":"LOOKUP(DA3,Input!18:18,Input!22:22)","v":1.6971903102759622E-5},{"$f":"LOOKUP(DB3,Input!18:18,Input!22:22)","v":1.6971903102759622E-5},{"$f":"LOOKUP(DC3,Input!18:18,Input!22:22)","v":1.6971903102759622E-5},{"$f":"LOOKUP(DD3,Input!18:18,Input!22:22)","v":1.6971903102759622E-5},{"$f":"LOOKUP(DE3,Input!18:18,Input!22:22)","v":1.6971903102759622E-5},{"$f":"LOOKUP(DF3,Input!18:18,Input!22:22)","v":1.6971903102759622E-5},{"$f":"LOOKUP(DG3,Input!18:18,Input!22:22)","v":1.6971903102759622E-5},{"$f":"LOOKUP(DH3,Input!18:18,Input!22:22)","v":1.6971903102759622E-5},{"$f":"LOOKUP(DI3,Input!18:18,Input!22:22)","v":1.6971903102759622E-5},{"$f":"LOOKUP(DJ3,Input!18:18,Input!22:22)","v":1.6971903102759622E-5},{"$f":"LOOKUP(DK3,Input!18:18,Input!22:22)","v":1.6971903102759622E-5},{"$f":"LOOKUP(DL3,Input!18:18,Input!22:22)","v":1.6971903102759622E-5},{"$f":"LOOKUP(DM3,Input!18:18,Input!22:22)","v":1.6971903102759622E-5},{"$f":"LOOKUP(DN3,Input!18:18,Input!22:22)","v":1.6971903102759622E-5},{"$f":"LOOKUP(DO3,Input!18:18,Input!22:22)","v":1.6971903102759622E-5},{"$f":"LOOKUP(DP3,Input!18:18,Input!22:22)","v":1.6971903102759622E-5},{"$f":"LOOKUP(DQ3,Input!18:18,Input!22:22)","v":1.6971903102759622E-5},{"$f":"LOOKUP(DR3,Input!18:18,Input!22:22)","v":1.6971903102759622E-5},{"$f":"LOOKUP(DS3,Input!18:18,Input!22:22)","v":1.6971903102759622E-5},{"$f":"LOOKUP(DT3,Input!18:18,Input!22:22)","v":1.6971903102759622E-5},{"$f":"LOOKUP(DU3,Input!18:18,Input!22:22)","v":1.6971903102759622E-5},{"$f":"LOOKUP(DV3,Input!18:18,Input!22:22)","v":1.6971903102759622E-5},{"$f":"LOOKUP(DW3,Input!18:18,Input!22:22)","v":1.6971903102759622E-5},{"$f":"LOOKUP(DX3,Input!18:18,Input!22:22)","v":1.6971903102759622E-5},{"$f":"LOOKUP(DY3,Input!18:18,Input!22:22)","v":1.6971903102759622E-5},{"$f":"LOOKUP(DZ3,Input!18:18,Input!22:22)","v":1.6971903102759622E-5},{"$f":"LOOKUP(EA3,Input!18:18,Input!22:22)","v":1.6971903102759622E-5},{"$f":"LOOKUP(EB3,Input!18:18,Input!22:22)","v":1.6971903102759622E-5},{"$f":"LOOKUP(EC3,Input!18:18,Input!22:22)","v":1.6971903102759622E-5},{"$f":"LOOKUP(ED3,Input!18:18,Input!22:22)","v":1.6971903102759622E-5},{"$f":"LOOKUP(EE3,Input!18:18,Input!22:22)","v":1.6971903102759622E-5},{"$f":"LOOKUP(EF3,Input!18:18,Input!22:22)","v":1.6971903102759622E-5},{"$f":"LOOKUP(EG3,Input!18:18,Input!22:22)","v":1.6971903102759622E-5},{"$f":"LOOKUP(EH3,Input!18:18,Input!22:22)","v":1.6971903102759622E-5},{"$f":"LOOKUP(EI3,Input!18:18,Input!22:22)","v":1.6971903102759622E-5},{"$f":"LOOKUP(EJ3,Input!18:18,Input!22:22)","v":1.6971903102759622E-5},{"$f":"LOOKUP(EK3,Input!18:18,Input!22:22)","v":1.6971903102759622E-5},{"$f":"LOOKUP(EL3,Input!18:18,Input!22:22)","v":1.6971903102759622E-5},{"$f":"LOOKUP(EM3,Input!18:18,Input!22:22)","v":1.6971903102759622E-5},{"$f":"LOOKUP(EN3,Input!18:18,Input!22:22)","v":1.6971903102759622E-5},{"$f":"LOOKUP(EO3,Input!18:18,Input!22:22)","v":1.6971903102759622E-5},{"$f":"LOOKUP(EP3,Input!18:18,Input!22:22)","v":1.6971903102759622E-5},{"$f":"LOOKUP(EQ3,Input!18:18,Input!22:22)","v":1.6971903102759622E-5},{"$f":"LOOKUP(ER3,Input!18:18,Input!22:22)","v":1.6971903102759622E-5},{"$f":"LOOKUP(ES3,Input!18:18,Input!22:22)","v":1.6971903102759622E-5},{"$f":"LOOKUP(ET3,Input!18:18,Input!22:22)","v":1.6971903102759622E-5},{"$f":"LOOKUP(EU3,Input!18:18,Input!22:22)","v":1.6971903102759622E-5},{"$f":"LOOKUP(EV3,Input!18:18,Input!22:22)","v":1.6971903102759622E-5},{"$f":"LOOKUP(EW3,Input!18:18,Input!22:22)","v":1.6971903102759622E-5},{"$f":"LOOKUP(EX3,Input!18:18,Input!22:22)","v":1.6971903102759622E-5},{"$f":"LOOKUP(EY3,Input!18:18,Input!22:22)","v":1.6971903102759622E-5},{"$f":"LOOKUP(EZ3,Input!18:18,Input!22:22)","v":1.6971903102759622E-5},{"$f":"LOOKUP(FA3,Input!18:18,Input!22:22)","v":1.6971903102759622E-5},{"$f":"LOOKUP(FB3,Input!18:18,Input!22:22)","v":1.6971903102759622E-5},{"$f":"LOOKUP(FC3,Input!18:18,Input!22:22)","v":1.6971903102759622E-5}]
[null,null,"Capital Expenditures",null,"EUR",null,null,{"$f":"SUM(J13:FC13)","v":2473.8512147261172},null,{"$f":"J11*J12","v":13.227290678830162},{"$f":"K11*K12","v":17.117385980054806},21.808115495920823,27.353504911176344,33.777070036194715,41.062474324852253,49.145346913621012,57.907370351375185,67.173724793685722,76.714801659569645,86.252769968679985,95.473113228622225,104.04070023257134,111.61937778881197,117.89355852452761,122.58990399585758,125.49703979146801,126.48132527367396,125.49703979146801,122.58990399585758,117.89355852452761,111.61937778881197,104.04070023257134,95.473113228622225,86.252769968679985,76.714801659569645,67.173724793685722,57.907370351375185,49.145346913621012,41.062474324852253,33.777070036194715,27.353504911176344,21.808115495920823,17.117385980054806,13.227290678830162,10.062792100803854,0,0,0,0,0,0,0,0,0,0,0,0,0,0,0,0,0,0,0,0,0,0,0,0,0,0,0,0,0,{"$f":"BW11*BW12","v":0},0,0,0,0,0,0,0,0,0,0,0,0,0,0,0,0,0,0,0,0,0,0,0,0,0,0,0,0,0,0,0,0,0,0,0,0,0,0,0,0,0,0,0,0,0,0,0,0,0,0,0,0,0,0,0,0,0,0,0,0,0,0,0,{"$f":"EI11*EI12","v":0},0,0,0,0,0,0,0,0,0,0,0,0,0,0,0,0,0,0,0,0]
[]
[null,null,"Operating Period",null,null,null,null,null,null,{"$f":"I15+J8","v":0},{"$f":"J15+K8","v":0},0,0,0,0,0,0,0,0,0,0,0,0,0,0,0,0,0,0,0,0,0,0,0,0,0,0,0,0,0,0,0,0,0,0,1,2,3,4,5,6,7,8,9,10,11,12,13,14,15,16,17,18,19,20,21,22,23,24,25,26,27,28,29,{"$f":"BV15+BW8","v":30},31,32,33,34,35,36,37,38,39,40,41,42,43,44,45,46,47,48,49,50,51,52,53,54,55,56,57,58,59,60,60,60,60,60,60,60,60,60,60,60,60,60,60,60,60,60,60,60,60,60,60,60,60,60,60,60,60,60,60,60,60,60,60,{"$f":"EH15+EI8","v":60},60,60,60,60,60,60,60,60,60,60,60,60,60,60,60,60,60,60,60,60]
{"$rows_left_out":188}