{"text_format":"1","workbook":"xlsx","n_sheets":17,"sheets":["Information","Results","Brazil Resources","Flow Diagram","Plant Diagram","Replacement Example 1","Replacement Example 2","Replacement Example 3","Replacement Example 4","Degradation Example 1","Degradation Example 2","LCOs","Fin. Model Electroyzer","Fin. Model NH3","Consolidated","Adder for Construction Period","Stages"],"not_rendered":{"charts":4,"images":10,"macros":1,"external_links":0,"defined_names":0,"comments":2,"pivot_tables":0},"unopened":[],"bounds":{"document_bytes":16777216,"sheet_cells":100000,"rows_first":2000,"rows_last":500,"rows_between":2000,"halvings":0,"cell_chars":16384,"cell_head_chars":4096},"cells_cut":0,"cells_raw":0,"read":"whole","date_system":"1900"}

{"sheet":"Information","index":0,"n_rows":163,"n_cols":9,"rows_kept":163,"cut":false,"hidden":false,"merged":[]}
["Information"]
[null,"Based on Alklaline A-Series from NEL and Haber Bosch from Haldor Topsoe"]
[null,"Economic Analysis done by Massimiliano Cervo and Ed Bodmer with Excel, with Matlab and Information from Global Solar Atlas, HiSys"]
[null,"Cost Approximations done with Lead Software"]
[null,"Oxygen Sales Revenue is not considered in this Analysis."]
[null,"Based on AdAstra Project it could improve the IRR of the Overall Project Leveling the Ammonia Price"]
[null,"79% of Ammonia Demand for Fertilizer"]
[null,"CAGR 1.9% p.a for Ammonia Demand"]
[null,"Tipical Ammonia Plant produced 1500 Tn/Day"]
[null,"Mass and Energy Balance done with Sci Kit Learn with Curve Optimiser"]
[null,"Business Case for Investors -> Trasnporting Renewable Energy Overseas in the way of Ammonia"]
[null,"Ammonia is currently shipped at -33 Celsius and Ambient Pressure in LPG ships."]
[null,"Shipping Cost Depends on shipping distance and speed."]
[null,"Deadweight Tonnage is 90% of cargo weight."]
[null,"Shipping Cost -> 43 to 59 EUR/TnNH3 Distance: 13500 km"]
[null,"China consumes 33.7% of Global Ammonia Production"]
[null,"Europe Consumes 21.5% of Global Ammonia Production."]
[]
[null,"Inputs for the simulation"]
[null,null,null,"Energy Load Curves vs Time"]
{"$rows_left_out":144}
{"sheet":"Results","index":1,"n_rows":37,"n_cols":23,"rows_kept":37,"cut":false,"hidden":false,"merged":[]}
[null,null,"Amount",null,"Expense"]
[null,"Power",{"$f":"LCOs!F122","v":276315.42857142852},"MWh/Yr",{"$f":"LCOs!F124","v":6888543.6342857126},"USD/Yr",null,null,null,null,null,null,null,null,null,null,null,null,null,"Amount",null,"Expense"]
[null,null,null,null,null,null,null,null,null,null,null,null,null,null,null,null,null,null,"Power",{"$f":"LCOs!G86","v":3363840},"MWh/Yr",{"$f":"LCOs!G93","v":88064382.825993076},"USD/Yr"]
[null,"Air",{"$f":"LCOs!F114","v":354250.54945054936},"Tn/Yr"]
[null,null,null,null,null,null,null,null,null,null,null,null,null,null,null,null,null,null,"Water",{"$f":"LCOs!H79","v":660754.28571428568},"m3/Yr",{"$f":"LCOs!H81","v":330377.14285714284},"USD/Yr"]
[]
[]
[null,null,"Production",null,"Cost",null,null,null,null,null,null,null,null,null,null,null,null,null,null,"Production",null,"Cost"]
[null,"Nitrogen",{"$f":"LCOs!F116","v":276315.42857142852},"Tn/Yr",{"$f":"LCOs!F134","v":27.009070046289999},"USD/tNn2",null,null,null,null,null,null,null,null,null,null,null,null,"Hydrogen",{"$f":"LCOs!H108/1000","v":60068.571428571428},"Tn/Yr",{"$f":"LCOs!H110","v":2.0186382743553315},"USD/kgH2"]
[]
[]
[]
[null,null,"Amount",null,"Expense"]
[null,"Power",{"$f":"LCOs!F147","v":336383.99999999994},"MWh/Yr",{"$f":"LCOs!F149","v":8386053.1199999982},"USD/Yr"]
[]
[null,null,"Amount",null,"Expense"]
[null,"Power",{"$f":"LCOs!F179","v":261033.984},"MWh/Yr",{"$f":"LCOs!F181","v":6507577.2211199999},"USD/Yr"]
[]
[]
[]
{"$rows_left_out":18}
{"sheet":"Brazil Resources","index":2,"n_rows":0,"n_cols":0,"rows_kept":0,"cut":false,"hidden":false,"merged":[]}

{"sheet":"Flow Diagram","index":3,"n_rows":5,"n_cols":2,"rows_kept":5,"cut":false,"hidden":false,"merged":[]}
[null,"Power to Ammonia configuration. Commercially available today, Hydrogen compression can be done in one cycle vs the one from nitrgoen in 5 stages. LT = Low Temperature <100. HT = High Temperature >150 "]
[null,"Green Arrows mean Electricity Flow"]
[null,"Blue arrows mean the hydrogen ammonia flow."]
[null,"Orange arrows are waste heat."]
[null,"Red arrows are for the ammonia."]

{"sheet":"Plant Diagram","index":4,"n_rows":0,"n_cols":0,"rows_kept":0,"cut":false,"hidden":false,"merged":[]}

{"sheet":"Replacement Example 1","index":5,"n_rows":39,"n_cols":26,"rows_kept":39,"cut":false,"hidden":false,"merged":[]}
[]
[]
[null,"Inputs"]
[null,null,"Total Life",20]
[null,null,"Replacement",10]
[]
[null,null,"Initial Cost",100000]
[null,null,"Replacement",50000]
[]
[null,null,"Target IRR",0.1]
[null,null,"PMT for 20",{"$f":"PMT(D10,D4,-1)","v":0.11745962477254579}]
[null,null,"PMT for 10",{"$f":"PMT(D10,D5,-1)","v":0.16274539488251161}]
[]
[null,"LCOE Option 1"]
[]
[null,null,"Method 1 - Split","Base","Replacement","Total"]
[]
[null,null,"Cap Exp",{"$f":"D7-D8","v":50000},{"$f":"D8","v":50000},{"$f":"E18+D18","v":100000}]
[null,null,"Recovery Factor",{"$f":"D11","v":0.11745962477254579},{"$f":"D12","v":0.16274539488251161}]
[null,null,"Capital Recovery",{"$f":"D18*D19","v":5872.9812386272897},{"$f":"E18*E19","v":8137.2697441255805},{"$f":"E20+D20","v":14010.25098275287}]
{"$rows_left_out":20}
{"sheet":"Replacement Example 2","index":6,"n_rows":62,"n_cols":26,"rows_kept":62,"cut":false,"hidden":false,"merged":[]}
[]
[]
[null,"Inputs"]
[null,null,"Total Life",20]
[null,null,"Replacement",10]
[]
[null,null,"Initial Cost",100000]
[null,null,"Replacement",50000]
[]
[null,null,"Target IRR",0.1]
[null,null,"Tax Rate",0.3]
[]
[null,null,"PMT for 20",{"$f":"PMT(D10,D4,-1)","v":0.11745962477254579},{"$f":"_xlfn.FORMULATEXT(D13)","v":"=PMT(D10,D4,-1)"}]
[null,null,"PMT for 10",{"$f":"PMT(D10,D5,-1)","v":0.16274539488251161},{"$f":"_xlfn.FORMULATEXT(D14)","v":"=PMT(D10,D5,-1)"}]
[]
[null,null,"PV of Deprecaition 20",{"$f":"PV(D10,D4,-1/D4)","v":0.42567818598792828},{"$f":"_xlfn.FORMULATEXT(D16)","v":"=PV(D10,D4,-1/D4)"}]
[null,null,"PV of Deprecaition 10",{"$f":"PV(D10,D5,-1/D5)","v":0.61445671057046858},{"$f":"_xlfn.FORMULATEXT(D17)","v":"=PV(D10,D5,-1/D5)"}]
[]
[null,null,"Tax Shield 20",{"$f":"D16*D11","v":0.12770345579637848},{"$f":"_xlfn.FORMULATEXT(D19)","v":"=D16*D11"}]
[null,null,"Tax Shield 10",{"$f":"D17*D11","v":0.18433701317114057},{"$f":"_xlfn.FORMULATEXT(D20)","v":"=D17*D11"}]
{"$rows_left_out":43}
{"sheet":"Replacement Example 3","index":7,"n_rows":68,"n_cols":26,"rows_kept":68,"cut":false,"hidden":false,"merged":[]}
[]
[]
[null,"Inputs"]
[null,null,"Total Life",20]
[null,null,"Replacement",10]
[]
[null,null,"Initial Cost",100000]
[null,null,"Replacement",50000]
[]
[null,null,"Inflation Rate",0.03]
[]
[null,null,"Target Nominal IRR",0.1]
[null,null,"Target Real IRR",{"$f":"(1+D12)/(1+D10)-1","v":6.7961165048543659E-2},null,{"$f":"_xlfn.FORMULATEXT(D13)","v":"=(1+D12)/(1+D10)-1"}]
[]
[null,null,"Tax Rate",0.3]
[]
[null,null,"PMT for 20 Using Real Rate",{"$f":"PMT(D13,D4,-1)","v":9.2902382016399485E-2},null,{"$f":"_xlfn.FORMULATEXT(D17)","v":"=PMT(D13,D4,-1)"}]
[null,null,"PMT for 10 Using Real Rate",{"$f":"PMT(D13,D5,-1)","v":0.14103863100509456},null,{"$f":"_xlfn.FORMULATEXT(D18)","v":"=PMT(D13,D5,-1)"}]
[]
[null,null,"PV of Deprecaition 20 Using Nominal",{"$f":"PV(D12,D4,-1/D4)","v":0.42567818598792828},null,{"$f":"_xlfn.FORMULATEXT(D20)","v":"=PV(D12,D4,-1/D4)"}]
{"$rows_left_out":49}
{"sheet":"Replacement Example 4","index":8,"n_rows":100,"n_cols":26,"rows_kept":100,"cut":false,"hidden":false,"merged":[]}
[]
[]
[null,"Inputs"]
[null,null,"Total Life",20]
[null,null,"Replacement",12,null,{"$f":"D94","v":3.0000000000036886E-2}]
[]
[null,null,"Initial Cost",100000]
[null,null,"Replacement",50000]
[]
[null,null,"Inflation Rate",0.05]
[]
[null,null,"Target Nominal IRR",0.03]
[null,null,"Target Real IRR",{"$f":"(1+D12)/(1+D10)-1","v":-1.9047619047619091E-2},null,{"$f":"_xlfn.FORMULATEXT(D13)","v":"=(1+D12)/(1+D10)-1"}]
[]
[null,null,"Tax Rate",0]
[]
[null,null,{"$f":"\"PMT Using Real Rate \"&D4","v":"PMT Using Real Rate 20"},{"$f":"PMT(D13,D4,-1)","v":4.0607493101629741E-2},null,{"$f":"_xlfn.FORMULATEXT(D17)","v":"=PMT(D13,D4,-1)"}]
[null,null,{"$f":"\"PMT Using Real Rate \"&D5","v":"PMT Using Real Rate 12"},{"$f":"PMT(D13,D5,-1)","v":7.3379316119403432E-2},null,{"$f":"_xlfn.FORMULATEXT(D18)","v":"=PMT(D13,D5,-1)"}]
[]
[null,null,{"$f":"\"PV of Deprecaition Using Nominal \"&D4","v":"PV of Deprecaition Using Nominal 20"},{"$f":"PV(D12,D4,-1/D4)","v":0.74387374302277509},null,{"$f":"_xlfn.FORMULATEXT(D20)","v":"=PV(D12,D4,-1/D4)"}]
{"$rows_left_out":81}
{"sheet":"Degradation Example 1","index":9,"n_rows":48,"n_cols":27,"rows_kept":48,"cut":false,"hidden":false,"merged":[]}
[]
[]
[null,"Inputs"]
[null,null,"kW",null,100]
[null,null,"Cost",null,{"$f":"E4*1000","v":100000}]
[]
[null,null,"Efficiency","kWh/kg",55]
[null,null,"Degradation","%",0.01]
[null,null,"Electricity Cost","USD/MWH",30]
[null,null,"Load Factor","%",0.5]
[null,null,"Target IRR","%",0.1]
[]
[null,null,"Life","Years",20]
[]
[null,null,"LCOH - No Degradation"]
[null,null,"Capital Cost",null,{"$f":"PMT(E11,E13,-1)","v":0.11745962477254579},null,{"$f":"_xlfn.FORMULATEXT(E16)","v":"=PMT(E11,E13,-1)"}]
[null,null,"Recovery",null,{"$f":"E16*E5","v":11745.962477254579},null,{"$f":"_xlfn.FORMULATEXT(E17)","v":"=E16*E5"}]
[]
[null,null,"Electricity without Degradation",null,{"$f":"E4*E10*8760*E9/1000","v":13140},null,{"$f":"_xlfn.FORMULATEXT(E19)","v":"=E4*E10*8760*E9/1000"}]
[null,null,"Total Cost Including Capital Cost",null,{"$f":"E17+E19","v":24885.962477254579},null,{"$f":"_xlfn.FORMULATEXT(E20)","v":"=E17+E19"}]
{"$rows_left_out":29}
{"sheet":"Degradation Example 2","index":10,"n_rows":48,"n_cols":27,"rows_kept":48,"cut":false,"hidden":false,"merged":[]}
[]
[]
[null,"Inputs"]
[null,null,"Capacity","kW",100]
[null,null,"Cost","USD",{"$f":"E4*1000","v":100000}]
[]
[null,null,"Efficiency","kWh/kg",55]
[null,null,"Degradation","%",0.02]
[null,null,"Electricity Cost","USD/MWH",35]
[null,null,"Load Factor","%",0.5]
[null,null,"Target IRR","%",0.1]
[]
[null,null,"Life","Years",10]
[]
[null,null,"LCOH - No Degradation"]
[null,null,"Capital Cost","%",{"$f":"PMT(E11,E13,-1)","v":0.16274539488251161},null,{"$f":"_xlfn.FORMULATEXT(E16)","v":"=PMT(E11,E13,-1)"}]
[null,null,"Recovery","USD",{"$f":"E16*E5","v":16274.539488251161},null,{"$f":"_xlfn.FORMULATEXT(E17)","v":"=E16*E5"}]
[]
[null,null,"Electricity without Degradation","USD",{"$f":"E4*E10*8760*E9/1000","v":15330},null,{"$f":"_xlfn.FORMULATEXT(E19)","v":"=E4*E10*8760*E9/1000"}]
[null,null,"Total Cost Including Capital Cost","USD",{"$f":"E17+E19","v":31604.539488251161},null,{"$f":"_xlfn.FORMULATEXT(E20)","v":"=E17+E19"}]
{"$rows_left_out":29}
{"sheet":"LCOs","index":11,"n_rows":437,"n_cols":42,"rows_kept":437,"cut":false,"hidden":false,"merged":[[384,8,388,8],[352,8,356,8]]}
["Green Ammonia Pre-Feasibility"]
[null,null,null,null,null,"Power Cost","USD/MWH",{"$f":"F32","v":24.93}]
[null,null,null,null,null,"Hydrogen Cost","USD/kg H2",{"$f":"H110","v":2.0186382743553315},"Capital Cost/kW",{"$f":"F58","v":630},"Efficiency kWh/kg",{"$f":"H40","v":56}]
[null,null,null,null,null,"Air Separation","USD/Tn N",{"$f":"F134","v":27.009070046289999},"Capital Cost/Tn",{"$f":"F118","v":22},"Efficiency MWh/Tn",{"$f":"F117","v":0.9}]
[null,null,null,null,null,"Compression","USD/Tn NH3",{"$f":"F165","v":25.866112100405221},"Capital Cost/kW",{"$f":"F151","v":235.09},"Efficiency TnN/H2",{"$f":"F162","v":5.6}]
[null,null,null,null,null,"Ammonia","USD/Tn NH3",{"$f":"H221","v":512.44299558342664},"Capital Cost/kW",{"$f":"F191","v":487},"Efficiency TnN/H2"]
[]
[null,"Key Dates"]
[null,null,"Construction Date",null,"Date"]
[null,null,"Construction Period",null,"Year",1]
[null,null,"Operation Date",null,"Date"]
[null,null,"Operation Period",null,"Years",{"$f":"F14-F10","v":24}]
[null,null,"End of Life",null,"Date"]
[null,null,"Total Life",null,"Year",{"$f":"24+F10","v":25}]
[]
[null,"Economics"]
[null,null,null,"Inflation in Purchase Contracts","% p.a.",0]
[null,null,null,"Inflation in General O&M","% p.a.",3.2099999999999997E-2]
[null,null,null,"Declining Factor (1-SL)","Factor",1]
[null,null,null,"Tax Rate","%",0]
{"$rows_left_out":418}
{"sheet":"Fin. Model Electroyzer","index":12,"n_rows":92,"n_cols":40,"rows_kept":92,"cut":false,"hidden":false,"merged":[]}
[]
[null,null,null,"Important Outputs --->","Pre Tax IRR",{"$f":"F89","v":0.45800254482478286},null,null,"Construction",{"$f":"LCOs!$F$194","v":1}]
[null,null,null,null,"After Tax IRR"]
[null,null,null,null,"Equity IRR"]
[null,null,null,"Construction Period",{"$f":"E11","v":1},{"$f":"F11","v":"Years"},null,null,{"$f":"-E5+1","v":0},{"$f":"I5+1","v":1},{"$f":"J5+1","v":2},3,4,5,6,7,8,9,10,11,12,13,14,15,16,17,18,19,20,21,22,23,24,25,26,27,28,29,30,31]
[null,null,null,"Construction Phase",0,"Flag",null,null,{"$f":"I5<=$E$6","v":true},{"$f":"J5<=$E$6","v":false},false,false,false,false,false,false,false,false,false,false,false,false,false,false,false,false,false,false,false,false,false,false,false,false,false,false,false,false,false,false]
[null,null,null,"Operation Phase",{"$f":"E12","v":24},{"$f":"F12","v":"Years"},null,null,{"$f":"AND(I5>$E$6,I5<=$E$7)","v":false},{"$f":"AND(J5>$E$6,J5<=$E$7)","v":true},true,true,true,true,true,true,true,true,true,true,true,true,true,true,true,true,true,true,true,true,true,true,true,false,false,false,false,false,false,false]
[null,null,null,"Debt Repayment Phase",{"$f":"E18","v":20},"Years",null,null,{"$f":"AND(I5>$E$6,I5<=$E$8)","v":false},{"$f":"AND(J5>$E$6,J5<=$E$8)","v":true},true,true,true,true,true,true,true,true,true,true,true,true,true,true,true,true,true,true,true,false,false,false,false,false,false,false,false,false,false,false]
[null,"Assumptions"]
[null,null,"Timing"]
[null,null,null,"Construction Period",{"$f":"LCOs!F51","v":1},"Years"]
[null,null,null,"Operation Period",{"$f":"LCOs!F12","v":24},"Years"]
[null,null,null,"Project Lifetime Including Constructino",{"$f":"LCOs!F14","v":25},"Years"]
[]
[null,null,"Debt & Equity Financing"]
[null,null,null,"Debt Percent",0.7,"%"]
[null,null,null,"Debt Commitment",{"$f":"Results!R31*E16","v":234383234.82760942},"USD"]
[null,null,null,"Debt Tenor",20,"Years"]
[null,null,null,"Interest Rate",6.2E-2,"%"]
[]
{"$rows_left_out":73}
{"sheet":"Fin. Model NH3","index":13,"n_rows":91,"n_cols":40,"rows_kept":91,"cut":false,"hidden":false,"merged":[]}
[]
[null,null,null,"Important Outputs --->","Pre Tax IRR",{"$f":"F88","v":7.9400000000000137E-2},null,null,"Construction",{"$f":"LCOs!$F$194","v":1},{"$f":"LCOs!F10","v":1}]
[null,null,null,null,"After Tax IRR"]
[null,null,null,null,"Equity IRR"]
[null,null,null,"Construction Period",{"$f":"E11","v":1},{"$f":"F11","v":"Years"},null,null,{"$f":"-E5+1","v":0},{"$f":"I5+1","v":1},{"$f":"J5+1","v":2},3,4,5,6,7,8,9,10,11,12,13,14,15,16,17,18,19,20,21,22,23,24,25,26,27,28,29,30,31]
[null,null,null,"Construction Phase",0,"Flag",null,null,{"$f":"I5<=$E$6","v":true},{"$f":"J5<=$E$6","v":false},false,false,false,false,false,false,false,false,false,false,false,false,false,false,false,false,false,false,false,false,false,false,false,false,false,false,false,false,false,false]
[null,null,null,"Operation Phase",{"$f":"E12","v":24},{"$f":"F12","v":"Years"},null,null,{"$f":"AND(I5>$E$6,I5<=$E$7)","v":false},{"$f":"AND(J5>$E$6,J5<=$E$7)","v":true},true,true,true,true,true,true,true,true,true,true,true,true,true,true,true,true,true,true,true,true,true,true,true,false,false,false,false,false,false,false]
[null,null,null,"Debt Repayment Phase",{"$f":"E24","v":20},"Years",null,null,{"$f":"AND(I5>$E$6,I5<=$E$8)","v":false},{"$f":"AND(J5>$E$6,J5<=$E$8)","v":true},true,true,true,true,true,true,true,true,true,true,true,true,true,true,true,true,true,true,true,false,false,false,false,false,false,false,false,false,false,false]
[null,"Assumptions"]
[null,null,"Timing"]
[null,null,null,"Construction Period",{"$f":"LCOs!F10","v":1},"Years"]
[null,null,null,"Operation Period",{"$f":"LCOs!F12","v":24},"Years"]
[null,null,null,"Project Lifetime",{"$f":"LCOs!F14","v":25},"Years"]
[]
[null,null,"Tax and Depreciation"]
[null,null,null,"Depreciation Life",{"$f":"E13","v":25}]
[null,null,null,"Declining Factor (1-SL)",{"$f":"LCOs!F19","v":1}]
[null,null,null,"Tax Rate",{"$f":"LCOs!F20","v":0}]
[null,null,null,"Inflation Rate",{"$f":"LCOs!F17","v":0}]
[]
{"$rows_left_out":72}
{"sheet":"Consolidated","index":14,"n_rows":71,"n_cols":40,"rows_kept":71,"cut":false,"hidden":false,"merged":[]}
[]
[null,null,null,"Important Outputs --->","Pre Tax IRR",{"$f":"F68","v":{"$error":"#VALUE!"}},null,null,"Construction",{"$f":"LCOs!$F$194","v":1}]
[null,null,null,null,"After Tax IRR"]
[null,null,null,null,"Equity IRR"]
[null,null,null,"Construction Period",{"$f":"E11","v":1},{"$f":"F11","v":"Years"},null,null,{"$f":"-E5+1","v":0},{"$f":"I5+1","v":1},{"$f":"J5+1","v":2},3,4,5,6,7,8,9,10,11,12,13,14,15,16,17,18,19,20,21,22,23,24,25,26,27,28,29,30,31]
[null,null,null,"Construction Phase",0,"Flag",null,null,{"$f":"I5<=$E$6","v":true},{"$f":"J5<=$E$6","v":false},false,false,false,false,false,false,false,false,false,false,false,false,false,false,false,false,false,false,false,false,false,false,false,false,false,false,false,false,false,false]
[null,null,null,"Operation Phase",{"$f":"E12","v":24},{"$f":"F12","v":"Years"},null,null,{"$f":"AND(I5>$E$6,I5<=$E$7)","v":false},{"$f":"AND(J5>$E$6,J5<=$E$7)","v":true},true,true,true,true,true,true,true,true,true,true,true,true,true,true,true,true,true,true,true,true,true,true,true,false,false,false,false,false,false,false]
[null,null,null,"Debt Repayment Phase",{"$f":"#REF!","v":{"$error":"#REF!"}},"Years",null,null,{"$f":"AND(I5>$E$6,I5<=$E$8)","v":{"$error":"#REF!"}},{"$f":"AND(J5>$E$6,J5<=$E$8)","v":{"$error":"#REF!"}},{"$error":"#REF!"},{"$error":"#REF!"},{"$error":"#REF!"},{"$error":"#REF!"},{"$error":"#REF!"},{"$error":"#REF!"},{"$error":"#REF!"},{"$error":"#REF!"},{"$error":"#REF!"},{"$error":"#REF!"},{"$error":"#REF!"},{"$error":"#REF!"},{"$error":"#REF!"},{"$error":"#REF!"},{"$error":"#REF!"},{"$error":"#REF!"},{"$error":"#REF!"},{"$error":"#REF!"},{"$error":"#REF!"},{"$error":"#REF!"},{"$error":"#REF!"},{"$error":"#REF!"},{"$error":"#REF!"},{"$error":"#REF!"},{"$error":"#REF!"},{"$error":"#REF!"},{"$error":"#REF!"},{"$error":"#REF!"},{"$error":"#REF!"},{"$error":"#REF!"}]
[null,"Assumptions"]
[null,null,"Timing"]
[null,null,null,"Construction Period",{"$f":"LCOs!F10","v":1},"Years"]
[null,null,null,"Operation Period",{"$f":"LCOs!F12","v":24},"Years"]
[null,null,null,"Project Lifetime",{"$f":"LCOs!F14","v":25},"Years"]
[]
[]
[]
[null,"Operation Analysis for Consolidation",null,null,null,null,"Check"]
[]
[null,null,"Total Revenues"]
[null,null,null,"Ammonia Revenues","USD/Yr",null,null,null,{"$f":"LOOKUP(I5,'Fin. Model NH3'!5:5,'Fin. Model NH3'!40:40)","v":0},{"$f":"LOOKUP(J5,'Fin. Model NH3'!5:5,'Fin. Model NH3'!40:40)","v":167206295.88754532},{"$f":"LOOKUP(K5,'Fin. Model NH3'!5:5,'Fin. Model NH3'!40:40)","v":167206295.88754532},{"$f":"LOOKUP(L5,'Fin. Model NH3'!5:5,'Fin. Model NH3'!40:40)","v":167206295.88754532},{"$f":"LOOKUP(M5,'Fin. Model NH3'!5:5,'Fin. Model NH3'!40:40)","v":167206295.88754532},{"$f":"LOOKUP(N5,'Fin. Model NH3'!5:5,'Fin. Model NH3'!40:40)","v":167206295.88754532},{"$f":"LOOKUP(O5,'Fin. Model NH3'!5:5,'Fin. Model NH3'!40:40)","v":167206295.88754532},{"$f":"LOOKUP(P5,'Fin. Model NH3'!5:5,'Fin. Model NH3'!40:40)","v":167206295.88754532},{"$f":"LOOKUP(Q5,'Fin. Model NH3'!5:5,'Fin. Model NH3'!40:40)","v":167206295.88754532},{"$f":"LOOKUP(R5,'Fin. Model NH3'!5:5,'Fin. Model NH3'!40:40)","v":167206295.88754532},{"$f":"LOOKUP(S5,'Fin. Model NH3'!5:5,'Fin. Model NH3'!40:40)","v":167206295.88754532},{"$f":"LOOKUP(T5,'Fin. Model NH3'!5:5,'Fin. Model NH3'!40:40)","v":167206295.88754532},{"$f":"LOOKUP(U5,'Fin. Model NH3'!5:5,'Fin. Model NH3'!40:40)","v":167206295.88754532},{"$f":"LOOKUP(V5,'Fin. Model NH3'!5:5,'Fin. Model NH3'!40:40)","v":167206295.88754532},{"$f":"LOOKUP(W5,'Fin. Model NH3'!5:5,'Fin. Model NH3'!40:40)","v":167206295.88754532},{"$f":"LOOKUP(X5,'Fin. Model NH3'!5:5,'Fin. Model NH3'!40:40)","v":167206295.88754532},{"$f":"LOOKUP(Y5,'Fin. Model NH3'!5:5,'Fin. Model NH3'!40:40)","v":167206295.88754532},{"$f":"LOOKUP(Z5,'Fin. Model NH3'!5:5,'Fin. Model NH3'!40:40)","v":167206295.88754532},{"$f":"LOOKUP(AA5,'Fin. Model NH3'!5:5,'Fin. Model NH3'!40:40)","v":167206295.88754532},{"$f":"LOOKUP(AB5,'Fin. Model NH3'!5:5,'Fin. Model NH3'!40:40)","v":167206295.88754532},{"$f":"LOOKUP(AC5,'Fin. Model NH3'!5:5,'Fin. Model NH3'!40:40)","v":167206295.88754532},{"$f":"LOOKUP(AD5,'Fin. Model NH3'!5:5,'Fin. Model NH3'!40:40)","v":167206295.88754532},{"$f":"LOOKUP(AE5,'Fin. Model NH3'!5:5,'Fin. Model NH3'!40:40)","v":167206295.88754532},{"$f":"LOOKUP(AF5,'Fin. Model NH3'!5:5,'Fin. Model NH3'!40:40)","v":167206295.88754532},{"$f":"LOOKUP(AG5,'Fin. Model NH3'!5:5,'Fin. Model NH3'!40:40)","v":167206295.88754532},{"$f":"LOOKUP(AH5,'Fin. Model NH3'!5:5,'Fin. Model NH3'!40:40)","v":0},{"$f":"LOOKUP(AI5,'Fin. Model NH3'!5:5,'Fin. Model NH3'!40:40)","v":0},{"$f":"LOOKUP(AJ5,'Fin. Model NH3'!5:5,'Fin. Model NH3'!40:40)","v":0},{"$f":"LOOKUP(AK5,'Fin. Model NH3'!5:5,'Fin. Model NH3'!40:40)","v":0},{"$f":"LOOKUP(AL5,'Fin. Model NH3'!5:5,'Fin. Model NH3'!40:40)","v":0},{"$f":"LOOKUP(AM5,'Fin. Model NH3'!5:5,'Fin. Model NH3'!40:40)","v":0},{"$f":"LOOKUP(AN5,'Fin. Model NH3'!5:5,'Fin. Model NH3'!40:40)","v":0}]
{"$rows_left_out":52}
{"sheet":"Adder for Construction Period","index":15,"n_rows":40,"n_cols":10,"rows_kept":40,"cut":false,"hidden":false,"merged":[]}
[]
[null,null,null,"Target IRR",0.1]
[]
[null,null,null,"Construction",1]
[null,null,null,"Period",null,1,2,3,4,5]
[null,null,null,"Construction Period",{"$f":"E4","v":1},{"$f":"F5<=$E$6","v":true},{"$f":"G5<=$E$6","v":false},false,false,false]
[null,null,null,"Operation Period",{"$f":"E4+1","v":2},{"$f":"F5=$E$7","v":false},{"$f":"G5=$E$7","v":true},false,false,false]
[]
[null,null,null,"Total Cost",1000,{"$f":"$E$9*F6","v":1000},{"$f":"$E$9*G6","v":0},0,0,0]
[null,null,null,"S-Curve",{"$f":"1/E4","v":1},{"$f":"$E$10*F6*F9","v":1000},{"$f":"$E$10*G6*G9","v":0},0,0,0]
[null,null,null,"Cash Flow",{"$f":"E19","v":1100.0000000000014},{"$f":"$E$11*F7","v":0},{"$f":"$E$11*G7","v":1100.0000000000014},0,0,0]
[null,null,null,"Net Cash Flow",null,{"$f":"F11-F10","v":-1000},{"$f":"G11-G10","v":1100.0000000000014},0,0,0]
[null,null,null,"IRR",{"$f":"IRR(12:12)","v":0.10000000000000142}]
[]
[null,null,null,"LCOE with Construction",{"$f":"E9","v":1000}]
[null,null,null,"Compound Factor for Construction",{"$f":"FV(E2,E4,-1/E4)","v":1.0000000000000009},null,{"$f":"_xlfn.FORMULATEXT(E16)","v":"=FV(E2,E4,-1/E4)"}]
[null,null,null,"Adjusted Cost",{"$f":"E15*E16","v":1000.0000000000009},null,{"$f":"_xlfn.FORMULATEXT(E17)","v":"=E15*E16"}]
[null,null,null,"PMT factor for One Year",{"$f":"PMT(E2,1,-1)","v":1.1000000000000003},null,{"$f":"_xlfn.FORMULATEXT(E18)","v":"=PMT(E2,1,-1)"}]
[null,null,null,"Total Cost Recovery",{"$f":"E17*E18","v":1100.0000000000014},null,{"$f":"_xlfn.FORMULATEXT(E19)","v":"=E17*E18"}]
[]
{"$rows_left_out":21}
{"sheet":"Stages","index":16,"n_rows":23,"n_cols":15,"rows_kept":23,"cut":false,"hidden":false,"merged":[]}
["Conceptual Design (CD)",null,null,null,null,null,null,"Basic Design: FEED",null,null,null,null,null,null,"Detailed Design"]
["Purpose of Project",null,null,null,null,null,null,"Well Design package to run feasibility from CD. Estimate around +/-10%",null,null,null,null,null,null,"Leads to AFC (Approved for Construction)"]
["Location of Plant",null,null,null,null,null,null,"Startup Package for Detailed Design (DD)",null,null,null,null,null,null,"Electrical, Instrumentation, Structural, Building Layout."]
["Overall Cost (+/- 30%)",null,null,null,null,null,null,null,null,null,null,null,null,null,"Construction Details."]
[null,null,null,null,null,null,null,"Deliver:",null,null,null,null,null,null,"Installation Details."]
["Deliver:",null,null,null,null,null,null,"Process Flow Diagrams",null,null,null,null,null,null,"Commissioning Details."]
["Overall Production",null,null,null,null,null,null,"P&Es",null,null,null,null,null,null,"Start Up and Maintenance Details."]
["Overall Requirements",null,null,null,null,null,null,"Process Simulations/Calculations."]
["Overall Block Flow Diagram",null,null,null,null,null,null,"Equipment Lists"]
["Preliminary Study",null,null,null,null,null,null,"Instrument Lists"]
["Overall Cost Estimate",null,null,null,null,null,null,"Site Plans"]
[null,null,null,null,null,null,null,"Plot Plans (Overall Layout approved)"]
["Conceive and plan the structure of the system.",null,null,null,null,null,null,"Preliminary Equipment Specifications (Datasheets)"]
["Define the Scope."]
[null,null,null,null,null,null,null,"Basic study to allow everyone to agree on the exact scope of work. "]
["If CD approved by BOD (Board of Directors) proceed to Basic Design",null,null,null,null,null,null,"FEED is necessary for Project Finance"]
["Source: PMI."]
[]
[]
[]
{"$rows_left_out":3}