{"text_format":"1","workbook":"xlsx","n_sheets":15,"sheets":["Menu","Control","Project Database","Sizing Summary","Template","General Inputs","MA SMART PRICING","Production Tables","Economics","PROJECTS","New Marlborough","Peru","Russell","Westport","Tolland"],"not_rendered":{"charts":0,"images":0,"macros":1,"external_links":0,"defined_names":76,"comments":7,"pivot_tables":0},"unopened":[],"bounds":{"document_bytes":16777216,"sheet_cells":100000,"rows_first":2000,"rows_last":500,"rows_between":2000,"halvings":0,"cell_chars":16384,"cell_head_chars":4096},"cells_cut":0,"cells_raw":0,"read":"whole","date_system":"1900"}

{"sheet":"Menu","index":0,"n_rows":94,"n_cols":13,"rows_kept":94,"cut":false,"hidden":false,"merged":[]}
[]
[null,null,"Menu"]
[null,null,null,null,null," Colour Codes ",null,null,null,null," File Name: ",null,{"$f":"IFERROR(File_name(),\"\")","v":""}]
[null,null,"Control",null,null,null," Inputs ",null,"1234567890"]
[null,null,null,null,null,null," Section Titles ",null,"TITLE ROW",null," Last Save Date ",null,{"$f":"IFERROR(lastsaved(),\"\")","v":""}]
[null,null,"Project Database",null,null,null," Sum Column ",null,"1000000000"]
[null,null,null,"General Inputs",null,null," True or 1 ",null,{"$f":"1=1","v":true},null," Last Save By",null,{"$f":"IFERROR(last_save_by(),\"\")","v":""}]
[null,null,null,"O&M Cost Inputs",null,null," False or 0 ",null,{"$f":"1=2","v":false}]
{"$rows_left_out":87}
{"sheet":"Control","index":1,"n_rows":20,"n_cols":50,"rows_kept":20,"cut":false,"hidden":false,"merged":[]}
["          "]
[null,null,null,"Operation Sensitivity",null,"Scenario Number",8]
[null,null,null,"Senior Debt Sizing - P50"]
[null,null,null,"Senior Debt Sizing - P99"]
[null,null,null,"Credit Analysis"]
[null,null,null,"Outputs"]
[]
[null,null,null,null,null,"Dates",null,null,null,null,"Senior Debt Sizing Assumptions in P50 Case",null,null,null,null,null,null,null,"Senior P99/Downside Case Debt Sizing",null,null,null,null,null,"Operation Sensitivity for Credit Analysis (After Debt Size)",null,null,null,null,null,null,"Results - Debt Characteristics",null,null,null,null,null,null,null,"Results - Credit Analysis"]
{"$rows_left_out":13}
{"sheet":"Project Database","index":2,"n_rows":165,"n_cols":9,"rows_kept":165,"cut":false,"hidden":false,"merged":[]}
["          "]
[]
[null,"General Inputs"]
[null,null,null,null,{"$f":"E6","v":"New Marlborough"},{"$f":"F6","v":"Peru"},{"$f":"G6","v":"Russell"},{"$f":"CONCATENATE(H6)","v":"Westport"},{"$f":"I6","v":"Tolland"}]
[null,null,null,"Developer","Cap Vert Energie","Cap Vert Energie","Cap Vert Energie","Cap Vert Energie","Cap Vert Energie"]
[null,null,null,"Site Name","New Marlborough","Peru","Russell","Westport","Tolland"]
[null,null,null,"Location","New Marlborough, MA","Peru, MA","Russell, MA","Westport, MA","Tolland, MA"]
[null,null,null,"NERC Region","ISONE - WCMA","ISONE - WCMA","ISONE - WCMA","ISONE - SEMA","ISONE - WCMA"]
{"$rows_left_out":158}
{"sheet":"Sizing Summary","index":3,"n_rows":98,"n_cols":46,"rows_kept":98,"cut":false,"hidden":false,"merged":[]}
["          "]
[]
[null,null,null,null,null,null,{"$f":"Template!I3","v":"2020-12-31"},{"$f":"Template!J3","v":"2021-12-31"},{"$f":"Template!K3","v":"2022-12-31"},{"$f":"Template!L3","v":"2023-12-31"},{"$f":"Template!M3","v":"2024-12-31"},{"$f":"Template!N3","v":"2025-12-31"},{"$f":"Template!O3","v":"2026-12-31"},{"$f":"Template!P3","v":"2027-12-31"},{"$f":"Template!Q3","v":"2028-12-31"},{"$f":"Template!R3","v":"2029-12-31"},{"$f":"Template!S3","v":"2030-12-31"},{"$f":"Template!T3","v":"2031-12-31"},{"$f":"Template!U3","v":"2032-12-31"},{"$f":"Template!V3","v":"2033-12-31"},{"$f":"Template!W3","v":"2034-12-31"},{"$f":"Template!X3","v":"2035-12-31"},{"$f":"Template!Y3","v":"2036-12-31"},{"$f":"Template!Z3","v":"2037-12-31"},{"$f":"Template!AA3","v":"2038-12-31"},{"$f":"Template!AB3","v":"2039-12-31"},{"$f":"Template!AC3","v":"2040-12-31"},{"$f":"Template!AD3","v":"2041-12-31"},{"$f":"Template!AE3","v":"2042-12-31"},{"$f":"Template!AF3","v":"2043-12-31"},{"$f":"Template!AG3","v":"2044-12-31"},{"$f":"Template!AH3","v":"2045-12-31"},{"$f":"Template!AI3","v":"2046-12-31"},{"$f":"Template!AJ3","v":"2047-12-31"},{"$f":"Template!AK3","v":"2048-12-31"},{"$f":"Template!AL3","v":"2049-12-31"},{"$f":"Template!AM3","v":"2050-12-31"},{"$f":"Template!AN3","v":"2051-12-31"},{"$f":"Template!AO3","v":"2052-12-31"},{"$f":"Template!AP3","v":"2053-12-31"},{"$f":"Template!AQ3","v":"2054-12-31"},{"$f":"Template!AR3","v":"2055-12-31"},{"$f":"Template!AS3","v":"2056-12-31"},{"$f":"Template!AT3","v":"2057-12-31"},{"$f":"Template!AU3","v":"2058-12-31"},{"$f":"Template!AV3","v":"2059-12-31"}]
[]
[]
[]
[null,null,null,null,null,{"$f":"Template!H164","v":"H"},{"$f":"Template!I164","v":"I"},{"$f":"Template!J164","v":"J"},{"$f":"Template!K164","v":"K"},{"$f":"Template!L164","v":"L"},{"$f":"Template!M164","v":"M"},{"$f":"Template!N164","v":"N"},{"$f":"Template!O164","v":"O"},{"$f":"Template!P164","v":"P"},{"$f":"Template!Q164","v":"Q"},{"$f":"Template!R164","v":"R"},{"$f":"Template!S164","v":"S"},{"$f":"Template!T164","v":"T"},{"$f":"Template!U164","v":"U"},{"$f":"Template!V164","v":"V"},{"$f":"Template!W164","v":"W"},{"$f":"Template!X164","v":"X"},{"$f":"Template!Y164","v":"Y"},{"$f":"Template!Z164","v":"Z"},{"$f":"Template!AA164","v":"A"},{"$f":"Template!AB164","v":"A"},{"$f":"Template!AC164","v":"A"},{"$f":"Template!AD164","v":"A"},{"$f":"Template!AE164","v":"A"},{"$f":"Template!AF164","v":"A"},{"$f":"Template!AG164","v":"A"},{"$f":"Template!AH164","v":"A"},{"$f":"Template!AI164","v":"A"},{"$f":"Template!AJ164","v":"A"},{"$f":"Template!AK164","v":"A"},{"$f":"Template!AL164","v":"A"},{"$f":"Template!AM164","v":"A"},{"$f":"Template!AN164","v":"A"},{"$f":"Template!AO164","v":"A"},{"$f":"Template!AP164","v":"A"},{"$f":"Template!AQ164","v":"A"},{"$f":"Template!AR164","v":"A"},{"$f":"Template!AS164","v":"A"},{"$f":"Template!AT164","v":"A"},{"$f":"Template!AU164","v":"A"},{"$f":"Template!AV164","v":"A"}]
[null,null,null,"Loan size as a % of total"]
{"$rows_left_out":91}
{"sheet":"Template","index":4,"n_rows":164,"n_cols":81,"rows_kept":164,"cut":false,"hidden":false,"merged":[]}
["          ",null,null,"New Marlborough",null,"Column Number",{"$f":"MATCH(D1,'Project Database'!4:4,0)","v":5}]
[]
[null,null,null,"Date of Model","Months in Period",{"$f":"'General Inputs'!F7","v":12},null,{"$f":"'General Inputs'!F6-1","v":"2019-12-31"},{"$f":"EDATE(H3,$F$3)","v":"2020-12-31"},{"$f":"EDATE(I3,$F$3)","v":"2021-12-31"},"2022-12-31","2023-12-31","2024-12-31","2025-12-31","2026-12-31","2027-12-31","2028-12-31","2029-12-31","2030-12-31","2031-12-31","2032-12-31","2033-12-31","2034-12-31","2035-12-31","2036-12-31","2037-12-31","2038-12-31","2039-12-31","2040-12-31","2041-12-31","2042-12-31","2043-12-31","2044-12-31","2045-12-31","2046-12-31","2047-12-31","2048-12-31","2049-12-31","2050-12-31","2051-12-31","2052-12-31","2053-12-31","2054-12-31","2055-12-31","2056-12-31","2057-12-31","2058-12-31","2059-12-31"]
[null,null,null,"Month of Model","Month  ",null,null,{"$f":"MONTH(H3)","v":12},12,12,12,12,12,12,12,12,12,12,12,12,12,12,12,12,12,12,12,12,12,12,12,12,12,12,12,12,12,12,12,12,12,12,12,12,12,12,12,12]
[null,null,null,"Year of Model","Year ",null,null,{"$f":"YEAR(H3)","v":2019},{"$f":"YEAR(I3)","v":2020},{"$f":"YEAR(J3)","v":2021},2022,2023,2024,2025,2026,2027,2028,2029,2030,2031,2032,2033,2034,2035,2036,2037,2038,2039,2040,2041,2042,2043,2044,2045,2046,2047,2048,2049,2050,2051,2052,2053,2054,2055,2056,2057,2058,2059]
[null,null,null,"New Year Flag","Flag",null,null,null,{"$f":"I5<>H5","v":true},{"$f":"J5<>I5","v":true},true,true,true,true,true,true,true,true,true,true,true,true,true,true,true,true,true,true,true,true,true,true,true,true,true,true,true,true,true,true,true,true,true,true,true,true,true,true]
[null,null,null,"Year Counter for Row Number","Period",null,null,0,1,{"$f":"I7+1","v":2},{"$f":"J7+1","v":3},4,5,6,7,8,9,10,11,12,13,14,15,16,17,18,19,20,{"$f":"AB7+1","v":21},22,23,24,25,26,27,28,29,30,31,32,33,34,35,36,37,38,39,40]
[null,null,null,"Project Life","Flag",{"$f":"INDEX('Project Database'!11:11,colum_num)","v":20},null,null,{"$f":"I7<=$F$8","v":true},true,true,true,true,true,true,true,true,true,true,true,true,true,true,true,true,true,true,true,false,false,false,false,false,false,false,false,false,false,false,false,false,false,false,false,false,false,false,false]
{"$rows_left_out":157}
{"sheet":"General Inputs","index":5,"n_rows":30,"n_cols":45,"rows_kept":30,"cut":false,"hidden":false,"merged":[]}
["          "]
[null,null,null,null,null,null,null,null,null,null,null,null,"comment",true]
[]
[]
[]
[null,null,null,"Start Date of Model",null,"2020-01-01"]
[null,null,null,"Months in Period in Model",null,12]
[]
{"$rows_left_out":23}
{"sheet":"MA SMART PRICING","index":6,"n_rows":129,"n_cols":21,"rows_kept":129,"cut":false,"hidden":false,"merged":[]}
["          "]
[]
["Basic Service Rate Projections ($/kWh)",null,null,null,null,null,null,null,null,null,"CVE SMART Portfolio Project Name",null,null,null,null,"Tolland","Russell","Westport","Peru","Westhampton","New Marlborough"]
[null,"Assumed Rate Inflation",5.0000000000000001E-3,5.0000000000000001E-3,5.0000000000000001E-3,5.0000000000000001E-3,5.0000000000000001E-3,5.0000000000000001E-3]
[null,"Project Name","Tolland","Russell","Westport","Peru","Westhampton","New Marlborough",null,null,"Total Project Revenue Rate Breakdown (Yr 1 - 2020)"]
[null,"Utility","Eversource WCMA/WMECO","Eversource WCMA/WMECO","Eversource SEMA/Nstar","Eversource WCMA/WMECO","Eversource WCMA/WMECO","National Grid WCMA",null,null,null,"SMART Incentive Payment Effective Rate",null,null,null,6.8080000000000002E-2,4.7759999999999997E-2,9.7890000000000005E-2,5.5910000000000015E-2,5.9880000000000017E-2,{"$f":"U22-U11","v":7.893E-2}]
[null,2020,{"$f":"AVERAGE(P37:P38)","v":0.10968},{"$f":"AVERAGE(Q37:Q38)","v":0.10968},{"$f":"AVERAGE(R37:R38)","v":0.11288000000000001},{"$f":"AVERAGE(S37:S38)","v":0.10968},{"$f":"AVERAGE(T37:T38)","v":0.10968},{"$f":"AVERAGE(U38:U39)","v":0.10300000000000001},null,null,"(+)","Basic Service Rate",null,null,null,{"$f":"P11","v":0.10968},0.10968,0.11288000000000001,0.10968,0.10968,0.10300000000000001]
[null,{"$f":"B7+1","v":2021},{"$f":"C7*(1+C$4)","v":0.11022839999999999},0.11022839999999999,0.1134444,0.11022839999999999,0.11022839999999999,{"$f":"H7*(1+H$4)","v":0.103515},null,null,"(-)","10% Customer Discount on Basic Service Rate",null,null,null,{"$f":"P11*P12","v":1.0968E-2},1.0968E-2,1.1288000000000001E-2,1.0968E-2,1.0968E-2,1.0300000000000002E-2]
{"$rows_left_out":122}
{"sheet":"Production Tables","index":7,"n_rows":42,"n_cols":42,"rows_kept":42,"cut":false,"hidden":false,"merged":[]}
["          "]
[]
[null,null,null,0.8,"P90","P99","Loan Amount","Weight","Production","Weights"]
[null,null,"Tolland",0.8,{"$f":"AO42","v":0.92186239483692523},{"$f":"AP42","v":0.8581306903307595},{"$f":"INDEX('Sizing Summary'!#REF!,MATCH('Production Tables'!C4,'Sizing Summary'!#REF!,0))","v":{"$error":"#REF!"}},null,{"$f":"AM14","v":8677},{"$f":"I4/$I$9","v":0.2691126756195143},null,"Weighted Avg P90",{"$f":"SUMPRODUCT(J4:J8,E4:E8)","v":0.91263219923704375},null,"P99",{"$f":"SUMPRODUCT(J4:J8,F4:F8)","v":0.84142294451508848}]
[null,null,"Westport",{"$f":"S42","v":0.95618838992332966},{"$f":"T42","v":0.91653888280394302},{"$f":"U42","v":0.84863088718510404},{"$f":"INDEX('Sizing Summary'!#REF!,MATCH('Production Tables'!C5,'Sizing Summary'!#REF!,0))","v":{"$error":"#REF!"}},null,{"$f":"R14","v":4565},{"$f":"I5/$I$9","v":0.14158111838228452},null,"Haircut:",{"$f":"1-M4","v":8.7367800762956249E-2},null,"Haircut:",{"$f":"1-P4","v":0.15857705548491152}]
[null,null,"Russell",{"$f":"AG42","v":0.94972280634677886},{"$f":"AH42","v":0.90460714968457279},{"$f":"AI42","v":0.82680175874593764},{"$f":"INDEX('Sizing Summary'!#REF!,MATCH('Production Tables'!C6,'Sizing Summary'!#REF!,0))","v":{"$error":"#REF!"}},null,{"$f":"AF14","v":5231},{"$f":"I6/$I$9","v":0.16223676456905375}]
[null,null,"Peru",{"$f":"Z42","v":0.94971771347918132},{"$f":"AA42","v":0.90455187014820038},{"$f":"AB42","v":0.82674664784756524},{"$f":"INDEX('Sizing Summary'!#REF!,MATCH('Production Tables'!C7,'Sizing Summary'!#REF!,0))","v":{"$error":"#REF!"}},null,{"$f":"Y14","v":5668},{"$f":"I7/$I$9","v":0.17579009397388581}]
[null,null,"New Marlborough",{"$f":"E42","v":0.9533448531226858},{"$f":"F42","v":0.91137990619600096},{"$f":"G42","v":0.83917551221920517},null,null,{"$f":"D14","v":8102},{"$f":"I8/$I$9","v":0.25127934745526159}]
{"$rows_left_out":35}
{"sheet":"Economics","index":8,"n_rows":25,"n_cols":18,"rows_kept":25,"cut":false,"hidden":false,"merged":[]}
["          "]
[]
[]
[null,"Source","Amount",null,null,null,"Scenario 1:",null,null,null,null,null,null,"Scenario 2:"]
[null,"Loan Amount",null,null,null,null,"summary:",null,null,null,null,null,null,"summary:"]
[null,"Origination Fee",null,null,null,null,"Senior Loan:",30908950.869708136,null,"Sub Loan:",3209049.1302918652,null,null,"Senior Loan:",34118000,null,"Sub Loan:",3586608.381897151]
[null,"Series A Proceeds",null,null,null,null,"Senior Rate",20,null,"Sub Term",20,null,null,"Senior Rate",20,null,"Sub Term",20]
[null,"Series B Proceeds",null,null,null,null,"Senior Term",4.3499999999999997E-2,3.7499999999999999E-2,"Sub Rate",6.7279220350933561E-2,0.08,null,"Senior Term",4.4999999999999998E-2,null,"Sub Rate",9.2694214343264539E-2]
{"$rows_left_out":18}
{"sheet":"PROJECTS","index":9,"n_rows":1,"n_cols":1,"rows_kept":1,"cut":false,"hidden":false,"merged":[]}
["          "]

{"sheet":"New Marlborough","index":10,"n_rows":155,"n_cols":48,"rows_kept":155,"cut":false,"hidden":false,"merged":[]}
["          ",null,null,"New Marlborough",null,"Column Number",{"$f":"MATCH(D1,'Project Database'!4:4,0)","v":5}]
[]
[null,null,null,"Date of Model","Months in Period",{"$f":"'General Inputs'!F7","v":12},null,{"$f":"'General Inputs'!F6-1","v":"2019-12-31"},{"$f":"EDATE(H3,$F$3)","v":"2020-12-31"},{"$f":"EDATE(I3,$F$3)","v":"2021-12-31"},"2022-12-31","2023-12-31","2024-12-31","2025-12-31","2026-12-31","2027-12-31","2028-12-31","2029-12-31","2030-12-31","2031-12-31","2032-12-31","2033-12-31","2034-12-31","2035-12-31","2036-12-31","2037-12-31","2038-12-31","2039-12-31","2040-12-31","2041-12-31","2042-12-31","2043-12-31","2044-12-31","2045-12-31","2046-12-31","2047-12-31","2048-12-31","2049-12-31","2050-12-31","2051-12-31","2052-12-31","2053-12-31","2054-12-31","2055-12-31","2056-12-31","2057-12-31","2058-12-31","2059-12-31"]
[null,null,null,"Month of Model","Month  ",null,null,{"$f":"MONTH(H3)","v":12},12,12,12,12,12,12,12,12,12,12,12,12,12,12,12,12,12,12,12,12,12,12,12,12,12,12,12,12,12,12,12,12,12,12,12,12,12,12,12,12]
[null,null,null,"Year of Model","Year ",null,null,{"$f":"YEAR(H3)","v":2019},{"$f":"YEAR(I3)","v":2020},{"$f":"YEAR(J3)","v":2021},2022,2023,2024,2025,2026,2027,2028,2029,2030,2031,2032,2033,2034,2035,2036,2037,2038,2039,2040,2041,2042,2043,2044,2045,2046,2047,2048,2049,2050,2051,2052,2053,2054,2055,2056,2057,2058,2059]
[null,null,null,"New Year Flag","Flag",null,null,null,{"$f":"I5<>H5","v":true},{"$f":"J5<>I5","v":true},true,true,true,true,true,true,true,true,true,true,true,true,true,true,true,true,true,true,true,true,true,true,true,true,true,true,true,true,true,true,true,true,true,true,true,true,true,true]
[null,null,null,"Year Counter for Row Number","Period",null,null,0,1,{"$f":"I7+1","v":2},{"$f":"J7+1","v":3},4,5,6,7,8,9,10,11,12,13,14,15,16,17,18,19,20,21,22,23,24,25,26,27,28,29,30,31,32,33,34,35,36,37,38,39,40]
[null,null,null,"Project Life","Flag",{"$f":"INDEX('Project Database'!11:11,colum_num)","v":20},null,null,{"$f":"I7<=$F$8","v":true},true,true,true,true,true,true,true,true,true,true,true,true,true,true,true,true,true,true,true,false,false,false,false,false,false,false,false,false,false,false,false,false,false,false,false,false,false,false,false]
{"$rows_left_out":148}
{"sheet":"Peru","index":11,"n_rows":155,"n_cols":48,"rows_kept":155,"cut":false,"hidden":false,"merged":[]}
["          ",null,null,"Peru",null,"Column Number",{"$f":"MATCH(D1,'Project Database'!4:4,0)","v":6}]
[]
[null,null,null,"Date of Model","Months in Period",{"$f":"'General Inputs'!F7","v":12},null,{"$f":"'General Inputs'!F6-1","v":"2019-12-31"},{"$f":"EDATE(H3,$F$3)","v":"2020-12-31"},{"$f":"EDATE(I3,$F$3)","v":"2021-12-31"},"2022-12-31","2023-12-31","2024-12-31","2025-12-31","2026-12-31","2027-12-31","2028-12-31","2029-12-31","2030-12-31","2031-12-31","2032-12-31","2033-12-31","2034-12-31","2035-12-31","2036-12-31","2037-12-31","2038-12-31","2039-12-31","2040-12-31","2041-12-31","2042-12-31","2043-12-31","2044-12-31","2045-12-31","2046-12-31","2047-12-31","2048-12-31","2049-12-31","2050-12-31","2051-12-31","2052-12-31","2053-12-31","2054-12-31","2055-12-31","2056-12-31","2057-12-31","2058-12-31","2059-12-31"]
[null,null,null,"Month of Model","Month  ",null,null,{"$f":"MONTH(H3)","v":12},12,12,12,12,12,12,12,12,12,12,12,12,12,12,12,12,12,12,12,12,12,12,12,12,12,12,12,12,12,12,12,12,12,12,12,12,12,12,12,12]
[null,null,null,"Year of Model","Year ",null,null,{"$f":"YEAR(H3)","v":2019},{"$f":"YEAR(I3)","v":2020},{"$f":"YEAR(J3)","v":2021},2022,2023,2024,2025,2026,2027,2028,2029,2030,2031,2032,2033,2034,2035,2036,2037,2038,2039,2040,2041,2042,2043,2044,2045,2046,2047,2048,2049,2050,2051,2052,2053,2054,2055,2056,2057,2058,2059]
[null,null,null,"New Year Flag","Flag",null,null,null,{"$f":"I5<>H5","v":true},{"$f":"J5<>I5","v":true},true,true,true,true,true,true,true,true,true,true,true,true,true,true,true,true,true,true,true,true,true,true,true,true,true,true,true,true,true,true,true,true,true,true,true,true,true,true]
[null,null,null,"Year Counter for Row Number","Period",null,null,0,1,{"$f":"I7+1","v":2},{"$f":"J7+1","v":3},4,5,6,7,8,9,10,11,12,13,14,15,16,17,18,19,20,21,22,23,24,25,26,27,28,29,30,31,32,33,34,35,36,37,38,39,40]
[null,null,null,"Project Life","Flag",{"$f":"INDEX('Project Database'!11:11,colum_num)","v":20},null,null,{"$f":"I7<=$F$8","v":true},true,true,true,true,true,true,true,true,true,true,true,true,true,true,true,true,true,true,true,false,false,false,false,false,false,false,false,false,false,false,false,false,false,false,false,false,false,false,false]
{"$rows_left_out":148}
{"sheet":"Russell","index":12,"n_rows":155,"n_cols":48,"rows_kept":155,"cut":false,"hidden":false,"merged":[]}
["          ",null,null,"Russell",null,"Column Number",{"$f":"MATCH(D1,'Project Database'!4:4,0)","v":7}]
[]
[null,null,null,"Date of Model","Months in Period",{"$f":"'General Inputs'!F7","v":12},null,{"$f":"'General Inputs'!F6-1","v":"2019-12-31"},{"$f":"EDATE(H3,$F$3)","v":"2020-12-31"},{"$f":"EDATE(I3,$F$3)","v":"2021-12-31"},"2022-12-31","2023-12-31","2024-12-31","2025-12-31","2026-12-31","2027-12-31","2028-12-31","2029-12-31","2030-12-31","2031-12-31","2032-12-31","2033-12-31","2034-12-31","2035-12-31","2036-12-31","2037-12-31","2038-12-31","2039-12-31","2040-12-31","2041-12-31","2042-12-31","2043-12-31","2044-12-31","2045-12-31","2046-12-31","2047-12-31","2048-12-31","2049-12-31","2050-12-31","2051-12-31","2052-12-31","2053-12-31","2054-12-31","2055-12-31","2056-12-31","2057-12-31","2058-12-31","2059-12-31"]
[null,null,null,"Month of Model","Month  ",null,null,{"$f":"MONTH(H3)","v":12},12,12,12,12,12,12,12,12,12,12,12,12,12,12,12,12,12,12,12,12,12,12,12,12,12,12,12,12,12,12,12,12,12,12,12,12,12,12,12,12]
[null,null,null,"Year of Model","Year ",null,null,{"$f":"YEAR(H3)","v":2019},{"$f":"YEAR(I3)","v":2020},{"$f":"YEAR(J3)","v":2021},2022,2023,2024,2025,2026,2027,2028,2029,2030,2031,2032,2033,2034,2035,2036,2037,2038,2039,2040,2041,2042,2043,2044,2045,2046,2047,2048,2049,2050,2051,2052,2053,2054,2055,2056,2057,2058,2059]
[null,null,null,"New Year Flag","Flag",null,null,null,{"$f":"I5<>H5","v":true},{"$f":"J5<>I5","v":true},true,true,true,true,true,true,true,true,true,true,true,true,true,true,true,true,true,true,true,true,true,true,true,true,true,true,true,true,true,true,true,true,true,true,true,true,true,true]
[null,null,null,"Year Counter for Row Number","Period",null,null,0,1,{"$f":"I7+1","v":2},{"$f":"J7+1","v":3},4,5,6,7,8,9,10,11,12,13,14,15,16,17,18,19,20,21,22,23,24,25,26,27,28,29,30,31,32,33,34,35,36,37,38,39,40]
[null,null,null,"Project Life","Flag",{"$f":"INDEX('Project Database'!11:11,colum_num)","v":20},null,null,{"$f":"I7<=$F$8","v":true},true,true,true,true,true,true,true,true,true,true,true,true,true,true,true,true,true,true,true,false,false,false,false,false,false,false,false,false,false,false,false,false,false,false,false,false,false,false,false]
{"$rows_left_out":148}
{"sheet":"Westport","index":13,"n_rows":155,"n_cols":48,"rows_kept":155,"cut":false,"hidden":false,"merged":[]}
["          ",null,null,"Westport",null,"Column Number",{"$f":"MATCH(D1,'Project Database'!4:4,0)","v":8}]
[]
[null,null,null,"Date of Model","Months in Period",{"$f":"'General Inputs'!F7","v":12},null,{"$f":"'General Inputs'!F6-1","v":"2019-12-31"},{"$f":"EDATE(H3,$F$3)","v":"2020-12-31"},{"$f":"EDATE(I3,$F$3)","v":"2021-12-31"},"2022-12-31","2023-12-31","2024-12-31","2025-12-31","2026-12-31","2027-12-31","2028-12-31","2029-12-31","2030-12-31","2031-12-31","2032-12-31","2033-12-31","2034-12-31","2035-12-31","2036-12-31","2037-12-31","2038-12-31","2039-12-31","2040-12-31","2041-12-31","2042-12-31","2043-12-31","2044-12-31","2045-12-31","2046-12-31","2047-12-31","2048-12-31","2049-12-31","2050-12-31","2051-12-31","2052-12-31","2053-12-31","2054-12-31","2055-12-31","2056-12-31","2057-12-31","2058-12-31","2059-12-31"]
[null,null,null,"Month of Model","Month  ",null,null,{"$f":"MONTH(H3)","v":12},12,12,12,12,12,12,12,12,12,12,12,12,12,12,12,12,12,12,12,12,12,12,12,12,12,12,12,12,12,12,12,12,12,12,12,12,12,12,12,12]
[null,null,null,"Year of Model","Year ",null,null,{"$f":"YEAR(H3)","v":2019},{"$f":"YEAR(I3)","v":2020},{"$f":"YEAR(J3)","v":2021},2022,2023,2024,2025,2026,2027,2028,2029,2030,2031,2032,2033,2034,2035,2036,2037,2038,2039,2040,2041,2042,2043,2044,2045,2046,2047,2048,2049,2050,2051,2052,2053,2054,2055,2056,2057,2058,2059]
[null,null,null,"New Year Flag","Flag",null,null,null,{"$f":"I5<>H5","v":true},{"$f":"J5<>I5","v":true},true,true,true,true,true,true,true,true,true,true,true,true,true,true,true,true,true,true,true,true,true,true,true,true,true,true,true,true,true,true,true,true,true,true,true,true,true,true]
[null,null,null,"Year Counter for Row Number","Period",null,null,0,1,{"$f":"I7+1","v":2},{"$f":"J7+1","v":3},4,5,6,7,8,9,10,11,12,13,14,15,16,17,18,19,20,21,22,23,24,25,26,27,28,29,30,31,32,33,34,35,36,37,38,39,40]
[null,null,null,"Project Life","Flag",{"$f":"INDEX('Project Database'!11:11,colum_num)","v":20},null,null,{"$f":"I7<=$F$8","v":true},true,true,true,true,true,true,true,true,true,true,true,true,true,true,true,true,true,true,true,false,false,false,false,false,false,false,false,false,false,false,false,false,false,false,false,false,false,false,false]
{"$rows_left_out":148}
{"sheet":"Tolland","index":14,"n_rows":155,"n_cols":48,"rows_kept":155,"cut":false,"hidden":false,"merged":[]}
["          ",null,null,"Tolland",null,"Column Number",{"$f":"MATCH(D1,'Project Database'!4:4,0)","v":9}]
[]
[null,null,null,"Date of Model","Months in Period",{"$f":"'General Inputs'!F7","v":12},null,{"$f":"'General Inputs'!F6-1","v":"2019-12-31"},{"$f":"EDATE(H3,$F$3)","v":"2020-12-31"},{"$f":"EDATE(I3,$F$3)","v":"2021-12-31"},"2022-12-31","2023-12-31","2024-12-31","2025-12-31","2026-12-31","2027-12-31","2028-12-31","2029-12-31","2030-12-31","2031-12-31","2032-12-31","2033-12-31","2034-12-31","2035-12-31","2036-12-31","2037-12-31","2038-12-31","2039-12-31","2040-12-31","2041-12-31","2042-12-31","2043-12-31","2044-12-31","2045-12-31","2046-12-31","2047-12-31","2048-12-31","2049-12-31","2050-12-31","2051-12-31","2052-12-31","2053-12-31","2054-12-31","2055-12-31","2056-12-31","2057-12-31","2058-12-31","2059-12-31"]
[null,null,null,"Month of Model","Month  ",null,null,{"$f":"MONTH(H3)","v":12},12,12,12,12,12,12,12,12,12,12,12,12,12,12,12,12,12,12,12,12,12,12,12,12,12,12,12,12,12,12,12,12,12,12,12,12,12,12,12,12]
[null,null,null,"Year of Model","Year ",null,null,{"$f":"YEAR(H3)","v":2019},{"$f":"YEAR(I3)","v":2020},{"$f":"YEAR(J3)","v":2021},2022,2023,2024,2025,2026,2027,2028,2029,2030,2031,2032,2033,2034,2035,2036,2037,2038,2039,2040,2041,2042,2043,2044,2045,2046,2047,2048,2049,2050,2051,2052,2053,2054,2055,2056,2057,2058,2059]
[null,null,null,"New Year Flag","Flag",null,null,null,{"$f":"I5<>H5","v":true},{"$f":"J5<>I5","v":true},true,true,true,true,true,true,true,true,true,true,true,true,true,true,true,true,true,true,true,true,true,true,true,true,true,true,true,true,true,true,true,true,true,true,true,true,true,true]
[null,null,null,"Year Counter for Row Number","Period",null,null,0,1,{"$f":"I7+1","v":2},{"$f":"J7+1","v":3},4,5,6,7,8,9,10,11,12,13,14,15,16,17,18,19,20,21,22,23,24,25,26,27,28,29,30,31,32,33,34,35,36,37,38,39,40]
[null,null,null,"Project Life","Flag",{"$f":"INDEX('Project Database'!11:11,colum_num)","v":20},null,null,{"$f":"I7<=$F$8","v":true},true,true,true,true,true,true,true,true,true,true,true,true,true,true,true,true,true,true,true,false,false,false,false,false,false,false,false,false,false,false,false,false,false,false,false,false,false,false,false]
{"$rows_left_out":147}