{"text_format":"1","workbook":"xlsx","n_sheets":2,"sheets":["Inputs","Model"],"not_rendered":{"charts":0,"images":0,"macros":1,"external_links":0,"defined_names":3,"comments":0,"pivot_tables":0},"unopened":[],"bounds":{"document_bytes":16777216,"sheet_cells":100000,"rows_first":2000,"rows_last":500,"rows_between":2000,"halvings":0,"cell_chars":16384,"cell_head_chars":4096},"cells_cut":0,"cells_raw":0,"read":"whole","date_system":"1900"}

{"sheet":"Inputs","index":0,"n_rows":62,"n_cols":55,"rows_kept":62,"cut":false,"hidden":false,"merged":[]}
[]
[null,"Time Line"]
[null,null,"Total Life",null,"Years",30]
[null,null,"Construction",null,"Years",1]
[null,null,"Debt Periods/year",null,"Period",2]
[]
[null,"Operating"]
[null,null,"Output",null,"MWH",1000]
[null,null,"Seasonality",null,"First, Second",1.2,0.8]
[]
[null,null,"Yield",null,"kWh/kWp",2500]
[null,null,"Implied kWp",null,"kWp",{"$f":"F8/F11*1000","v":400}]
[]
[]
[null,"Prices, Costs and Cap Exp"]
[null,null,"PPA Price",null,"Sols/MWH",80]
[]
[null,null,"Cap Exp",null,"USD/kWp",700]
[null,null,"Cap Exp",null,"Sols/MWH",{"$f":"F18*4","v":2800}]
[]
[null,null,"Op Exp",null,"USD/kWy",15]
[null,null,"Op Exp",null,"Sols/kWy",{"$f":"F21*4","v":60}]
[]
[null,null,"Total Cap Exp",null,"Sols",{"$f":"F19*F12","v":1120000}]
[null,null,"Total Op Exp",null,"Sols",{"$f":"F22*F12","v":24000}]
[]
[null,"Macro Economic"]
[null,null,"Sol Inflation Code",null,null,1]
[]
[null,null,null,null,null,null,2022,2023,2024,2025,2026,2027,2028,2029,2030,2031,2032,2033,2034,2035,2036,2037,2038,2039,2040,2041,2042,2043,2044,2045,2046,2047,2048,2049,2050,2051,2052,2053,2054,2055,2056,2057,2058,2059,2060,2061,2062,2063,2064,2065,2066,2067,2068,2069,2070]
{"$rows_left_out":33}
{"sheet":"Model","index":1,"n_rows":167,"n_cols":69,"rows_kept":167,"cut":false,"hidden":false,"merged":[]}
[]
[null,"Time Line"]
[null,null,"Periods",null,null,null,null,null,0,1,2,3,4,5,6,7,8,9,10,11,12,13,14,15,16,17,18,19,20,21,22,23,24,25,26,27,28,29,30,31,32,33,34,35,36,37,38,39,40,41,42,43,44,45,46,47,48,49,50,51,52,53,54,55,56,57,58,59,60]
[null,null,"Year",null,null,null,null,null,2022,{"$f":"IF(J10,I4,I4+1)","v":2023},{"$f":"IF(K10,J4,J4+1)","v":2023},2024,2024,2025,2025,2026,2026,2027,2027,2028,2028,2029,2029,2030,2030,2031,2031,2032,2032,2033,2033,2034,2034,2035,2035,2036,2036,2037,2037,2038,2038,2039,2039,2040,2040,2041,2041,2042,2042,2043,2043,2044,2044,2045,2045,2046,2046,2047,2047,2048,2048,2049,2049,2050,2050,2051,2051,2052,2052]
[null,null,"Construction",null,null,{"$f":"Inputs!F4","v":1},null,null,{"$f":"I3<$F$5","v":true},{"$f":"J3<$F$5","v":false},false,false,false,false,false,false,false,false,false,false,false,false,false,false,false,false,false,false,false,false,false,false,false,false,false,false,false,false,false,false,false,false,false,false,false,false,false,false,false,false,false,false,false,false,false,false,false,false,false,false,false,false,false,false,false,false,false,false,false]
[null,null,"Operating",null,null,{"$f":"Inputs!F3","v":30},{"$f":"Inputs!F5","v":2},null,{"$f":"AND(NOT(I5),I3<$F$6*$G$6)","v":false},{"$f":"AND(NOT(J5),J3<$F$6*$G$6)","v":true},true,true,true,true,true,true,true,true,true,true,true,true,true,true,true,true,true,true,true,true,true,true,true,true,true,true,true,true,true,true,true,true,true,true,true,true,true,true,true,true,true,true,true,true,true,true,true,true,true,true,true,true,true,true,true,true,true,true,false]
[null,null,"Exchange Rate",null,null,"SOL/USD",null,null,{"$f":"LOOKUP(I4,Inputs!30:30,Inputs!47:47)","v":4},{"$f":"I7*(1+J16)/(1+J17)","v":4.1148558704955214},{"$f":"J7*(1+K16)/(1+K17)","v":4.233009708737864},4.3545562124661341,4.4795927985672543,4.6082196811534821,4.7405399518818516,4.8766596625798986,5.0166879102439008,5.1607369244777566,5.3089221574425753,5.4613623763890828,5.6181797588469973,5.7794999905476701,5.9454523661584728,6.1161698929096699,6.2917893971968306,6.472451634244214,6.6583014009170345,6.8494876517730034,7.0461636184461822,7.2484869324588104,7.4566197515595523,7.6707288896894203,7.8909859506795277,8.1175674657878343,8.350655035185131,8.5904354735036321,8.8371009595648502,9.0908491904067592,9.351883539733679,9.6204132209158928,9.8966534546696217,10.180825641551769,10.473157539407657,10.773883445914008,11.083244386363443,11.401488306841037,11.728870272947722,12.065652674229836,12.41210543447866,12.768506228068469,13.135140702506543,13.512302707373431,13.900294529837023,14.299427136929166,14.710020424778987,15.132403475002711,15.566914818455434,16.013902706556266,16.473725390404294,16.946751407909058,17.433359879165707,17.933940810311526,18.448895406107397,18.978636391494721,19.523588342385498,20.084188025950723,20.660884750679799,21.254140726491542,21.86443143518542]
[]
[null,"Operations"]
[null,null,"Seasonal Flag",null,"Flag",null,null,null,{"$f":"MOD(I3,2)=0","v":true},{"$f":"MOD(J3,2)=0","v":false},true,false,true,false,true,false,true,false,true,false,true,false,true,false,true,false,true,false,true,false,true,false,true,false,true,false,true,false,true,false,true,false,true,false,true,false,true,false,true,false,true,false,true,false,true,false,true,false,true,false,true,false,true,false,true,false,true,false,true]
[null,null,"Generation",null,"MWH",{"$f":"Inputs!F8","v":1000},null,null,{"$f":"$F$11*I6","v":0},{"$f":"$F$11*J6","v":1000},1000,1000,1000,1000,1000,1000,1000,1000,1000,1000,1000,1000,1000,1000,1000,1000,1000,1000,1000,1000,1000,1000,1000,1000,1000,1000,1000,1000,1000,1000,1000,1000,1000,1000,1000,1000,1000,1000,1000,1000,1000,1000,1000,1000,1000,1000,1000,1000,1000,1000,1000,1000,1000,1000,1000,1000,1000,1000,0]
[null,null,"Seasonality",null,"Factor",{"$f":"Inputs!F9","v":1.2},{"$f":"Inputs!G9","v":0.8},null,{"$f":"IF(I10,$F$12,$G$12)","v":1.2},{"$f":"IF(J10,$F$12,$G$12)","v":0.8},1.2,0.8,1.2,0.8,1.2,0.8,1.2,0.8,1.2,0.8,1.2,0.8,1.2,0.8,1.2,0.8,1.2,0.8,1.2,0.8,1.2,0.8,1.2,0.8,1.2,0.8,1.2,0.8,1.2,0.8,1.2,0.8,1.2,0.8,1.2,0.8,1.2,0.8,1.2,0.8,1.2,0.8,1.2,0.8,1.2,0.8,1.2,0.8,1.2,0.8,1.2,0.8,1.2,0.8,1.2,0.8,1.2,0.8,1.2]
[null,null,"Seasonal Generation",null,"MWH",null,null,null,{"$f":"I12*I11","v":0},{"$f":"J12*J11","v":800},1200,800,1200,800,1200,800,1200,800,1200,800,1200,800,1200,800,1200,800,1200,800,1200,800,1200,800,1200,800,1200,800,1200,800,1200,800,1200,800,1200,800,1200,800,1200,800,1200,800,1200,800,1200,800,1200,800,1200,800,1200,800,1200,800,1200,800,1200,800,1200,800,0]
[]
[null,"Macro-econonic"]
[null,null,"Sol Inflation",null,null,null,null,null,{"$f":"(1+LOOKUP(I4,Inputs!30:30,Inputs!36:36))^(1/2)-1","v":0},{"$f":"(1+LOOKUP(J4,Inputs!30:30,Inputs!36:36))^(1/2)-1","v":4.4030650891055068E-2},{"$f":"(1+LOOKUP(K4,Inputs!30:30,Inputs!36:36))^(1/2)-1","v":4.4030650891055068E-2},{"$f":"(1+LOOKUP(L4,Inputs!30:30,Inputs!36:36))^(1/2)-1","v":4.4030650891055068E-2},{"$f":"(1+LOOKUP(M4,Inputs!30:30,Inputs!36:36))^(1/2)-1","v":4.4030650891055068E-2},{"$f":"(1+LOOKUP(N4,Inputs!30:30,Inputs!36:36))^(1/2)-1","v":4.4030650891055068E-2},{"$f":"(1+LOOKUP(O4,Inputs!30:30,Inputs!36:36))^(1/2)-1","v":4.4030650891055068E-2},{"$f":"(1+LOOKUP(P4,Inputs!30:30,Inputs!36:36))^(1/2)-1","v":4.4030650891055068E-2},{"$f":"(1+LOOKUP(Q4,Inputs!30:30,Inputs!36:36))^(1/2)-1","v":4.4030650891055068E-2},{"$f":"(1+LOOKUP(R4,Inputs!30:30,Inputs!36:36))^(1/2)-1","v":4.4030650891055068E-2},{"$f":"(1+LOOKUP(S4,Inputs!30:30,Inputs!36:36))^(1/2)-1","v":4.4030650891055068E-2},{"$f":"(1+LOOKUP(T4,Inputs!30:30,Inputs!36:36))^(1/2)-1","v":4.4030650891055068E-2},{"$f":"(1+LOOKUP(U4,Inputs!30:30,Inputs!36:36))^(1/2)-1","v":4.4030650891055068E-2},{"$f":"(1+LOOKUP(V4,Inputs!30:30,Inputs!36:36))^(1/2)-1","v":4.4030650891055068E-2},{"$f":"(1+LOOKUP(W4,Inputs!30:30,Inputs!36:36))^(1/2)-1","v":4.4030650891055068E-2},{"$f":"(1+LOOKUP(X4,Inputs!30:30,Inputs!36:36))^(1/2)-1","v":4.4030650891055068E-2},{"$f":"(1+LOOKUP(Y4,Inputs!30:30,Inputs!36:36))^(1/2)-1","v":4.4030650891055068E-2},{"$f":"(1+LOOKUP(Z4,Inputs!30:30,Inputs!36:36))^(1/2)-1","v":4.4030650891055068E-2},{"$f":"(1+LOOKUP(AA4,Inputs!30:30,Inputs!36:36))^(1/2)-1","v":4.4030650891055068E-2},{"$f":"(1+LOOKUP(AB4,Inputs!30:30,Inputs!36:36))^(1/2)-1","v":4.4030650891055068E-2},{"$f":"(1+LOOKUP(AC4,Inputs!30:30,Inputs!36:36))^(1/2)-1","v":4.4030650891055068E-2},{"$f":"(1+LOOKUP(AD4,Inputs!30:30,Inputs!36:36))^(1/2)-1","v":4.4030650891055068E-2},{"$f":"(1+LOOKUP(AE4,Inputs!30:30,Inputs!36:36))^(1/2)-1","v":4.4030650891055068E-2},{"$f":"(1+LOOKUP(AF4,Inputs!30:30,Inputs!36:36))^(1/2)-1","v":4.4030650891055068E-2},{"$f":"(1+LOOKUP(AG4,Inputs!30:30,Inputs!36:36))^(1/2)-1","v":4.4030650891055068E-2},{"$f":"(1+LOOKUP(AH4,Inputs!30:30,Inputs!36:36))^(1/2)-1","v":4.4030650891055068E-2},{"$f":"(1+LOOKUP(AI4,Inputs!30:30,Inputs!36:36))^(1/2)-1","v":4.4030650891055068E-2},{"$f":"(1+LOOKUP(AJ4,Inputs!30:30,Inputs!36:36))^(1/2)-1","v":4.4030650891055068E-2},{"$f":"(1+LOOKUP(AK4,Inputs!30:30,Inputs!36:36))^(1/2)-1","v":4.4030650891055068E-2},{"$f":"(1+LOOKUP(AL4,Inputs!30:30,Inputs!36:36))^(1/2)-1","v":4.4030650891055068E-2},{"$f":"(1+LOOKUP(AM4,Inputs!30:30,Inputs!36:36))^(1/2)-1","v":4.4030650891055068E-2},{"$f":"(1+LOOKUP(AN4,Inputs!30:30,Inputs!36:36))^(1/2)-1","v":4.4030650891055068E-2},{"$f":"(1+LOOKUP(AO4,Inputs!30:30,Inputs!36:36))^(1/2)-1","v":4.4030650891055068E-2},{"$f":"(1+LOOKUP(AP4,Inputs!30:30,Inputs!36:36))^(1/2)-1","v":4.4030650891055068E-2},{"$f":"(1+LOOKUP(AQ4,Inputs!30:30,Inputs!36:36))^(1/2)-1","v":4.4030650891055068E-2},{"$f":"(1+LOOKUP(AR4,Inputs!30:30,Inputs!36:36))^(1/2)-1","v":4.4030650891055068E-2},{"$f":"(1+LOOKUP(AS4,Inputs!30:30,Inputs!36:36))^(1/2)-1","v":4.4030650891055068E-2},{"$f":"(1+LOOKUP(AT4,Inputs!30:30,Inputs!36:36))^(1/2)-1","v":4.4030650891055068E-2},{"$f":"(1+LOOKUP(AU4,Inputs!30:30,Inputs!36:36))^(1/2)-1","v":4.4030650891055068E-2},{"$f":"(1+LOOKUP(AV4,Inputs!30:30,Inputs!36:36))^(1/2)-1","v":4.4030650891055068E-2},{"$f":"(1+LOOKUP(AW4,Inputs!30:30,Inputs!36:36))^(1/2)-1","v":4.4030650891055068E-2},{"$f":"(1+LOOKUP(AX4,Inputs!30:30,Inputs!36:36))^(1/2)-1","v":4.4030650891055068E-2},{"$f":"(1+LOOKUP(AY4,Inputs!30:30,Inputs!36:36))^(1/2)-1","v":4.4030650891055068E-2},{"$f":"(1+LOOKUP(AZ4,Inputs!30:30,Inputs!36:36))^(1/2)-1","v":4.4030650891055068E-2},{"$f":"(1+LOOKUP(BA4,Inputs!30:30,Inputs!36:36))^(1/2)-1","v":4.4030650891055068E-2},{"$f":"(1+LOOKUP(BB4,Inputs!30:30,Inputs!36:36))^(1/2)-1","v":4.4030650891055068E-2},{"$f":"(1+LOOKUP(BC4,Inputs!30:30,Inputs!36:36))^(1/2)-1","v":4.4030650891055068E-2},{"$f":"(1+LOOKUP(BD4,Inputs!30:30,Inputs!36:36))^(1/2)-1","v":4.4030650891055068E-2},{"$f":"(1+LOOKUP(BE4,Inputs!30:30,Inputs!36:36))^(1/2)-1","v":4.4030650891055068E-2},{"$f":"(1+LOOKUP(BF4,Inputs!30:30,Inputs!36:36))^(1/2)-1","v":4.4030650891055068E-2},{"$f":"(1+LOOKUP(BG4,Inputs!30:30,Inputs!36:36))^(1/2)-1","v":4.4030650891055068E-2},{"$f":"(1+LOOKUP(BH4,Inputs!30:30,Inputs!36:36))^(1/2)-1","v":4.4030650891055068E-2},{"$f":"(1+LOOKUP(BI4,Inputs!30:30,Inputs!36:36))^(1/2)-1","v":4.4030650891055068E-2},{"$f":"(1+LOOKUP(BJ4,Inputs!30:30,Inputs!36:36))^(1/2)-1","v":4.4030650891055068E-2},{"$f":"(1+LOOKUP(BK4,Inputs!30:30,Inputs!36:36))^(1/2)-1","v":4.4030650891055068E-2},{"$f":"(1+LOOKUP(BL4,Inputs!30:30,Inputs!36:36))^(1/2)-1","v":4.4030650891055068E-2},{"$f":"(1+LOOKUP(BM4,Inputs!30:30,Inputs!36:36))^(1/2)-1","v":4.4030650891055068E-2},{"$f":"(1+LOOKUP(BN4,Inputs!30:30,Inputs!36:36))^(1/2)-1","v":4.4030650891055068E-2},{"$f":"(1+LOOKUP(BO4,Inputs!30:30,Inputs!36:36))^(1/2)-1","v":4.4030650891055068E-2},{"$f":"(1+LOOKUP(BP4,Inputs!30:30,Inputs!36:36))^(1/2)-1","v":4.4030650891055068E-2},{"$f":"(1+LOOKUP(BQ4,Inputs!30:30,Inputs!36:36))^(1/2)-1","v":4.4030650891055068E-2}]
[null,null,"USD Inflation",null,null,null,null,null,{"$f":"(1+LOOKUP(I4,Inputs!39:39,Inputs!45:45))^(1/2)-1","v":0},{"$f":"(1+LOOKUP(J4,Inputs!39:39,Inputs!45:45))^(1/2)-1","v":1.4889156509221957E-2},{"$f":"(1+LOOKUP(K4,Inputs!39:39,Inputs!45:45))^(1/2)-1","v":1.4889156509221957E-2},{"$f":"(1+LOOKUP(L4,Inputs!39:39,Inputs!45:45))^(1/2)-1","v":1.4889156509221957E-2},{"$f":"(1+LOOKUP(M4,Inputs!39:39,Inputs!45:45))^(1/2)-1","v":1.4889156509221957E-2},{"$f":"(1+LOOKUP(N4,Inputs!39:39,Inputs!45:45))^(1/2)-1","v":1.4889156509221957E-2},{"$f":"(1+LOOKUP(O4,Inputs!39:39,Inputs!45:45))^(1/2)-1","v":1.4889156509221957E-2},{"$f":"(1+LOOKUP(P4,Inputs!39:39,Inputs!45:45))^(1/2)-1","v":1.4889156509221957E-2},{"$f":"(1+LOOKUP(Q4,Inputs!39:39,Inputs!45:45))^(1/2)-1","v":1.4889156509221957E-2},{"$f":"(1+LOOKUP(R4,Inputs!39:39,Inputs!45:45))^(1/2)-1","v":1.4889156509221957E-2},{"$f":"(1+LOOKUP(S4,Inputs!39:39,Inputs!45:45))^(1/2)-1","v":1.4889156509221957E-2},{"$f":"(1+LOOKUP(T4,Inputs!39:39,Inputs!45:45))^(1/2)-1","v":1.4889156509221957E-2},{"$f":"(1+LOOKUP(U4,Inputs!39:39,Inputs!45:45))^(1/2)-1","v":1.4889156509221957E-2},{"$f":"(1+LOOKUP(V4,Inputs!39:39,Inputs!45:45))^(1/2)-1","v":1.4889156509221957E-2},{"$f":"(1+LOOKUP(W4,Inputs!39:39,Inputs!45:45))^(1/2)-1","v":1.4889156509221957E-2},{"$f":"(1+LOOKUP(X4,Inputs!39:39,Inputs!45:45))^(1/2)-1","v":1.4889156509221957E-2},{"$f":"(1+LOOKUP(Y4,Inputs!39:39,Inputs!45:45))^(1/2)-1","v":1.4889156509221957E-2},{"$f":"(1+LOOKUP(Z4,Inputs!39:39,Inputs!45:45))^(1/2)-1","v":1.4889156509221957E-2},{"$f":"(1+LOOKUP(AA4,Inputs!39:39,Inputs!45:45))^(1/2)-1","v":1.4889156509221957E-2},{"$f":"(1+LOOKUP(AB4,Inputs!39:39,Inputs!45:45))^(1/2)-1","v":1.4889156509221957E-2},{"$f":"(1+LOOKUP(AC4,Inputs!39:39,Inputs!45:45))^(1/2)-1","v":1.4889156509221957E-2},{"$f":"(1+LOOKUP(AD4,Inputs!39:39,Inputs!45:45))^(1/2)-1","v":1.4889156509221957E-2},{"$f":"(1+LOOKUP(AE4,Inputs!39:39,Inputs!45:45))^(1/2)-1","v":1.4889156509221957E-2},{"$f":"(1+LOOKUP(AF4,Inputs!39:39,Inputs!45:45))^(1/2)-1","v":1.4889156509221957E-2},{"$f":"(1+LOOKUP(AG4,Inputs!39:39,Inputs!45:45))^(1/2)-1","v":1.4889156509221957E-2},{"$f":"(1+LOOKUP(AH4,Inputs!39:39,Inputs!45:45))^(1/2)-1","v":1.4889156509221957E-2},{"$f":"(1+LOOKUP(AI4,Inputs!39:39,Inputs!45:45))^(1/2)-1","v":1.4889156509221957E-2},{"$f":"(1+LOOKUP(AJ4,Inputs!39:39,Inputs!45:45))^(1/2)-1","v":1.4889156509221957E-2},{"$f":"(1+LOOKUP(AK4,Inputs!39:39,Inputs!45:45))^(1/2)-1","v":1.4889156509221957E-2},{"$f":"(1+LOOKUP(AL4,Inputs!39:39,Inputs!45:45))^(1/2)-1","v":1.4889156509221957E-2},{"$f":"(1+LOOKUP(AM4,Inputs!39:39,Inputs!45:45))^(1/2)-1","v":1.4889156509221957E-2},{"$f":"(1+LOOKUP(AN4,Inputs!39:39,Inputs!45:45))^(1/2)-1","v":1.4889156509221957E-2},{"$f":"(1+LOOKUP(AO4,Inputs!39:39,Inputs!45:45))^(1/2)-1","v":1.4889156509221957E-2},{"$f":"(1+LOOKUP(AP4,Inputs!39:39,Inputs!45:45))^(1/2)-1","v":1.4889156509221957E-2},{"$f":"(1+LOOKUP(AQ4,Inputs!39:39,Inputs!45:45))^(1/2)-1","v":1.4889156509221957E-2},{"$f":"(1+LOOKUP(AR4,Inputs!39:39,Inputs!45:45))^(1/2)-1","v":1.4889156509221957E-2},{"$f":"(1+LOOKUP(AS4,Inputs!39:39,Inputs!45:45))^(1/2)-1","v":1.4889156509221957E-2},{"$f":"(1+LOOKUP(AT4,Inputs!39:39,Inputs!45:45))^(1/2)-1","v":1.4889156509221957E-2},{"$f":"(1+LOOKUP(AU4,Inputs!39:39,Inputs!45:45))^(1/2)-1","v":1.4889156509221957E-2},{"$f":"(1+LOOKUP(AV4,Inputs!39:39,Inputs!45:45))^(1/2)-1","v":1.4889156509221957E-2},{"$f":"(1+LOOKUP(AW4,Inputs!39:39,Inputs!45:45))^(1/2)-1","v":1.4889156509221957E-2},{"$f":"(1+LOOKUP(AX4,Inputs!39:39,Inputs!45:45))^(1/2)-1","v":1.4889156509221957E-2},{"$f":"(1+LOOKUP(AY4,Inputs!39:39,Inputs!45:45))^(1/2)-1","v":1.4889156509221957E-2},{"$f":"(1+LOOKUP(AZ4,Inputs!39:39,Inputs!45:45))^(1/2)-1","v":1.4889156509221957E-2},{"$f":"(1+LOOKUP(BA4,Inputs!39:39,Inputs!45:45))^(1/2)-1","v":1.4889156509221957E-2},{"$f":"(1+LOOKUP(BB4,Inputs!39:39,Inputs!45:45))^(1/2)-1","v":1.4889156509221957E-2},{"$f":"(1+LOOKUP(BC4,Inputs!39:39,Inputs!45:45))^(1/2)-1","v":1.4889156509221957E-2},{"$f":"(1+LOOKUP(BD4,Inputs!39:39,Inputs!45:45))^(1/2)-1","v":1.4889156509221957E-2},{"$f":"(1+LOOKUP(BE4,Inputs!39:39,Inputs!45:45))^(1/2)-1","v":1.4889156509221957E-2},{"$f":"(1+LOOKUP(BF4,Inputs!39:39,Inputs!45:45))^(1/2)-1","v":1.4889156509221957E-2},{"$f":"(1+LOOKUP(BG4,Inputs!39:39,Inputs!45:45))^(1/2)-1","v":1.4889156509221957E-2},{"$f":"(1+LOOKUP(BH4,Inputs!39:39,Inputs!45:45))^(1/2)-1","v":1.4889156509221957E-2},{"$f":"(1+LOOKUP(BI4,Inputs!39:39,Inputs!45:45))^(1/2)-1","v":1.4889156509221957E-2},{"$f":"(1+LOOKUP(BJ4,Inputs!39:39,Inputs!45:45))^(1/2)-1","v":1.4889156509221957E-2},{"$f":"(1+LOOKUP(BK4,Inputs!39:39,Inputs!45:45))^(1/2)-1","v":1.4889156509221957E-2},{"$f":"(1+LOOKUP(BL4,Inputs!39:39,Inputs!45:45))^(1/2)-1","v":1.4889156509221957E-2},{"$f":"(1+LOOKUP(BM4,Inputs!39:39,Inputs!45:45))^(1/2)-1","v":1.4889156509221957E-2},{"$f":"(1+LOOKUP(BN4,Inputs!39:39,Inputs!45:45))^(1/2)-1","v":1.4889156509221957E-2},{"$f":"(1+LOOKUP(BO4,Inputs!39:39,Inputs!45:45))^(1/2)-1","v":1.4889156509221957E-2},{"$f":"(1+LOOKUP(BP4,Inputs!39:39,Inputs!45:45))^(1/2)-1","v":1.4889156509221957E-2},{"$f":"(1+LOOKUP(BQ4,Inputs!39:39,Inputs!45:45))^(1/2)-1","v":1.4889156509221957E-2}]
[null,null,"Exchange Rate"]
[]
[null,"Revenues, Op Exp, Cap Exp"]
[null,null,"PPA Price",null,"Sol/MWH",{"$f":"Inputs!F16","v":80},null,null,{"$f":"$F$21","v":80},{"$f":"$F$21","v":80},80,80,80,80,80,80,80,80,80,80,80,80,80,80,80,80,80,80,80,80,80,80,80,80,80,80,80,80,80,80,80,80,80,80,80,80,80,80,80,80,80,80,80,80,80,80,80,80,80,80,80,80,80,80,80,80,80,80,80]
[null,null,"Inflation Index",null,"Index",null,null,1,{"$f":"H22*(1+I16*I6)","v":1},{"$f":"I22*(1+J16*J6)","v":1.0440306508910551},1.0900000000000001,1.1379934094712501,1.1881000000000002,1.2404128163236627,1.2950290000000004,1.3520499697927926,1.4115816100000005,1.4737344670741439,1.5386239549000007,1.606370569110817,1.6771001108410009,1.7509439203307908,1.8280391208166913,1.9085288731605623,1.9925626416901938,2.080296471745013,2.1718932794423114,2.2675231542020646,2.3673636745921196,2.4716002380802506,2.5804264053054107,2.6940442595074732,2.8126647817828978,2.9365082428631464,3.0658046121433591,3.2007939847208298,3.3417270272362618,3.4888654433457047,3.6424824596875256,3.8028633332468185,3.970305881059403,4.1451210332390325,4.3276334103547498,4.5181819262305458,4.7171204172866776,4.924818299591295,5.1416612548424787,5.3680519465545125,5.6044107677783028,5.8511766217444192,6.1088077368783509,6.3777825177014176,6.6586004331974031,6.9517829442945462,7.2578744721851702,7.5774434092810559,7.9110831746818358,8.2594133161163512,8.6230806604032022,9.002760514566825,9.3991579198394923,9.8130089608778412,10.245082132625049,10.696179767356849,11.167139524561305,11.658835946418966,12.172182081771822,12.708131181596674,12.708131181596674]
[null,null,"Inflated Price",null,"Sol/MWH",null,null,null,{"$f":"I21*I22","v":80},{"$f":"J21*J22","v":83.522452071284405},87.2,91.039472757699997,95.048000000000016,99.233025305893023,103.60232000000003,108.16399758342341,112.92652880000004,117.89875736593152,123.08991639200005,128.50964552886535,134.16800886728007,140.07551362646328,146.24312966533529,152.68230985284498,159.40501133521551,166.42371773960105,173.75146235538492,181.40185233616518,189.38909396736958,197.72801904642006,206.43411242443284,215.52354076059785,225.01318254263182,234.92065942905171,245.26436897146874,256.06351877766639,267.33816217890092,279.10923546765639,291.39859677500203,304.22906665974546,317.62447048475224,331.6096826591226,346.21067282837998,361.45455409844368,377.36963338293424,393.98546396730359,411.3329003873983,429.444155724361,448.35286142226425,468.09412973955352,488.70461895026807,510.22260141611343,532.68803465579231,556.14263554356376,580.62995777481365,606.19547274248453,632.8866539745469,660.7530652893081,689.8464528322562,720.22084116534597,751.93263358715944,785.04071687022724,819.60657061000393,855.69438138854798,893.37116196490445,932.70687571351732,973.7745665417458,1016.6504945277338,1016.6504945277338]
[null,null,null,"Revenues","Sol ",null,null,null,{"$f":"I23*I13","v":0},{"$f":"J23*J13","v":66817.961657027525},104640,72831.578206160004,114057.60000000002,79386.42024471442,124322.78400000004,86531.198066738725,135511.83456000005,94319.005892745219,147707.89967040005,102807.71642309228,161001.61064073606,112060.41090117062,175491.75559840235,122145.84788227598,191286.01360225861,133138.97419168084,208501.7548264619,145121.48186893214,227266.91276084349,158182.41523713604,247720.93490931942,172418.83260847829,270015.81905115821,187936.52754324136,294317.24276576249,204850.81502213312,320805.7946146811,223287.38837412512,349678.31613000244,243383.25332779635,381149.36458170268,265287.7461272981,415452.807394056,289163.64327875496,452843.56005952111,315188.37117384287,493599.48046487797,343555.32457948878,538023.4337067171,374475.30379164283,586445.54274032172,408178.08113289077,639225.64158695075,444914.10843485099,696755.94932977634,484956.37819398765,759463.98476945632,528602.45223144651,827815.74339870748,576176.67293227674,902319.16030459129,628032.57349618175,983527.88473200472,684555.50511083833,1072045.3943578852,746165.50057081389,1168529.479850095,813320.39562218706,0]
[]
[null,null,"O&M"]
[null,null,null,"O&M No Inflation","Sol",{"$f":"Inputs!F25","v":24000},null,null,{"$f":"$F$27*I6","v":0},{"$f":"$F$27*J6","v":24000},24000,24000,24000,24000,24000,24000,24000,24000,24000,24000,24000,24000,24000,24000,24000,24000,24000,24000,24000,24000,24000,24000,24000,24000,24000,24000,24000,24000,24000,24000,24000,24000,24000,24000,24000,24000,24000,24000,24000,24000,24000,24000,24000,24000,24000,24000,24000,24000,24000,24000,24000,24000,24000,24000,24000,24000,24000,24000,0]
[null,null,null,"O&M With Inflation","Sol",null,null,null,{"$f":"I27*I22","v":0},{"$f":"J27*J22","v":25056.73562138532},26160.000000000004,27311.84182731,28514.400000000005,29769.907591767907,31080.696000000011,32449.199275027022,33877.958640000012,35369.627209779457,36926.974917600019,38552.89365865961,40250.402660184023,42022.65408793898,43872.938899600587,45804.692955853498,47821.503400564652,49927.115321880308,52125.438706615474,54420.555700849553,56816.728190210873,59318.405713926019,61930.233727329854,64657.062228179355,67503.954762789552,70476.197828715507,73579.310691440623,76819.055633299911,80201.44865367029,83732.77064029692,87419.579032500609,91268.719997923647,95287.341145425671,99482.904797736774,103863.201848514,108436.3662295331,113210.89001488026,118195.63919019108,123399.87011621949,128833.2467173083,134505.85842667927,140428.23892186605,146611.38568508043,153066.78042483403,159806.41039673769,166842.79066306911,174188.98733244409,181858.64182274535,189865.99619236405,198225.91958679244,206953.93584967684,216066.2523496038,225579.79007614782,235512.21506106819,245881.97118300118,256708.31441656439,268011.34858947131,279812.06271405518,292132.36996252375,304995.14835832018,0]
[]
[null,null,"Cap Exp",null,"Sol",{"$f":"Inputs!F24","v":1120000},null,null,{"$f":"$F$30*I5","v":1120000},{"$f":"$F$30*J5","v":0},0,0,0,0,0,0,0,0,0,0,0,0,0,0,0,0,0,0,0,0,0,0,0,0,0,0,0,0,0,0,0,0,0,0,0,0,0,0,0,0,0,0,0,0,0,0,0,0,0,0,0,0,0,0,0,0,0,0,0]
{"$rows_left_out":137}