{"text_format":"1","workbook":"xlsx","n_sheets":17,"sheets":["Contents","Illustration","Consumer Economics","Minigrid Control","Energy Demand","End Uses","Hydro","Diesel","Solar and Battery","Solar Production","Demand and Supply Dispatch","Distribution","Financing Assumptions","Financial Model","Kerosene","Sample Prices","Backup"],"not_rendered":{"charts":26,"images":16,"macros":1,"external_links":0,"defined_names":76,"comments":0,"pivot_tables":0},"unopened":[],"bounds":{"document_bytes":16777216,"sheet_cells":100000,"rows_first":2000,"rows_last":500,"rows_between":2000,"halvings":0,"cell_chars":16384,"cell_head_chars":4096},"cells_cut":0,"cells_raw":0,"read":"whole","date_system":"1900"}

{"sheet":"Contents","index":0,"n_rows":63,"n_cols":13,"rows_kept":63,"cut":false,"hidden":false,"merged":[]}
[]
[null,null,"Contents"]
[null,null,null,null,null," Colour Codes ",null,null,null,null," File Name: ",null,{"$f":"IFERROR(File_name(),\"\")","v":"C:\\Users\\edwar\\OneDrive\\Courses New\\Chapter 5. Electricity\\Chapter 5. Electricity\\Renewable Energy\\12. Batteries and Storage\\Mini Grid Analysis\\Mini Grid Analysis - LATEST.xlsm"}]
[null,null,"Illustration",null,null,null," Inputs ",null,"1234567890"]
[null,null,null,null,null,null," Section Titles ",null,"TITLE ROW",null," Last Save Date ",null,{"$f":"IFERROR(lastsaved(),\"\")","v":"9/15/2021 6:48:52 AM"}]
[null,null,"Consumer Economics",null,null,null," Sum Column ",null,"1000000000"]
[null,null,null,null,null,null," True or 1 ",null,{"$f":"1=1","v":true},null," Last Save By",null,{"$f":"IFERROR(last_save_by(),\"\")","v":"Edward Bodmer"}]
[null,null,"Minigrid Control",null,null,null," False or 0 ",null,{"$f":"1=2","v":false}]
[null,null,null,"Demand Level and Demand Shape for Village",null,null," Other Sheet Links ",null,"|||||||||||||||||||"]
[null,null,null,"Supply Options and Characteristics"]
{"$rows_left_out":54}
{"sheet":"Illustration","index":1,"n_rows":24,"n_cols":20,"rows_kept":24,"cut":false,"hidden":false,"merged":[]}
["          ","Consumer Load and Kerosene",null,null,null,null,null,"Mini Grid",null,null,null,"Mini Grid Costs",null,null,null,null,"Annual Savings/Costs"]
[null,"Demand Profile"]
[null,"Daily Energy (kWh)",null,null,{"$f":"'Minigrid Control'!E9/1000","v":127.27},null,null,"Hydro Capacity (kW)",null,{"$f":"Hydro!F7","v":0}]
[null,"Maximum Load (kW)",null,null,{"$f":"'Minigrid Control'!E10/1000","v":11.18},null,null,"Diesel Capacity (kW)",null,{"$f":"Diesel!F7","v":0}]
[null,"Unserved Energy (kWh)",null,null,{"$f":"'Demand and Supply Dispatch'!E57","v":7.8907671668287662},null,null,"Solar Capacity (kW)",null,{"$f":"'Solar and Battery'!E14","v":29},null,"Hydro/kW",null,null,{"$f":"'Minigrid Control'!$F$37","v":3853}]
[null,"Cost/Litre of Kerosene",null,null,{"$f":"Kerosene!F17","v":1.1157894736842104},null,null,"Battery Capacity (kWh)",null,{"$f":"'Solar and Battery'!E17","v":57},null,"Solar Cost/kW",null,null,{"$f":"Solar_Cost","v":890},null,"Mini Grid Costs USD",null,null,{"$f":"J22","v":3725.998493724227}]
[null,null,null,null,null,null,null,null,null,null,null,"Battery Cost/kWh",null,null,{"$f":"'Solar and Battery'!E24","v":130},null,"Mini Grid Costs FRW"]
[null,"Annual Load Factor",null,null,{"$f":"'Consumer Economics'!K4","v":0.4743217054263566},null,null,"Solar Curve",null,null,null,"Diesel Cost/kW",null,null,{"$f":"Diesel!F19","v":650}]
[null,null,null,null,null,null,null,null,null,null,null,"Distribution Cost/m",null,null,{"$f":"Distribution!E26","v":12.049459486174888},null,"Total Demand",null,null,{"$f":"E3365/1000","v":0}]
[null,null,null,null,null,null,null,null,null,null,null,null,null,null,null,null,"Retail Cost/kWh w/o Subsidy",null,null,{"$f":"E22","v":2583.3164611810503}]
{"$rows_left_out":15}
{"sheet":"Consumer Economics","index":2,"n_rows":26,"n_cols":19,"rows_kept":26,"cut":false,"hidden":false,"merged":[]}
["          "]
[]
[null,"Demand Profile",null,null,null,null,"Demand Profile"]
[null,null,null,null,null,null,null,null,"Load Factor",null,{"$f":"'Financial Model'!F19","v":0.4743217054263566},null,null,"Cost of Solar and Batteries",null,null,null,null,"Cost Comparison"]
[null,null,null,null,null,null,null,null,"Solar Capacity Factor",null,{"$f":"IFERROR('Financial Model'!F36,0)","v":0.22070253416281818},null,null,"Solar","Battery ","Hydro"]
[null,null,null,null,null,null,null,null,null,null,null,null,"Capital Cost USD/kW",{"$f":"'Solar and Battery'!E23","v":890},{"$f":"'Solar and Battery'!E24","v":130},{"$f":"Illustration!O5","v":3853}]
[null,null,null,null,null,null,null,null,"Hydro Capacity (kW)",null,{"$f":"Illustration!J3","v":0},null,"Operating Cost USD/kWy",{"$f":"'Solar and Battery'!E27","v":4},{"$f":"'Solar and Battery'!E28","v":0.1},{"$f":"Hydro!F26","v":10}]
[null,null,null,null,null,null,null,null,"Diesel Capacity (kW)",null,{"$f":"Illustration!J4","v":0}]
[null,null,null,null,null,null,null,null,"Solar Capacity (kW)",null,{"$f":"Illustration!J5","v":29},null,"Capital Cost FRW/kW",{"$f":"N6*'Financial Model'!$F$13","v":845500},{"$f":"O6*'Financial Model'!$F$13","v":123500}]
[null,null,null,null,null,null,null,null,"Battery Capacity (kWh)",null,{"$f":"Illustration!J6","v":57},null,"Operating Cost FRW/kW",{"$f":"N7*'Financial Model'!$F$13","v":3800},{"$f":"O7*'Financial Model'!$F$13","v":95}]
{"$rows_left_out":17}
{"sheet":"Minigrid Control","index":3,"n_rows":86,"n_cols":9,"rows_kept":86,"cut":false,"hidden":false,"merged":[]}
["          "]
[]
["Demand Level and Demand Shape for Village"]
[]
[null,"Village Profile"]
[null,"Year of Analysis"]
[null,"Growth Rate",null,null,{"$f":"'Energy Demand'!E153","v":0}]
[null,"Hourly Distribution"]
[null,"Daily Energy Demand",null,null,{"$f":"'End Uses'!J42","v":127270}]
[null,"Maximum Daily Load",null,null,{"$f":"'End Uses'!G43","v":11180}]
{"$rows_left_out":77}
{"sheet":"Energy Demand","index":4,"n_rows":188,"n_cols":41,"rows_kept":188,"cut":false,"hidden":false,"merged":[]}
["Selection of Load Type to Drive Demand"]
[]
[null,null,null,null,null,null,null,null,"T1: Light + Mobile/Radio",null,null,null,"T2: T1 + TV",null,null,null,null,"T3: T2 + Home Appliances",null,null,null,null,null,null,null,null,"Street litghts",null,null,null,null,"Health posts and clinics",null,null,"Church and mosque","Productive Uses"]
[null,null,1,null,null,{"$f":"K52","v":1},null,null,null,null,null,null,null,null,null,null,null,null,null,null,null,null,null,null,null,null,null,"Schools and colleges"]
[]
["Alternate Village Profiles "]
[]
[null,null,null,null,null,"Applied",null,null,null,null,null,null,"Number of Units"]
[null,null,null,null,null,"# of Units"]
[null,null,"Code",null,null,{"$f":"INDEX(J10:R10,$C$4)","v":"136 Households  "},null,{"$f":"INDEX(J10:S10,$C$4)","v":"136 Households  "},null,{"$f":"J25&\" Households  \"&J26","v":"136 Households  "},{"$f":"K25&\" Households  \"&K26","v":"156 Households  "},"2000 Households  ","6000 Households  ","1400 Households  ","1400 Households  ","Saw mills"," Households  ","2600 Households  "]
{"$rows_left_out":179}
{"sheet":"End Uses","index":5,"n_rows":104,"n_cols":36,"rows_kept":104,"cut":false,"hidden":false,"merged":[]}
["Demand Selection"]
[null,null,null,null,null,null,null,null,null,null,null,"kwh=kw x hour"]
[null,null,null,null,null,null,null,null,null,null,null,null,null,null,null,null,"Percent of Hour"]
["Load by Hour of Day"]
[null,null,null,null,null,null,null,"Load in Watt","Hours of","Watthour","Watt Capacity","Watthour",0,1,2,3,4,5,6,7,8,9,10,11,12,13,14,15,16,17,18,19,20,21,22,23]
[null,null,null,null,null,null,null,"Units x Watts","Full Load","for All Units"," for Single Unit"," for Single Unit"]
[null,null,{"$f":"'Energy Demand'!B32","v":"Household 1"},"T1: Light + Mobile/Radio","Bulb Living Room",null,null,{"$f":"TRANSPOSE('Energy Demand'!I46:AO46)","v":150},{"$f":"SUM(M7:AJ7)","v":4},{"$f":"H7*I7","v":600},{"$f":"TRANSPOSE('Energy Demand'!I47:AO47)","v":3},{"$f":"K7*I7","v":12},0,0,0,0,0,1,0,0,0,0,0,0,0,0,0,0,0,0,1,1,1,0,0,0]
[null,null,{"$f":"C7","v":"Household 1"},null,"Bulb Kitchen",null,null,150,2,{"$f":"H8*I8","v":300},3,{"$f":"K8*I8","v":6},0,0,0,0,0,0,0,0,0,0,0,0,0,0,0,0,0,0,0.66666666666666663,0.66666666666666663,0.66666666666666663,0,0,0]
[null,null,{"$f":"C8","v":"Household 1"},null,"Bulb Other Rooms",null,null,300,4.9999999999999991,1499.9999999999998,6,29.999999999999993,0.2857142857142857,0.2857142857142857,0.2857142857142857,0.2857142857142857,0.5,0.5,0,0,0,0,0,0,0,0,0,0,0,0,0.66666666666666663,0.66666666666666663,0.66666666666666663,0.2857142857142857,0.2857142857142857,0.2857142857142857]
[null,null,{"$f":"C9","v":"Household 1"},null,"Mobile/Radio Charger",null,null,250,7.9999999999999991,1999.9999999999998,5,39.999999999999993,0.2857142857142857,0.2857142857142857,0.2857142857142857,0.2857142857142857,0,0,1,1,0,0,1,1,0,0,1,1,0,0,0,0,0,0.2857142857142857,0.2857142857142857,0.2857142857142857]
{"$rows_left_out":95}
{"sheet":"Hydro","index":6,"n_rows":123,"n_cols":11,"rows_kept":123,"cut":false,"hidden":false,"merged":[]}
["          "]
[]
["Hydro Parameters"]
[]
[null,"Apply Hydro",null,null,null,{"$f":"'Minigrid Control'!$F$34","v":false}]
[null,"Generator",null,null,"kW",6,"Applied Hydro Capacity",null,20,"Base Hydro Capacity"]
[null,"Capacity Applied",null,null,"kW",{"$f":"F5*F6","v":0}]
[null,"Head",null,null,"m",33]
[null,"Gravity",null,null,"m/sec2",9.81]
[null,"Efficiency"]
{"$rows_left_out":114}
{"sheet":"Diesel","index":7,"n_rows":75,"n_cols":12,"rows_kept":75,"cut":false,"hidden":false,"merged":[]}
["          "]
[]
["Diesel Parameters"]
[]
[null,"Apply Diesel",null,null,"Flag",{"$f":"'Minigrid Control'!$F$73","v":false}]
[null,"Generator",null,null,"kW",10]
[null,"Diesel Applied",null,null,"kW",{"$f":"F5*F6","v":0}]
[null,"Heat Rate",null,null,"Litre/MWH",{"$f":"0.21*1000","v":210}]
[null,"BTU/Litre",null,null,"BTU/Litre",33025]
[null,"Litre/BTU",null,null,"Litre/BTU",{"$f":"1/F9","v":3.0280090840272521E-5}]
{"$rows_left_out":66}
{"sheet":"Solar and Battery","index":8,"n_rows":28,"n_cols":12,"rows_kept":28,"cut":false,"hidden":false,"merged":[]}
[]
[]
["Alterantive Solar and Battery Costs"]
[null,"Capacity",null,"kW",{"$f":"'Sample Prices'!K2","v":7},{"$f":"'Sample Prices'!L2","v":7},{"$f":"'Sample Prices'!R2","v":5},{"$f":"'Sample Prices'!S2","v":5},{"$f":"'Sample Prices'!W2","v":3},{"$f":"'Sample Prices'!X2","v":3},{"$f":"'Sample Prices'!AG2","v":2},{"$f":"'Sample Prices'!AH2","v":5}]
[null,"Storage Hours",null,"Hrs",5,5,5,5,{"$f":"'Sample Prices'!W4","v":1},{"$f":"'Sample Prices'!X4","v":1},5,5]
[null,"Energy",null,"kWh",{"$f":"E4*E5","v":35},35,25,25,3,3,10,25]
[null,"Total Cost",null,"USD",{"$f":"'Sample Prices'!K3","v":4800},{"$f":"'Sample Prices'!L3","v":7500},{"$f":"'Sample Prices'!R3","v":4000},{"$f":"'Sample Prices'!S3","v":4500},{"$f":"'Sample Prices'!W3","v":900},{"$f":"'Sample Prices'!X3","v":2370},{"$f":"'Sample Prices'!AG3","v":2500},{"$f":"'Sample Prices'!AH3","v":4500}]
[null,"Cost/kW",null,"USD/kW",{"$f":"E7/E4","v":685.71428571428567},1071.4285714285713,800,900,300,790,1250,900]
[null,"Cost/kWh",null,"USD/kWh",{"$f":"E7/E6","v":137.14285714285714},214.28571428571428,160,180,300,790,250,180]
[]
{"$rows_left_out":19}
{"sheet":"Solar Production","index":9,"n_rows":69,"n_cols":31,"rows_kept":69,"cut":false,"hidden":false,"merged":[]}
["          "]
[]
[null,"          ",null,null,null,null,0,1,2,3,4,5,6,7,8,9,10,11,12,13,14,15,16,17,18,19,20,21,22,23]
[null,null,null,"Row",11]
[]
[null,1,{"$f":"D6&\" \"&E6","v":"January Typical"},"January","Typical","2013-01-25",0,0,0,0,0,0.12821694540042392,0.37091871428098722,0.58057253709288503,0.62419166178660757,0.56123778514034095,0.43443096115006347,0.69135697485915026,0.19990600366793285,0.43341832362734095,0.33470982491709422,9.4071186690302174E-3,4.2019725241945836E-3,0,0,0,0,0,0,0]
[null,2,{"$f":"D7&\" \"&E7","v":"May Typical"},"May","Typical","2013-05-01",0,0,0,0,0,2.4625073216113305E-2,0.13593948949894369,0.35483008074240435,0.53223092526048421,0.43881274781380686,0.70760649473311898,0.37874536130240372,0.43583161865812831,0.38364766258063071,0.14771258368835377,5.5799166672637984E-2,0,0,0,0,0,0,0,0]
[null,3,"July Typical","July","Typical","2013-07-01",0,0,0,0,0,4.6789531891031577E-2,0.35176377646799206,0.53835406990722734,0.59846877592903813,0.70284615198611466,0.73057538508496644,0.67612955640998562,0.60059815389737992,0.45670898664995996,0.1197467530374641,5.7616235872289707E-2,0,0,0,0,0,0,0,0]
[null,4,"November Typical","November","Typical","2013-11-06",0,0,0,0,1.2161114174752342E-2,8.1607227648941211E-2,8.0840651580338138E-2,0.2140734650839673,0.85984282361643893,0.90558186237642191,0.44501160367720211,0.6950478966709428,0.49646683929442276,6.2452289835946077E-2,0.28345333124358552,4.7215407484699955E-2,0,0,0,0,0,0,0,0]
[null,5,"January Low","January","Low","2013-01-03",0,0,0,0,0,2.2050891849940045E-2,3.0994279316975813E-2,5.1578266344280366E-2,0.26752558404038845,0.47220139435740716,0.42476831712483221,0.70662224891664094,0.10731118570234771,6.7449230134988283E-2,4.8019839161629094E-2,6.4155792210619553E-2,0,0,0,0,0,0,0,0]
{"$rows_left_out":60}
{"sheet":"Demand and Supply Dispatch","index":10,"n_rows":110,"n_cols":30,"rows_kept":110,"cut":false,"hidden":false,"merged":[]}
["Parameters"]
[null,"Daily Energy",{"$f":"'End Uses'!J42","v":127270}]
[]
[null,"Hydro Energy (kWhour)",{"$f":"Hydro!$I$20","v":0},null,null,null,null,"Hydro Season"]
[null,"Solar Capacity (kW)",{"$f":"'Solar and Battery'!E14","v":29},null,null,null,null,"Solar Shape"]
[null,"Battery Capacity (kWh)",{"$f":"'Solar and Battery'!E17","v":57}]
[null,"Diesel Capacity (kW)",{"$f":"Diesel!F7","v":0}]
[null,null,null,"Max Watt","Watthour","CF/LF","Watts per Hour"]
[null,null,null,null,null,null,0,1,2,3,4,5,6,7,8,9,10,11,12,13,14,15,16,17,18,19,20,21,22,23]
["Chronological Analysis"]
{"$rows_left_out":101}
{"sheet":"Distribution","index":11,"n_rows":43,"n_cols":23,"rows_kept":43,"cut":false,"hidden":false,"merged":[]}
["Distribution Quantity"]
[null,"Three Phase Wires",null,null,"meters"]
[null,"Cost per meter",null,null,"USD/Meter"]
[]
[null,null,null,"  3phase Distribution branch point  to point ( refer to                       "]
[null,null,null,"  distribution map) 3x50 +54.6mm2 twisted cable                           "]
[null,null,null,"   m                               ",713.94]
[null,null,null,"  3phase distribution branch point to point 18( refer to                        "]
[null,null,null,"  distribution map) 3x50 +54.6mm2 twisted cable                           "]
[null,null,null,"   m                               ",443.31]
{"$rows_left_out":34}
{"sheet":"Financing Assumptions","index":12,"n_rows":28,"n_cols":8,"rows_kept":28,"cut":false,"hidden":false,"merged":[]}
["          "]
[]
["Finance"]
[null,"Target IRR",null,null,"%",{"$f":"G4/1000","v":0.13},130,70]
[null,"Solar Life",null,null,"Years",10]
[null,"Battery Life",null,null,"Years",10]
[]
[]
["Hydro LCOE"]
[null,"Cost per kW",null,null,"USD/kW",null,{"$f":"Hydro!F24","v":3853}]
{"$rows_left_out":19}
{"sheet":"Financial Model","index":13,"n_rows":152,"n_cols":47,"rows_kept":152,"cut":false,"hidden":false,"merged":[]}
["Timeline",null,null,null,null,null,"Price Result",{"$f":"F108","v":0.15422924414088282}]
[]
[null,"Period",null,null,null,null,0,1,2,3,4,5,6,7,8,9,10,11,12,13,14,15,16,17,18,19,20,21,22,23,24,25,26,27,28,29,30,31,32,33,34,35,36,37,38,39,40]
[null,"Life Flag",null,null,null,30,null,{"$f":"H3<=$F$4","v":true},{"$f":"I3<=$F$4","v":true},true,true,true,true,true,true,true,true,true,true,true,true,true,true,true,true,true,true,true,true,true,true,true,true,true,true,true,true,false,false,false,false,false,false,false,false,false,false]
[null,"Battery Replacement",null,null,null,{"$f":"F10+1","v":31},null,{"$f":"MOD(H3,$F$5)=0","v":false},{"$f":"MOD(I3,$F$5)=0","v":false},false,false,false,false,false,false,false,false,false,false,false,false,false,false,false,false,false,false,false,false,false,false,false,false,false,false,false,false,true,false,false,false,false,false,false,false,false,false]
[]
["Assumptions"]
[null,null,"Timing"]
[null,null,null,"Lifetime of Solar","Years",{"$f":"'Financing Assumptions'!F5","v":10}]
[null,null,null,"Battery Replacement","Years",30]
{"$rows_left_out":143}
{"sheet":"Kerosene","index":14,"n_rows":27,"n_cols":10,"rows_kept":27,"cut":false,"hidden":false,"merged":[]}
["          "]
["Conversions"]
[null,"Gallons per kWh",null,null,"G/kWh",2.5316455599999999E-2]
[null,"kWh/Gallon",null,null,"kWh/G",{"$f":"1/F3","v":39.5000001501}]
[]
[null,"US Gallon/Litre",null,null,"G/L",0.26417000000000002]
[null,"Litre/Galon",null,null,"L/G",{"$f":"1/F6","v":3.7854411931710636}]
[]
[null,"Litres/kWh",null,"G/kWh x L/G",null,{"$f":"F3*F7","v":9.583395389332626E-2}]
[null,"kWh/Litre",null,"kWh/G x G/L",null,{"$f":"F4*F6","v":10.434715039651918}]
{"$rows_left_out":18}
{"sheet":"Sample Prices","index":15,"n_rows":10,"n_cols":34,"rows_kept":10,"cut":false,"hidden":false,"merged":[]}
["          "]
[null,"Total Wh",null,{"$f":"30*10","v":300},null,null,null,"Total kW",null,null,7,{"$f":"K2","v":7},null,null,null,"Total kW",null,5,5,null,null,"Total kW",3,3,null,null,null,null,null,null,"Total kW",null,2,5]
[null,"Cost",null,399,null,null,null,"Cost",null,null,4800,7500,null,null,null,"Cost",null,4000,4500,null,null,"Cost",{"$f":"W6*W2","v":900},{"$f":"X6*X2","v":2370},null,null,null,null,null,null,"Cost",null,2500,4500]
[null,"Cost/Wh",null,{"$f":"D3/D2","v":1.33},null,null,null,"Hrs",null,null,5,{"$f":"K4","v":5},null,null,null,"Hrs",null,5,5,null,null,"Hrs",1,1,null,null,null,null,null,null,"Hrs",null,5,5]
[null,"Cost/kWh",null,{"$f":"D4*1000","v":1330},null,null,null,"kWh",null,null,{"$f":"K2*K4","v":35},{"$f":"L2*L4","v":35},null,null,null,"kWh",null,{"$f":"R2*R4","v":25},{"$f":"S2*S4","v":25},null,null,"kWh",{"$f":"W2*W4","v":3},{"$f":"X2*X4","v":3},null,null,null,null,null,null,"kWh",null,{"$f":"AG4*AG2","v":10},{"$f":"AH4*AH2","v":25}]
[null,null,null,null,null,null,null,"Cost/kW",null,null,{"$f":"K3/K2","v":685.71428571428567},{"$f":"L3/L2","v":1071.4285714285713},null,null,null,"Cost/kW",null,{"$f":"R3/R2","v":800},{"$f":"S3/S2","v":900},null,null,"Cost/kW",300,790,null,null,null,null,null,null,"Cost/kW",null,{"$f":"AG3/AG2","v":1250},{"$f":"AH3/AH2","v":900}]
[null,"Watt",null,30,null,null,null,"Cost/kWh",null,null,{"$f":"K3/K5","v":137.14285714285714},{"$f":"L3/L5","v":214.28571428571428},null,null,null,"Cost/kWh",null,{"$f":"R3/R5","v":160},{"$f":"S3/S5","v":180},null,null,"Cost/kWh",{"$f":"W6/W5","v":100},{"$f":"X6/X5","v":263.33333333333331},null,null,null,null,null,null,"Cost/kWh",null,{"$f":"AG3/AG5","v":250},{"$f":"AH3/AH5","v":180}]
[null,"Cost",null,{"$f":"D3","v":399}]
[null,"Cost/Watt",null,{"$f":"D8/D7","v":13.3}]
[null,"Cost/kW",null,{"$f":"D9*1000","v":13300}]
{"$rows_left_out":1}
{"sheet":"Backup","index":16,"n_rows":1,"n_cols":1,"rows_kept":1,"cut":false,"hidden":false,"merged":[]}
["          "]