{"text_format":"1","workbook":"xlsx","n_sheets":7,"sheets":["Summary","InputC","Financial Model","Sensitivity","Time Series","Simple Rp","Mean Reversion"],"not_rendered":{"charts":8,"images":0,"macros":1,"external_links":0,"defined_names":26,"comments":0,"pivot_tables":0},"unopened":[],"bounds":{"document_bytes":16777216,"sheet_cells":100000,"rows_first":2000,"rows_last":500,"rows_between":2000,"halvings":0,"cell_chars":16384,"cell_head_chars":4096},"cells_cut":0,"cells_raw":0,"read":"whole","date_system":"1900"}

{"sheet":"Summary","index":0,"n_rows":22,"n_cols":11,"rows_kept":22,"cut":false,"hidden":false,"merged":[]}
[]
[]
[]
[]
[]
[]
[]
[]
[]
[]
{"$rows_left_out":13}
{"sheet":"InputC","index":1,"n_rows":131,"n_cols":20,"rows_kept":131,"cut":false,"hidden":false,"merged":[]}
[]
[null,null,null,"Scenario",{"$f":"scenario","v":5},"Project IRR",{"$f":"'Financial Model'!F29","v":5.563730895519256E-2}]
[null,null,null,null,null,"Rf + Premium",{"$f":"'Financial Model'!G158","v":4.2158310422701017E-2}]
[null,null,null,null,null,null,null,null,1,2,3,4,5,6,7,8,9,10,11,12]
[null,null,null,null,null,{"$f":"INDEX(I5:XFD5,Sensitivity!G50)","v":"Higher Capital Expenditure"},null,null,"Base Case - Annual","Base Case Alternative Timing","Longer-Construction","Shorter-Life","Higher Capital Expenditure","Lower Base EBITDA","Lower Growth Rate","Base Case","Break-Even DSCR Case","Break-Even LLCR Case","Break-Even PLCR Case","Loss Case"]
[null,"Timeline"]
[null,null,null,"Start Date","Date",{"$f":"INDEX(I7:AG7,Sensitivity!$G$50)","v":"2026-01-01"},null,null,"2026-01-01","2026-01-01","2026-01-01","2026-01-01","2026-01-01","2026-01-01","2026-01-01","2026-01-01","2026-01-01","2026-01-01","2026-01-01","2026-01-01"]
[null,null,null,"Construction months","months",{"$f":"INDEX(I8:AG8,Sensitivity!$G$50)","v":36},null,null,12,12,36,36,36,36,36,12,12,12,12,12]
[]
[null,null,null,"Commercial Operation Date","date",{"$f":"INDEX(I10:AG10,Sensitivity!$G$50)","v":"2029-01-01"},null,null,{"$f":"EDATE(I7,I8)","v":"2027-01-01"},"2027-01-01","2029-01-01","2029-01-01","2029-01-01","2029-01-01","2029-01-01","2027-01-01","2027-01-01","2027-01-01","2027-01-01","2027-01-01"]
{"$rows_left_out":122}
{"sheet":"Financial Model","index":2,"n_rows":158,"n_cols":260,"rows_kept":158,"cut":false,"hidden":false,"merged":[]}
[]
[null,"Timeline",null,null,null,"Constants","Constants","Sum","Model Units","Initial"]
[null,null,null,"Time Period",null,null,null,null,"Period",null,1,2,3,4,5,6,7,8,9,10,11,12,13,14,15,16,17,18,19,20,21,22,23,24,25,26,27,28,29,30,31,32,33,34,35,36,37,38,39,40,41,42,43,44,45,46,47,48,49,50,51,52,53,54,55,56,57,58,59,60,61,62,63,64,65,66,67,68,69,70,71,72,73,74,75,76,77,78,79,80,81,82,83,84,85,86,87,88,89,90,91,92,93,94,95,96,97,98,99,100,101,102,103,104,105,106,107,108,109,110,111,112,113,114,115,116,117,118,119,120,121,122,123,124,125,126,127,128,129,130,131,132,133,134,135,136,137,138,139,140,141,142,143,144,145,146,147,148,149,150,151,152,153,154,155,156,157,158,159,160,161,162,163,164,165,166,167,168,169,170,171,172,173,174,175,176,177,178,179,180,181,182,183,184,185,186,187,188,189,190,191,192,193,194,195,196,197,198,199,200,201,202,203,204,205,206,207,208,209,210,211,212,213,214,215,216,217,218,219,220,221,222,223,224,225,226,227,228,229,230,231,232,233,234,235,236,237,238,239,240,241,242,243,244,245,246,247,248,249,250]
[null,null,null,"Construction Periods","Months",{"$f":"InputC!F8","v":36}]
[null,null,null,"Construction in Periods","Periods",{"$f":"F4/F6","v":3},null,{"$f":"SUM(K5:XFD5)","v":3},"Flag",null,{"$f":"(K3<=$F$5)*1","v":1},{"$f":"(L3<=$F$5)*1","v":1},1,0,0,0,0,0,0,0,0,0,0,0,0,0,0,0,0,0,0,0,0,0,0,0,0,0,0,0,0,0,0,0,0,0,0,0,0,0,0,0,0,0,0,0,0,0,0,0,0,0,0,0,0,0,0,0,0,0,0,0,0,0,0,{"$f":"(BX3<=$F$5)*1","v":0},0,0,0,0,0,0,0,0,0,0,0,0,0,0,0,0,0,0,0,0,0,0,0,0,0,0,0,0,0,0,0,0,0,0,0,0,0,0,0,0,0,0,0,0,0,0,0,0,0,0,0,0,0,0,0,0,0,0,0,0,0,0,0,{"$f":"(EJ3<=$F$5)*1","v":0},0,0,0,0,0,0,0,0,0,0,0,0,0,0,0,0,0,0,0,0,0,0,0,0,0,0,0,0,0,0,0,0,0,0,0,0,0,0,0,0,0,0,0,0,0,0,0,0,0,0,0,0,0,0,0,0,0,0,0,0,0,0,0,{"$f":"(GV3<=$F$5)*1","v":0},0,0,0,0,0,0,0,0,0,0,0,0,0,0,0,0,0,0,0,0,0,0,0,0,0,0,0,0,0,0,0,0,0,0,0,0,0,0,0,0,0,0,0,0,0,0,0,0,0,0,0,0,0,0,0,0]
[null,null,null,"Months in period","Months/Per",{"$f":"InputC!F11","v":12},{"$f":"InputC!F12","v":12},null,"Months/Per",null,{"$f":"IF(K5,$F$6,$G$6)","v":12},12,12,12,12,12,12,12,12,12,12,12,12,12,12,12,12,12,12,12,12,12,12,12,12,12,12,12,12,12,12,12,12,12,12,12,12,12,12,12,12,12,12,12,12,12,12,12,12,12,12,12,12,12,12,12,12,12,12,12,12,12,12,12,{"$f":"IF(BW5,$F$6,$G$6)","v":12},12,12,12,12,12,12,12,12,12,12,12,12,12,12,12,12,12,12,12,12,12,12,12,12,12,12,12,12,12,12,12,12,12,12,12,12,12,12,12,12,12,12,12,12,12,12,12,12,12,12,12,12,12,12,12,12,12,12,12,12,12,12,12,{"$f":"IF(EI5,$F$6,$G$6)","v":12},12,12,12,12,12,12,12,12,12,12,12,12,12,12,12,12,12,12,12,12,12,12,12,12,12,12,12,12,12,12,12,12,12,12,12,12,12,12,12,12,12,12,12,12,12,12,12,12,12,12,12,12,12,12,12,12,12,12,12,12,12,12,12,{"$f":"IF(GU5,$F$6,$G$6)","v":12},12,12,12,12,12,12,12,12,12,12,12,12,12,12,12,12,12,12,12,12,12,12,12,12,12,12,12,12,12,12,12,12,12,12,12,12,12,12,12,12,12,12,12,12,12,12,12,12,12,12,12,12,12,12,12,12,12]
[null,null,null,"Start of period","Data",null,null,null,"Date",null,{"$f":"J8+1","v":"2026-01-01"},{"$f":"K8+1","v":"2027-01-01"},"2028-01-01","2029-01-01","2030-01-01","2031-01-01","2032-01-01","2033-01-01","2034-01-01","2035-01-01","2036-01-01","2037-01-01","2038-01-01","2039-01-01","2040-01-01","2041-01-01","2042-01-01","2043-01-01","2044-01-01","2045-01-01","2046-01-01","2047-01-01","2048-01-01","2049-01-01","2050-01-01","2051-01-01","2052-01-01","2053-01-01","2054-01-01","2055-01-01","2056-01-01","2057-01-01","2058-01-01","2059-01-01","2060-01-01","2061-01-01","2062-01-01","2063-01-01","2064-01-01","2065-01-01","2066-01-01","2067-01-01","2068-01-01","2069-01-01","2070-01-01","2071-01-01","2072-01-01","2073-01-01","2074-01-01","2075-01-01","2076-01-01","2077-01-01","2078-01-01","2079-01-01","2080-01-01","2081-01-01","2082-01-01","2083-01-01","2084-01-01","2085-01-01","2086-01-01","2087-01-01","2088-01-01","2089-01-01","2090-01-01",{"$f":"BW8+1","v":"2091-01-01"},"2092-01-01","2093-01-01","2094-01-01","2095-01-01","2096-01-01","2097-01-01","2098-01-01","2099-01-01","2100-01-01","2101-01-01","2102-01-01","2103-01-01","2104-01-01","2105-01-01","2106-01-01","2107-01-01","2108-01-01","2109-01-01","2110-01-01","2111-01-01","2112-01-01","2113-01-01","2114-01-01","2115-01-01","2116-01-01","2117-01-01","2118-01-01","2119-01-01","2120-01-01","2121-01-01","2122-01-01","2123-01-01","2124-01-01","2125-01-01","2126-01-01","2127-01-01","2128-01-01","2129-01-01","2130-01-01","2131-01-01","2132-01-01","2133-01-01","2134-01-01","2135-01-01","2136-01-01","2137-01-01","2138-01-01","2139-01-01","2140-01-01","2141-01-01","2142-01-01","2143-01-01","2144-01-01","2145-01-01","2146-01-01","2147-01-01","2148-01-01","2149-01-01","2150-01-01","2151-01-01","2152-01-01","2153-01-01","2154-01-01",{"$f":"EI8+1","v":"2155-01-01"},"2156-01-01","2157-01-01","2158-01-01","2159-01-01","2160-01-01","2161-01-01","2162-01-01","2163-01-01","2164-01-01","2165-01-01","2166-01-01","2167-01-01","2168-01-01","2169-01-01","2170-01-01","2171-01-01","2172-01-01","2173-01-01","2174-01-01","2175-01-01","2176-01-01","2177-01-01","2178-01-01","2179-01-01","2180-01-01","2181-01-01","2182-01-01","2183-01-01","2184-01-01","2185-01-01","2186-01-01","2187-01-01","2188-01-01","2189-01-01","2190-01-01","2191-01-01","2192-01-01","2193-01-01","2194-01-01","2195-01-01","2196-01-01","2197-01-01","2198-01-01","2199-01-01","2200-01-01","2201-01-01","2202-01-01","2203-01-01","2204-01-01","2205-01-01","2206-01-01","2207-01-01","2208-01-01","2209-01-01","2210-01-01","2211-01-01","2212-01-01","2213-01-01","2214-01-01","2215-01-01","2216-01-01","2217-01-01","2218-01-01",{"$f":"GU8+1","v":"2219-01-01"},"2220-01-01","2221-01-01","2222-01-01","2223-01-01","2224-01-01","2225-01-01","2226-01-01","2227-01-01","2228-01-01","2229-01-01","2230-01-01","2231-01-01","2232-01-01","2233-01-01","2234-01-01","2235-01-01","2236-01-01","2237-01-01","2238-01-01","2239-01-01","2240-01-01","2241-01-01","2242-01-01","2243-01-01","2244-01-01","2245-01-01","2246-01-01","2247-01-01","2248-01-01","2249-01-01","2250-01-01","2251-01-01","2252-01-01","2253-01-01","2254-01-01","2255-01-01","2256-01-01","2257-01-01","2258-01-01","2259-01-01","2260-01-01","2261-01-01","2262-01-01","2263-01-01","2264-01-01","2265-01-01","2266-01-01","2267-01-01","2268-01-01","2269-01-01","2270-01-01","2271-01-01","2272-01-01","2273-01-01","2274-01-01","2275-01-01"]
[null,null,null,"End of period","Date",null,null,null,"Date",{"$f":"InputC!F7-1","v":"2025-12-31"},{"$f":"EDATE(K7,K6)-1","v":"2026-12-31"},{"$f":"EDATE(L7,L6)-1","v":"2027-12-31"},"2028-12-31","2029-12-31","2030-12-31","2031-12-31","2032-12-31","2033-12-31","2034-12-31","2035-12-31","2036-12-31","2037-12-31","2038-12-31","2039-12-31","2040-12-31","2041-12-31","2042-12-31","2043-12-31","2044-12-31","2045-12-31","2046-12-31","2047-12-31","2048-12-31","2049-12-31","2050-12-31","2051-12-31","2052-12-31","2053-12-31","2054-12-31","2055-12-31","2056-12-31","2057-12-31","2058-12-31","2059-12-31","2060-12-31","2061-12-31","2062-12-31","2063-12-31","2064-12-31","2065-12-31","2066-12-31","2067-12-31","2068-12-31","2069-12-31","2070-12-31","2071-12-31","2072-12-31","2073-12-31","2074-12-31","2075-12-31","2076-12-31","2077-12-31","2078-12-31","2079-12-31","2080-12-31","2081-12-31","2082-12-31","2083-12-31","2084-12-31","2085-12-31","2086-12-31","2087-12-31","2088-12-31","2089-12-31","2090-12-31",{"$f":"EDATE(BX7,BX6)-1","v":"2091-12-31"},"2092-12-31","2093-12-31","2094-12-31","2095-12-31","2096-12-31","2097-12-31","2098-12-31","2099-12-31","2100-12-31","2101-12-31","2102-12-31","2103-12-31","2104-12-31","2105-12-31","2106-12-31","2107-12-31","2108-12-31","2109-12-31","2110-12-31","2111-12-31","2112-12-31","2113-12-31","2114-12-31","2115-12-31","2116-12-31","2117-12-31","2118-12-31","2119-12-31","2120-12-31","2121-12-31","2122-12-31","2123-12-31","2124-12-31","2125-12-31","2126-12-31","2127-12-31","2128-12-31","2129-12-31","2130-12-31","2131-12-31","2132-12-31","2133-12-31","2134-12-31","2135-12-31","2136-12-31","2137-12-31","2138-12-31","2139-12-31","2140-12-31","2141-12-31","2142-12-31","2143-12-31","2144-12-31","2145-12-31","2146-12-31","2147-12-31","2148-12-31","2149-12-31","2150-12-31","2151-12-31","2152-12-31","2153-12-31","2154-12-31",{"$f":"EDATE(EJ7,EJ6)-1","v":"2155-12-31"},"2156-12-31","2157-12-31","2158-12-31","2159-12-31","2160-12-31","2161-12-31","2162-12-31","2163-12-31","2164-12-31","2165-12-31","2166-12-31","2167-12-31","2168-12-31","2169-12-31","2170-12-31","2171-12-31","2172-12-31","2173-12-31","2174-12-31","2175-12-31","2176-12-31","2177-12-31","2178-12-31","2179-12-31","2180-12-31","2181-12-31","2182-12-31","2183-12-31","2184-12-31","2185-12-31","2186-12-31","2187-12-31","2188-12-31","2189-12-31","2190-12-31","2191-12-31","2192-12-31","2193-12-31","2194-12-31","2195-12-31","2196-12-31","2197-12-31","2198-12-31","2199-12-31","2200-12-31","2201-12-31","2202-12-31","2203-12-31","2204-12-31","2205-12-31","2206-12-31","2207-12-31","2208-12-31","2209-12-31","2210-12-31","2211-12-31","2212-12-31","2213-12-31","2214-12-31","2215-12-31","2216-12-31","2217-12-31","2218-12-31",{"$f":"EDATE(GV7,GV6)-1","v":"2219-12-31"},"2220-12-31","2221-12-31","2222-12-31","2223-12-31","2224-12-31","2225-12-31","2226-12-31","2227-12-31","2228-12-31","2229-12-31","2230-12-31","2231-12-31","2232-12-31","2233-12-31","2234-12-31","2235-12-31","2236-12-31","2237-12-31","2238-12-31","2239-12-31","2240-12-31","2241-12-31","2242-12-31","2243-12-31","2244-12-31","2245-12-31","2246-12-31","2247-12-31","2248-12-31","2249-12-31","2250-12-31","2251-12-31","2252-12-31","2253-12-31","2254-12-31","2255-12-31","2256-12-31","2257-12-31","2258-12-31","2259-12-31","2260-12-31","2261-12-31","2262-12-31","2263-12-31","2264-12-31","2265-12-31","2266-12-31","2267-12-31","2268-12-31","2269-12-31","2270-12-31","2271-12-31","2272-12-31","2273-12-31","2274-12-31","2275-12-31"]
[null,null,null,"Operation period","Flag",{"$f":"InputC!F10","v":"2029-01-01"},{"$f":"InputC!F15","v":"2054-01-01"},{"$f":"SUM(K9:XFD9)","v":25},"Flag",null,{"$f":"(AND(K7>=$F$9,K7<$G$9))*1","v":0},{"$f":"(AND(L7>=$F$9,L7<$G$9))*1","v":0},0,1,1,1,1,1,1,1,1,1,1,1,1,1,1,1,1,1,1,1,1,1,1,1,1,1,0,0,0,0,0,0,0,0,0,0,0,0,0,0,0,0,0,0,0,0,0,0,0,0,0,0,0,0,0,0,0,0,0,0,0,0,0,{"$f":"(AND(BX7>=$F$9,BX7<$G$9))*1","v":0},0,0,0,0,0,0,0,0,0,0,0,0,0,0,0,0,0,0,0,0,0,0,0,0,0,0,0,0,0,0,0,0,0,0,0,0,0,0,0,0,0,0,0,0,0,0,0,0,0,0,0,0,0,0,0,0,0,0,0,0,0,0,0,{"$f":"(AND(EJ7>=$F$9,EJ7<$G$9))*1","v":0},0,0,0,0,0,0,0,0,0,0,0,0,0,0,0,0,0,0,0,0,0,0,0,0,0,0,0,0,0,0,0,0,0,0,0,0,0,0,0,0,0,0,0,0,0,0,0,0,0,0,0,0,0,0,0,0,0,0,0,0,0,0,0,{"$f":"(AND(GV7>=$F$9,GV7<$G$9))*1","v":0},0,0,0,0,0,0,0,0,0,0,0,0,0,0,0,0,0,0,0,0,0,0,0,0,0,0,0,0,0,0,0,0,0,0,0,0,0,0,0,0,0,0,0,0,0,0,0,0,0,0,0,0,0,0,0,0]
[null,null,null,"Operating Life in Periods",null,null,null,null,"Counter",null,{"$f":"J10+K9","v":0},{"$f":"K10+L9","v":0},0,1,2,3,4,5,6,7,8,9,10,11,12,13,14,15,16,17,18,19,20,21,22,23,24,25,25,25,25,25,25,25,25,25,25,25,25,25,25,25,25,25,25,25,25,25,25,25,25,25,25,25,25,25,25,25,25,25,25,25,25,25,25,{"$f":"BW10+BX9","v":25},25,25,25,25,25,25,25,25,25,25,25,25,25,25,25,25,25,25,25,25,25,25,25,25,25,25,25,25,25,25,25,25,25,25,25,25,25,25,25,25,25,25,25,25,25,25,25,25,25,25,25,25,25,25,25,25,25,25,25,25,25,25,25,{"$f":"EI10+EJ9","v":25},25,25,25,25,25,25,25,25,25,25,25,25,25,25,25,25,25,25,25,25,25,25,25,25,25,25,25,25,25,25,25,25,25,25,25,25,25,25,25,25,25,25,25,25,25,25,25,25,25,25,25,25,25,25,25,25,25,25,25,25,25,25,25,{"$f":"GU10+GV9","v":25},25,25,25,25,25,25,25,25,25,25,25,25,25,25,25,25,25,25,25,25,25,25,25,25,25,25,25,25,25,25,25,25,25,25,25,25,25,25,25,25,25,25,25,25,25,25,25,25,25,25,25,25,25,25,25,25]
{"$rows_left_out":149}
{"sheet":"Sensitivity","index":3,"n_rows":61,"n_cols":19,"rows_kept":61,"cut":false,"hidden":false,"merged":[]}
[]
[]
[null,"Data Tables"]
[null,null,null,null,null,"Growth",{"$f":"I4/1000","v":0.02},null,20]
[null,null,null,null,null,null,null,null,null,null,null,null,null,null,"IRR Table - Life Sensitivity"]
[]
[null,null,null,null,null,"IRR Table",null,null,null,null,null,null,null,null,null,"EBITDA Sensitivity"]
[null,null,null,null,null,null,{"$f":"'Financial Model'!F29","v":5.563730895519256E-2},50000,70000,100000,125000,150000,null,null,50000,70000,100000,125000,150000]
[null,null,null,null,null,null,15,null,null,null,null,null,null,15,-2.4300788342952725E-2,1.6211369633674623E-2,6.6070535778999337E-2,0.10211679339408875,0.13516836762428286]
[null,null,null,null,null,"Life",30,null,null,null,null,null,"Life",30,3.8702812790870678E-2,6.7082533240318307E-2,0.10392565131187442,0.13203814625740051,0.15893865227699286]
{"$rows_left_out":52}
{"sheet":"Time Series","index":4,"n_rows":224,"n_cols":37,"rows_kept":224,"cut":false,"hidden":false,"merged":[]}
[null,null,null,null,null,null,null,null,{"$f":"_xlfn.FORMULATEXT(I4)","v":"=H4*(1+NORMSINV(RAND())*$E$4)"}]
[null,"Time Period"]
[null,null,"Period",null,null,null,0,1,2,3,4,5,6,7,8,9,10,11,12,13,14,15,16,17,18,19,20,21,22,23,24,25,26,27,28,29,30]
[null,null,"Volatility",null,{"$f":"InputC!F23","v":0},{"$f":"E5","v":0.1},"EBITDA",{"$f":"'Financial Model'!F19","v":100000},{"$f":"H4*(1+NORMSINV(RAND())*$E$4)","v":100000},{"$f":"I4*(1+NORMSINV(RAND())*$E$4)+($H4-I4)*$F$4","v":100000},{"$f":"J4*(1+NORMSINV(RAND())*$E$4)+($H4-J4)*$F$4","v":100000},100000,100000,100000,100000,100000,100000,100000,100000,100000,100000,100000,100000,100000,100000,100000,100000,100000,100000,100000,100000,100000,100000,100000,100000,100000,100000]
[null,null,"Mean Reversion",null,{"$f":"InputC!F24","v":0.1},null,null,1,{"$f":"H5*(I4/H4)","v":1},{"$f":"I5*(J4/I4)","v":1},1,1,1,1,1,1,1,1,1,1,1,1,1,1,1,1,1,1,1,1,1,1,1,1,1,1,1]
[]
[]
[null,null,null,null,null,null,null,null,null,null,null,null,null,null,null,"Default Count",null,{"$f":"COUNTIF(J25:J1048576,\">0\")","v":0}]
[null,null,null,null,null,null,null,null,null,null,null,null,null,null,null,"Total Loss",null,{"$f":"SUM(J25:J1048576)","v":0}]
[null,null,null,null,null,null,null,null,null,null,null,null,null,null,null,"Average Loss",null,{"$f":"R9/E17","v":0}]
{"$rows_left_out":215}
{"sheet":"Simple Rp","index":5,"n_rows":32,"n_cols":8,"rows_kept":32,"cut":false,"hidden":false,"merged":[]}
[]
[null,"Examples"]
[]
[]
[null,null,null,null,null,{"$f":"_xlfn.SEQUENCE(,2,0)","v":0},1]
[null,null,null,null,"Cap Exp",1000]
[null,null,null,null,"EBITDA",0,1100]
[null,null,null,null,"FCF",{"$f":"F7-F6","v":-1000},{"$f":"G7-G6","v":1100}]
[null,null,null,null,"IRR",{"$f":"IRR(F8:G8)","v":0.10000000000000009}]
[null,null,null,null,"RF",0.05]
{"$rows_left_out":23}
{"sheet":"Mean Reversion","index":6,"n_rows":637,"n_cols":67,"rows_kept":637,"cut":false,"hidden":false,"merged":[]}
[]
[null,null,null,null,null,null,null,null,null,null,"Monthly","Monthly",null,null,null,"Annual","Annual",null,null,null,"5-yr","5-yr",null,null,null,null,null,null,null,null,null,null,"Monthly","Monthly",null,null,null,"Annual","Annual",null,null,null,"5-yr","5-yr",null,null,null,null,null,null,null,null,null,null,"Monthly","Monthly",null,null,null,null,"Annual","Annual",null,null,null,"5-Year","5-Year"]
[null,null,null,null,null,null,"Oil Price",null,null,null,{"$f":"_xlfn.STDEV.S(K9:K637)","v":0.12384048259580208},{"$f":"_xlfn.STDEV.S(L9:L637)","v":0.10016574282624846},null,null,null,{"$f":"_xlfn.STDEV.S(P10:P60)","v":0.30471388820911366},{"$f":"_xlfn.STDEV.S(Q10:Q60)","v":0.2762739759982874},null,null,null,{"$f":"_xlfn.STDEV.S(U10:U60)","v":0.52578898650245032},{"$f":"_xlfn.STDEV.S(V10:V60)","v":0.50196754148506428},null,null,null,null,null,null,null,null,null,null,{"$f":"_xlfn.STDEV.S(AG9:AG637)","v":0.1205384154671419},{"$f":"_xlfn.STDEV.S(AH9:AH637)","v":0.12306165111577611},null,null,null,{"$f":"_xlfn.STDEV.S(AL9:AL637)","v":0.46548738826958985},{"$f":"_xlfn.STDEV.S(AM9:AM637)","v":0.36272569371943281},null,null,null,{"$f":"_xlfn.STDEV.S(AQ9:AQ16)","v":2.333338398917761},{"$f":"_xlfn.STDEV.S(AR9:AR16)","v":0.74466749783824637},null,null,null,null,null,null,null,null,null,null,{"$f":"_xlfn.STDEV.S(BC9:BC637)","v":0.19979022174333694},{"$f":"_xlfn.STDEV.S(BD9:BD637)","v":0.19259990298079022},null,null,null,null,{"$f":"_xlfn.STDEV.S(BI9:BI48)","v":0.82028540485021173},{"$f":"_xlfn.STDEV.S(BJ9:BJ48)","v":0.56192960726811447},null,null,null,{"$f":"_xlfn.STDEV.S(BN9:BN13)","v":2.5429714642199661},{"$f":"_xlfn.STDEV.S(BO9:BO13)","v":1.1523591572494469}]
[null,null,null,null,null,null,null,null,null,null,12,12,null,null,null,1,1,null,null,null,{"$f":"1/5","v":0.2},{"$f":"1/5","v":0.2},null,null,null,null,"Apple",null,null,null,null,null,12,12,null,null,null,1,1,null,null,null,{"$f":"1/5","v":0.2},{"$f":"1/5","v":0.2},null,null,null,"Blackberry",null,null,null,null,null,null,12,12,null,null,null,null,1,1,null,null,null,0.2,0.2]
[null,null,null,null,null,null,null,null,null,null,{"$f":"K3*(K4^0.5)","v":0.42899601577955693},{"$f":"L3*(L4^0.5)","v":0.34698431150588022},null,null,null,{"$f":"P3*(P4^0.5)","v":0.30471388820911366},{"$f":"Q3*(Q4^0.5)","v":0.2762739759982874},null,null,null,{"$f":"U3*(U4^0.5)","v":0.23513998312803966},{"$f":"V3*(V4^0.5)","v":0.2244867090518099},null,null,null,null,null,null,null,null,null,null,{"$f":"AG3*(AG4^0.5)","v":0.41755731970587195},{"$f":"AH3*(AH4^0.5)","v":0.42629806439167883},null,null,null,{"$f":"AL3*(AL4^0.5)","v":0.46548738826958985},{"$f":"AM3*(AM4^0.5)","v":0.36272569371943281},null,null,null,{"$f":"AQ3*(AQ4^0.5)","v":1.0435006548981269},{"$f":"AR3*(AR4^0.5)","v":0.33302542916019928},null,null,null,null,null,null,null,null,null,null,{"$f":"BC3*(BC4^0.5)","v":0.69209362982982359},{"$f":"BD3*(BD4^0.5)","v":0.66718563499113015},null,null,null,null,{"$f":"BI3*(BI4^0.5)","v":0.82028540485021173},{"$f":"BJ3*(BJ4^0.5)","v":0.56192960726811447},null,null,null,{"$f":"BN3*(BN4^0.5)","v":1.1372514117676036},{"$f":"BO3*(BO4^0.5)","v":0.51535068202082657}]
[]
[null,null,null,"Year","5-Year","Month 1","Flag","Counter","Nominal","Real","Change","LN Change",null,"Year","Average","Change","LN Change",null,"5-yr","Average","Change","LN Change",null,null,null,"Date","AAPL","Year","5-Year","Month 1","Flag","Counter","Change","LN Change",null,"Year","Average","Change","LN Change",null,null,"Average","Change","LN Change",null,null,null,"Date","BB","Year","5-Year","Month 1","Flag",null,"Change","LN Change",null,null,"Year","Average","Change","LN Change",null,null,"Average","Change","LN Change"]
[null,null,"1973-01-01",{"$f":"YEAR(C8)","v":1973},{"$f":"MOD(D8,5)=0","v":false},{"$f":"MONTH(C8)=1","v":true},{"$f":"AND(F8,E8)","v":false},1,2.08,15.75221457372311,null,null,null,null,null,null,null,null,null,null,null,null,null,null,null,"1985-01-01",9.9341191351413727E-2,{"$f":"YEAR(Z8)","v":1985},{"$f":"MOD(AB8,5)=0","v":true},{"$f":"MONTH(Z8)=1","v":true},{"$f":"AND(AD8,AC8)","v":true},1,null,null,null,1985,{"$f":"AVERAGEIF(AB:AB,AJ8,AA:AA)","v":6.8475597848494843E-2},null,null,null,1,{"$f":"AVERAGEIF(AF:AF,AO8,AA:AA)","v":0.20574217004080614},null,null,null,null,null,"1999-02-01",1.479166984558105,{"$f":"YEAR(AV8)","v":1999},{"$f":"MOD(AX8,5)=0","v":false},{"$f":"MONTH(AV8)=1","v":false},{"$f":"AND(AZ8,AY8)","v":false},{"$f":"BA8+BB7","v":0},null,null,null,null,1999,{"$f":"AVERAGEIF(AX:AX,BG8,AW:AW)","v":4.2140151804143731},null,null,null,1,{"$f":"AVERAGEIF(BB:BB,BL8,AW:AW)","v":9.2176945368448902}]
[null,null,"1973-02-01",1973,false,false,false,{"$f":"H8+G9","v":1},2.08,15.702399254237465,{"$f":"J9/J8-1","v":-3.1624327647710171E-3},{"$f":"LN(J9/J8)","v":-3.1674438228118554E-3},null,1974,{"$f":"AVERAGEIF(D:D,N9,J:J)","v":73.100200565126556},null,null,null,1,{"$f":"AVERAGEIF(H:H,S9,J:J)","v":50.145676898187254},null,null,null,null,null,"1985-02-01",8.4782689809799194E-2,{"$f":"YEAR(Z9)","v":1985},{"$f":"MOD(AB9,5)=0","v":true},{"$f":"MONTH(Z9)=1","v":false},{"$f":"AND(AD9,AC9)","v":false},{"$f":"AF8+AE9","v":1},{"$f":"AA9/AA8-1","v":-0.14655050280315918},{"$f":"LN(AA9/AA8)","v":-0.15846890991387408},null,1986,{"$f":"AVERAGEIF(AB:AB,AJ9,AA:AA)","v":0.11315084435045719},{"$f":"AK9/AK8-1","v":0.65242579700885894},{"$f":"LN(AK9/AK8)","v":0.50224438826129769},null,2,{"$f":"AVERAGEIF(AF:AF,AO9,AA:AA)","v":0.31660672873258588},{"$f":"AP9/AP8-1","v":0.53885189735187144},{"$f":"LN(AP9/AP8)","v":0.43103661718632647},null,null,null,"1999-03-01",1.75,{"$f":"YEAR(AV9)","v":1999},{"$f":"MOD(AX9,5)=0","v":false},{"$f":"MONTH(AV9)=1","v":false},{"$f":"AND(AZ9,AY9)","v":false},{"$f":"BA9+BB8","v":0},{"$f":"AW9/AW8-1","v":0.18309833728664859},{"$f":"LN(AW9/AW8)","v":0.1681367068894995},null,null,2000,{"$f":"AVERAGEIF(AX:AX,BG9,AW:AW)","v":12.510416666666664},{"$f":"BH9/BH8-1","v":1.968764024584384},{"$f":"LN(BH9/BH8)","v":1.0881457128601852},null,2,{"$f":"AVERAGEIF(BB:BB,BL9,AW:AW)","v":57.275111134847002},{"$f":"BM9/BM8-1","v":5.2136048125599537},{"$f":"LN(BM9/BM8)","v":1.8267412126433999}]
[null,null,"1973-03-01",1973,false,false,false,1,2.35,17.674477344131432,{"$f":"J10/J9-1","v":0.12559087678029712},{"$f":"LN(J10/J9)","v":0.11830812157934656},null,1975,64.420270727642858,{"$f":"O10/O9-1","v":-0.11874016446439928},{"$f":"LN(O10/O9)","v":-0.12640276402647913},null,2,{"$f":"AVERAGEIF(H:H,S10,J:J)","v":84.487579725687482},{"$f":"T10/T9-1","v":0.68484274122425237},{"$f":"LN(T10/T9)","v":0.52167223079864022},null,null,null,"1985-03-01",7.5790375471115112E-2,1985,true,false,false,{"$f":"AF9+AE10","v":1},{"$f":"AA10/AA9-1","v":-0.10606309329012054},{"$f":"LN(AA10/AA9)","v":-0.11212008044911838},null,1987,0.2744893568257491,{"$f":"AK10/AK9-1","v":1.4258710432207216},{"$f":"LN(AK10/AK9)","v":0.88619065297576527},null,3,0.25577482345203556,{"$f":"AP10/AP9-1","v":-0.19213712078725431},{"$f":"LN(AP10/AP9)","v":-0.2133629388070071},null,null,null,"1999-04-01",2.03125,1999,false,false,false,0,{"$f":"AW10/AW9-1","v":0.16071428571428581},{"$f":"LN(AW10/AW9)","v":0.14903557916048796},null,null,2001,{"$f":"AVERAGEIF(AX:AX,BG10,AW:AW)","v":4.770833432674408},{"$f":"BH10/BH9-1","v":-0.61865111612261181},{"$f":"LN(BH10/BH9)","v":-0.96404061714321521},null,3,25.368499922752381,{"$f":"BM10/BM9-1","v":-0.55707637366210505},{"$f":"LN(BM10/BM9)","v":-0.81435792484289604}]
{"$rows_left_out":627}